{
  "data_qualities": {
    "quality": [
      {
        "name": "AutoCorrelation",
        "value": "0.8454074074074076"
      },
      {
        "name": "CfsSubsetEval_DecisionStumpAUC",
        "value": []
      },
      {
        "name": "CfsSubsetEval_DecisionStumpErrRate",
        "value": []
      },
      {
        "name": "CfsSubsetEval_DecisionStumpKappa",
        "value": []
      },
      {
        "name": "CfsSubsetEval_NaiveBayesAUC",
        "value": []
      },
      {
        "name": "CfsSubsetEval_NaiveBayesErrRate",
        "value": []
      },
      {
        "name": "CfsSubsetEval_NaiveBayesKappa",
        "value": []
      },
      {
        "name": "CfsSubsetEval_kNN1NAUC",
        "value": []
      },
      {
        "name": "CfsSubsetEval_kNN1NErrRate",
        "value": []
      },
      {
        "name": "CfsSubsetEval_kNN1NKappa",
        "value": []
      },
      {
        "name": "ClassEntropy",
        "value": []
      },
      {
        "name": "DecisionStumpAUC",
        "value": []
      },
      {
        "name": "DecisionStumpErrRate",
        "value": []
      },
      {
        "name": "DecisionStumpKappa",
        "value": []
      },
      {
        "name": "Dimensionality",
        "value": "1.8964879852125693"
      },
      {
        "name": "EquivalentNumberOfAtts",
        "value": []
      },
      {
        "name": "J48.00001.AUC",
        "value": []
      },
      {
        "name": "J48.00001.ErrRate",
        "value": []
      },
      {
        "name": "J48.00001.Kappa",
        "value": []
      },
      {
        "name": "J48.0001.AUC",
        "value": []
      },
      {
        "name": "J48.0001.ErrRate",
        "value": []
      },
      {
        "name": "J48.0001.Kappa",
        "value": []
      },
      {
        "name": "J48.001.AUC",
        "value": []
      },
      {
        "name": "J48.001.ErrRate",
        "value": []
      },
      {
        "name": "J48.001.Kappa",
        "value": []
      },
      {
        "name": "MajorityClassPercentage",
        "value": []
      },
      {
        "name": "MajorityClassSize",
        "value": []
      },
      {
        "name": "MaxAttributeEntropy",
        "value": []
      },
      {
        "name": "MaxKurtosisOfNumericAtts",
        "value": "541.0000000000017"
      },
      {
        "name": "MaxMeansOfNumericAtts",
        "value": "5.323595194085028"
      },
      {
        "name": "MaxMutualInformation",
        "value": []
      },
      {
        "name": "MaxNominalAttDistinctValues",
        "value": []
      },
      {
        "name": "MaxSkewnessOfNumericAtts",
        "value": "23.259406699226655"
      },
      {
        "name": "MaxStdDevOfNumericAtts",
        "value": "0.5004550541019123"
      },
      {
        "name": "MeanAttributeEntropy",
        "value": []
      },
      {
        "name": "MeanKurtosisOfNumericAtts",
        "value": "43.80237559673003"
      },
      {
        "name": "MeanMeansOfNumericAtts",
        "value": "0.06461758261575222"
      },
      {
        "name": "MeanMutualInformation",
        "value": []
      },
      {
        "name": "MeanNoiseToSignalRatio",
        "value": []
      },
      {
        "name": "MeanNominalAttDistinctValues",
        "value": []
      },
      {
        "name": "MeanSkewnessOfNumericAtts",
        "value": "5.8974188592217915"
      },
      {
        "name": "MeanStdDevOfNumericAtts",
        "value": "0.19109113890245785"
      },
      {
        "name": "MinAttributeEntropy",
        "value": []
      },
      {
        "name": "MinKurtosisOfNumericAtts",
        "value": "-2.0073107952078506"
      },
      {
        "name": "MinMeansOfNumericAtts",
        "value": "0.0"
      },
      {
        "name": "MinMutualInformation",
        "value": []
      },
      {
        "name": "MinNominalAttDistinctValues",
        "value": []
      },
      {
        "name": "MinSkewnessOfNumericAtts",
        "value": "-8.06227212343272"
      },
      {
        "name": "MinStdDevOfNumericAtts",
        "value": "0.0"
      },
      {
        "name": "MinorityClassPercentage",
        "value": []
      },
      {
        "name": "MinorityClassSize",
        "value": []
      },
      {
        "name": "NaiveBayesAUC",
        "value": []
      },
      {
        "name": "NaiveBayesErrRate",
        "value": []
      },
      {
        "name": "NaiveBayesKappa",
        "value": []
      },
      {
        "name": "NumberOfBinaryFeatures",
        "value": "0.0"
      },
      {
        "name": "NumberOfClasses",
        "value": "0.0"
      },
      {
        "name": "NumberOfFeatures",
        "value": "1026.0"
      },
      {
        "name": "NumberOfInstances",
        "value": "541.0"
      },
      {
        "name": "NumberOfInstancesWithMissingValues",
        "value": "0.0"
      },
      {
        "name": "NumberOfMissingValues",
        "value": "0.0"
      },
      {
        "name": "NumberOfNumericFeatures",
        "value": "1025.0"
      },
      {
        "name": "NumberOfSymbolicFeatures",
        "value": "1.0"
      },
      {
        "name": "PercentageOfBinaryFeatures",
        "value": "0.0"
      },
      {
        "name": "PercentageOfInstancesWithMissingValues",
        "value": "0.0"
      },
      {
        "name": "PercentageOfMissingValues",
        "value": "0.0"
      },
      {
        "name": "PercentageOfNumericFeatures",
        "value": "99.90253411306043"
      },
      {
        "name": "PercentageOfSymbolicFeatures",
        "value": "0.09746588693957114"
      },
      {
        "name": "Quartile1AttributeEntropy",
        "value": []
      },
      {
        "name": "Quartile1KurtosisOfNumericAtts",
        "value": "13.537792378594007"
      },
      {
        "name": "Quartile1MeansOfNumericAtts",
        "value": "0.016635859519408512"
      },
      {
        "name": "Quartile1MutualInformation",
        "value": []
      },
      {
        "name": "Quartile1SkewnessOfNumericAtts",
        "value": "3.895657310000731"
      },
      {
        "name": "Quartile1StdDevOfNumericAtts",
        "value": "0.1280211011565794"
      },
      {
        "name": "Quartile2AttributeEntropy",
        "value": []
      },
      {
        "name": "Quartile2KurtosisOfNumericAtts",
        "value": "29.122505091449163"
      },
      {
        "name": "Quartile2MeansOfNumericAtts",
        "value": "0.02957486136783737"
      },
      {
        "name": "Quartile2MutualInformation",
        "value": []
      },
      {
        "name": "Quartile2SkewnessOfNumericAtts",
        "value": "5.569098337271683"
      },
      {
        "name": "Quartile2StdDevOfNumericAtts",
        "value": "0.16956809086898625"
      },
      {
        "name": "Quartile3AttributeEntropy",
        "value": []
      },
      {
        "name": "Quartile3KurtosisOfNumericAtts",
        "value": "55.65211410840489"
      },
      {
        "name": "Quartile3MeansOfNumericAtts",
        "value": "0.05545286506469505"
      },
      {
        "name": "Quartile3MutualInformation",
        "value": []
      },
      {
        "name": "Quartile3SkewnessOfNumericAtts",
        "value": "7.579339578559502"
      },
      {
        "name": "Quartile3StdDevOfNumericAtts",
        "value": "0.22725888251916002"
      },
      {
        "name": "REPTreeDepth1AUC",
        "value": []
      },
      {
        "name": "REPTreeDepth1ErrRate",
        "value": []
      },
      {
        "name": "REPTreeDepth1Kappa",
        "value": []
      },
      {
        "name": "REPTreeDepth2AUC",
        "value": []
      },
      {
        "name": "REPTreeDepth2ErrRate",
        "value": []
      },
      {
        "name": "REPTreeDepth2Kappa",
        "value": []
      },
      {
        "name": "REPTreeDepth3AUC",
        "value": []
      },
      {
        "name": "REPTreeDepth3ErrRate",
        "value": []
      },
      {
        "name": "REPTreeDepth3Kappa",
        "value": []
      },
      {
        "name": "RandomTreeDepth1AUC",
        "value": []
      },
      {
        "name": "RandomTreeDepth1ErrRate",
        "value": []
      },
      {
        "name": "RandomTreeDepth1Kappa",
        "value": []
      },
      {
        "name": "RandomTreeDepth2AUC",
        "value": []
      },
      {
        "name": "RandomTreeDepth2ErrRate",
        "value": []
      },
      {
        "name": "RandomTreeDepth2Kappa",
        "value": []
      },
      {
        "name": "RandomTreeDepth3AUC",
        "value": []
      },
      {
        "name": "RandomTreeDepth3ErrRate",
        "value": []
      },
      {
        "name": "RandomTreeDepth3Kappa",
        "value": []
      },
      {
        "name": "StdvNominalAttDistinctValues",
        "value": []
      },
      {
        "name": "kNN1NAUC",
        "value": []
      },
      {
        "name": "kNN1NErrRate",
        "value": []
      },
      {
        "name": "kNN1NKappa",
        "value": []
      }
    ]
  }
}