{
  "data_features": {
    "feature": [
      {
        "data_type": "nominal",
        "index": "0",
        "is_ignore": "false",
        "is_row_identifier": "true",
        "is_target": "false",
        "name": "molecule_id",
        "nominal_value": [
          "CHEMBL1200512",
          "CHEMBL1300713",
          "CHEMBL1302818",
          "CHEMBL1304187",
          "CHEMBL1305435",
          "CHEMBL1306377",
          "CHEMBL1307972",
          "CHEMBL1309164",
          "CHEMBL1309254",
          "CHEMBL1310435",
          "CHEMBL1316462",
          "CHEMBL1318140",
          "CHEMBL1318520",
          "CHEMBL1323722",
          "CHEMBL1323983",
          "CHEMBL132431",
          "CHEMBL1325021",
          "CHEMBL1327038",
          "CHEMBL1329069",
          "CHEMBL1331226",
          "CHEMBL1337807",
          "CHEMBL1339283",
          "CHEMBL1339546",
          "CHEMBL1339694",
          "CHEMBL1340423",
          "CHEMBL1341317",
          "CHEMBL1345229",
          "CHEMBL1347672",
          "CHEMBL1348955",
          "CHEMBL1350077",
          "CHEMBL1352064",
          "CHEMBL1355544",
          "CHEMBL1366319",
          "CHEMBL1367428",
          "CHEMBL1368216",
          "CHEMBL1368708",
          "CHEMBL1370927",
          "CHEMBL1372451",
          "CHEMBL1372654",
          "CHEMBL1372947",
          "CHEMBL1373969",
          "CHEMBL1375217",
          "CHEMBL1378385",
          "CHEMBL1380143",
          "CHEMBL1380630",
          "CHEMBL1383315",
          "CHEMBL1385327",
          "CHEMBL1387923",
          "CHEMBL1393156",
          "CHEMBL1393412",
          "CHEMBL1396943",
          "CHEMBL1398705",
          "CHEMBL1399772",
          "CHEMBL1399858",
          "CHEMBL1400374",
          "CHEMBL1400379",
          "CHEMBL1406398",
          "CHEMBL1406616",
          "CHEMBL1409060",
          "CHEMBL1411648",
          "CHEMBL1412284",
          "CHEMBL1412433",
          "CHEMBL1412573",
          "CHEMBL1413003",
          "CHEMBL1413178",
          "CHEMBL1418980",
          "CHEMBL1421321",
          "CHEMBL1421781",
          "CHEMBL1427335",
          "CHEMBL1438505",
          "CHEMBL1438559",
          "CHEMBL1440409",
          "CHEMBL1440892",
          "CHEMBL1443177",
          "CHEMBL1444434",
          "CHEMBL1445386",
          "CHEMBL1452295",
          "CHEMBL1453181",
          "CHEMBL1453780",
          "CHEMBL1456725",
          "CHEMBL1457927",
          "CHEMBL1461035",
          "CHEMBL1462756",
          "CHEMBL1464490",
          "CHEMBL1465978",
          "CHEMBL1466076",
          "CHEMBL1467678",
          "CHEMBL1469670",
          "CHEMBL1469961",
          "CHEMBL1471916",
          "CHEMBL1475299",
          "CHEMBL1479201",
          "CHEMBL1480880",
          "CHEMBL1480936",
          "CHEMBL1481928",
          "CHEMBL1484503",
          "CHEMBL1486651",
          "CHEMBL1487723",
          "CHEMBL1487959",
          "CHEMBL1488229",
          "CHEMBL1490392",
          "CHEMBL1491703",
          "CHEMBL1494091",
          "CHEMBL1494764",
          "CHEMBL1502254",
          "CHEMBL1504109",
          "CHEMBL1507740",
          "CHEMBL1508246",
          "CHEMBL1508267",
          "CHEMBL1511273",
          "CHEMBL1511754",
          "CHEMBL1515941",
          "CHEMBL1516127",
          "CHEMBL1517605",
          "CHEMBL1525654",
          "CHEMBL1528507",
          "CHEMBL1528660",
          "CHEMBL1529280",
          "CHEMBL1534546",
          "CHEMBL1535999",
          "CHEMBL1540237",
          "CHEMBL1542260",
          "CHEMBL1542543",
          "CHEMBL1544409",
          "CHEMBL1546346",
          "CHEMBL1549424",
          "CHEMBL1549657",
          "CHEMBL1555905",
          "CHEMBL1557219",
          "CHEMBL1558455",
          "CHEMBL1562983",
          "CHEMBL1563358",
          "CHEMBL1564670",
          "CHEMBL1566908",
          "CHEMBL1568789",
          "CHEMBL1571037",
          "CHEMBL1572233",
          "CHEMBL1577792",
          "CHEMBL1580065",
          "CHEMBL1583698",
          "CHEMBL1584716",
          "CHEMBL1585209",
          "CHEMBL1585705",
          "CHEMBL1595937",
          "CHEMBL1597286",
          "CHEMBL1597726",
          "CHEMBL1600535",
          "CHEMBL1605666",
          "CHEMBL1608402",
          "CHEMBL1610875",
          "CHEMBL1611106",
          "CHEMBL1612097",
          "CHEMBL1612809",
          "CHEMBL1699187",
          "CHEMBL1700017",
          "CHEMBL1703566",
          "CHEMBL1703638",
          "CHEMBL1705854",
          "CHEMBL1706512",
          "CHEMBL1708331",
          "CHEMBL1708715",
          "CHEMBL1709889",
          "CHEMBL1713127",
          "CHEMBL1713613",
          "CHEMBL1717026",
          "CHEMBL1717403",
          "CHEMBL1719626",
          "CHEMBL1721357",
          "CHEMBL1723814",
          "CHEMBL1724732",
          "CHEMBL1728248",
          "CHEMBL1729353",
          "CHEMBL1730950",
          "CHEMBL1733772",
          "CHEMBL1735689",
          "CHEMBL1736199",
          "CHEMBL1808264",
          "CHEMBL1866510",
          "CHEMBL1875320",
          "CHEMBL1877372",
          "CHEMBL1881832",
          "CHEMBL1882211",
          "CHEMBL1885633",
          "CHEMBL1888871",
          "CHEMBL1893675",
          "CHEMBL1896348",
          "CHEMBL1899898",
          "CHEMBL1903362",
          "CHEMBL1965376",
          "CHEMBL1965433",
          "CHEMBL1965654",
          "CHEMBL1967019",
          "CHEMBL1967149",
          "CHEMBL1969300",
          "CHEMBL1972216",
          "CHEMBL1972217",
          "CHEMBL1974053",
          "CHEMBL1974180",
          "CHEMBL1975006",
          "CHEMBL1975487",
          "CHEMBL1976374",
          "CHEMBL1980684",
          "CHEMBL1980848",
          "CHEMBL1983418",
          "CHEMBL1985010",
          "CHEMBL1985459",
          "CHEMBL1985479",
          "CHEMBL1987516",
          "CHEMBL1992109",
          "CHEMBL1992293",
          "CHEMBL1993555",
          "CHEMBL1993707",
          "CHEMBL1994902",
          "CHEMBL1995593",
          "CHEMBL1995641",
          "CHEMBL1996281",
          "CHEMBL1996902",
          "CHEMBL1997249",
          "CHEMBL2000559",
          "CHEMBL2000752",
          "CHEMBL2001316",
          "CHEMBL2001670",
          "CHEMBL2004809",
          "CHEMBL2005690",
          "CHEMBL2007313",
          "CHEMBL2028187",
          "CHEMBL34259",
          "CHEMBL356169",
          "CHEMBL426",
          "CHEMBL428909",
          "CHEMBL44657",
          "CHEMBL479368",
          "CHEMBL485636",
          "CHEMBL494325",
          "CHEMBL533226",
          "CHEMBL565657",
          "CHEMBL576412",
          "CHEMBL587564",
          "CHEMBL59530",
          "CHEMBL78",
          "CHEMBL803"
        ],
        "number_of_missing_values": "0"
      },
      {
        "data_type": "numeric",
        "index": "1",
        "is_ignore": "false",
        "is_row_identifier": "false",
        "is_target": "false",
        "name": "AMW",
        "number_of_missing_values": "0"
      },
      {
        "data_type": "numeric",
        "index": "2",
        "is_ignore": "false",
        "is_row_identifier": "false",
        "is_target": "false",
        "name": "C.",
        "number_of_missing_values": "0"
      },
      {
        "data_type": "numeric",
        "index": "3",
        "is_ignore": "false",
        "is_row_identifier": "false",
        "is_target": "true",
        "name": "pXC50",
        "number_of_missing_values": "0"
      }
    ]
  }
}