{
  "data_features": {
    "feature": [
      {
        "data_type": "nominal",
        "index": "0",
        "is_ignore": "false",
        "is_row_identifier": "true",
        "is_target": "false",
        "name": "molecule_id",
        "nominal_value": [
          "CHEMBL10047",
          "CHEMBL1080481",
          "CHEMBL1083034",
          "CHEMBL1090247",
          "CHEMBL1092275",
          "CHEMBL1092276",
          "CHEMBL1092277",
          "CHEMBL1093560",
          "CHEMBL1093561",
          "CHEMBL1093684",
          "CHEMBL1093868",
          "CHEMBL1093869",
          "CHEMBL1093901",
          "CHEMBL1093902",
          "CHEMBL1093987",
          "CHEMBL1161889",
          "CHEMBL1169452",
          "CHEMBL1169453",
          "CHEMBL1209431",
          "CHEMBL1257156",
          "CHEMBL1257273",
          "CHEMBL1257274",
          "CHEMBL1257395",
          "CHEMBL1257396",
          "CHEMBL1257503",
          "CHEMBL1257504",
          "CHEMBL1257505",
          "CHEMBL1258436",
          "CHEMBL1258544",
          "CHEMBL1258545",
          "CHEMBL1258658",
          "CHEMBL1258773",
          "CHEMBL1258893",
          "CHEMBL126608",
          "CHEMBL1289112",
          "CHEMBL1289113",
          "CHEMBL1289114",
          "CHEMBL1289232",
          "CHEMBL1289233",
          "CHEMBL1289347",
          "CHEMBL1289348",
          "CHEMBL1289349",
          "CHEMBL1289465",
          "CHEMBL1289466",
          "CHEMBL1289574",
          "CHEMBL1289575",
          "CHEMBL1289626",
          "CHEMBL1289681",
          "CHEMBL1289682",
          "CHEMBL1289784",
          "CHEMBL1289785",
          "CHEMBL1289786",
          "CHEMBL1289894",
          "CHEMBL1289895",
          "CHEMBL1290008",
          "CHEMBL1290009",
          "CHEMBL1290108",
          "CHEMBL1290109",
          "CHEMBL1290217",
          "CHEMBL1290218",
          "CHEMBL1290330",
          "CHEMBL1290331",
          "CHEMBL1290332",
          "CHEMBL1290441",
          "CHEMBL1290442",
          "CHEMBL1290443",
          "CHEMBL1290444",
          "CHEMBL1290547",
          "CHEMBL1290548",
          "CHEMBL1290549",
          "CHEMBL1290668",
          "CHEMBL1290669",
          "CHEMBL1290670",
          "CHEMBL1290786",
          "CHEMBL1290787",
          "CHEMBL1290788",
          "CHEMBL1348198",
          "CHEMBL1428707",
          "CHEMBL1451902",
          "CHEMBL1466899",
          "CHEMBL1487967",
          "CHEMBL1616372",
          "CHEMBL1630057",
          "CHEMBL1630058",
          "CHEMBL1630059",
          "CHEMBL1630060",
          "CHEMBL1630061",
          "CHEMBL1630062",
          "CHEMBL1630063",
          "CHEMBL1630064",
          "CHEMBL1630065",
          "CHEMBL1630066",
          "CHEMBL1630067",
          "CHEMBL1630068",
          "CHEMBL1630069",
          "CHEMBL1630070",
          "CHEMBL1630071",
          "CHEMBL1630072",
          "CHEMBL1630073",
          "CHEMBL1630074",
          "CHEMBL1630075",
          "CHEMBL1630076",
          "CHEMBL1630077",
          "CHEMBL1630078",
          "CHEMBL1630079",
          "CHEMBL1630080",
          "CHEMBL1630081",
          "CHEMBL1672435",
          "CHEMBL1672436",
          "CHEMBL1672438",
          "CHEMBL1672439",
          "CHEMBL1672440",
          "CHEMBL1672441",
          "CHEMBL1672442",
          "CHEMBL1672443",
          "CHEMBL1672444",
          "CHEMBL1672535",
          "CHEMBL1672536",
          "CHEMBL1672537",
          "CHEMBL1672538",
          "CHEMBL1672539",
          "CHEMBL1681799",
          "CHEMBL1681814",
          "CHEMBL1682789",
          "CHEMBL1682790",
          "CHEMBL1682791",
          "CHEMBL1682792",
          "CHEMBL1682793",
          "CHEMBL1682794",
          "CHEMBL1682795",
          "CHEMBL1682796",
          "CHEMBL1682797",
          "CHEMBL1682798",
          "CHEMBL1682799",
          "CHEMBL1682800",
          "CHEMBL1682801",
          "CHEMBL1682802",
          "CHEMBL1682803",
          "CHEMBL1682804",
          "CHEMBL1682805",
          "CHEMBL1682806",
          "CHEMBL1682807",
          "CHEMBL1682808",
          "CHEMBL1682809",
          "CHEMBL1682810",
          "CHEMBL1682811",
          "CHEMBL1682812",
          "CHEMBL1682813",
          "CHEMBL1682814",
          "CHEMBL1682815",
          "CHEMBL1682816",
          "CHEMBL1682817",
          "CHEMBL1682818",
          "CHEMBL1682819",
          "CHEMBL1682820",
          "CHEMBL1682821",
          "CHEMBL1682822",
          "CHEMBL1682823",
          "CHEMBL1682824",
          "CHEMBL1682825",
          "CHEMBL1682826",
          "CHEMBL1682827",
          "CHEMBL1682828",
          "CHEMBL1682829",
          "CHEMBL1682830",
          "CHEMBL1682831",
          "CHEMBL1682832",
          "CHEMBL1682833",
          "CHEMBL1682834",
          "CHEMBL1682835",
          "CHEMBL1682836",
          "CHEMBL1684100",
          "CHEMBL1684101",
          "CHEMBL1684102",
          "CHEMBL1684103",
          "CHEMBL1684104",
          "CHEMBL1684105",
          "CHEMBL1684106",
          "CHEMBL1684107",
          "CHEMBL1684108",
          "CHEMBL1684109",
          "CHEMBL1684110",
          "CHEMBL1684111",
          "CHEMBL1684112",
          "CHEMBL1684113",
          "CHEMBL1684114",
          "CHEMBL1684115",
          "CHEMBL1684116",
          "CHEMBL1684117",
          "CHEMBL1684118",
          "CHEMBL1684119",
          "CHEMBL1684120",
          "CHEMBL1684121",
          "CHEMBL1684122",
          "CHEMBL1684123",
          "CHEMBL1684231",
          "CHEMBL1684232",
          "CHEMBL1684233",
          "CHEMBL1684234",
          "CHEMBL1684235",
          "CHEMBL1684236",
          "CHEMBL1684237",
          "CHEMBL1684238",
          "CHEMBL1684239",
          "CHEMBL1684240",
          "CHEMBL1684241",
          "CHEMBL1684242",
          "CHEMBL1688366",
          "CHEMBL1688377",
          "CHEMBL1705644",
          "CHEMBL1770167",
          "CHEMBL1771614",
          "CHEMBL1771615",
          "CHEMBL1771616",
          "CHEMBL1771617",
          "CHEMBL1771618",
          "CHEMBL1771619",
          "CHEMBL1771620",
          "CHEMBL1771621",
          "CHEMBL1771622",
          "CHEMBL1771623",
          "CHEMBL1771624",
          "CHEMBL1771625",
          "CHEMBL1771626",
          "CHEMBL1771644",
          "CHEMBL1771645",
          "CHEMBL1771646",
          "CHEMBL1771647",
          "CHEMBL1771648",
          "CHEMBL1771649",
          "CHEMBL1771650",
          "CHEMBL1771651",
          "CHEMBL1771654",
          "CHEMBL1771655",
          "CHEMBL1771670",
          "CHEMBL1771671",
          "CHEMBL1771672",
          "CHEMBL1771673",
          "CHEMBL1771674",
          "CHEMBL1771675",
          "CHEMBL1771676",
          "CHEMBL1771677",
          "CHEMBL1771678",
          "CHEMBL1771679",
          "CHEMBL1771680",
          "CHEMBL1771681",
          "CHEMBL1771682",
          "CHEMBL1771683",
          "CHEMBL1771684",
          "CHEMBL1771685",
          "CHEMBL1771687",
          "CHEMBL1771688",
          "CHEMBL1771689",
          "CHEMBL1771690",
          "CHEMBL1771691",
          "CHEMBL1771692",
          "CHEMBL1771693",
          "CHEMBL1771694",
          "CHEMBL1771695",
          "CHEMBL1771696",
          "CHEMBL1779843",
          "CHEMBL1779844",
          "CHEMBL1779845",
          "CHEMBL1779846",
          "CHEMBL1779847",
          "CHEMBL1779848",
          "CHEMBL1779849",
          "CHEMBL1779850",
          "CHEMBL1779851",
          "CHEMBL1779852",
          "CHEMBL1779853",
          "CHEMBL1779854",
          "CHEMBL1779855",
          "CHEMBL1779856",
          "CHEMBL1779857",
          "CHEMBL1779858",
          "CHEMBL1779859",
          "CHEMBL1779860",
          "CHEMBL1779861",
          "CHEMBL1779862",
          "CHEMBL1779863",
          "CHEMBL1779864",
          "CHEMBL1779865",
          "CHEMBL1779866",
          "CHEMBL1779867",
          "CHEMBL1779868",
          "CHEMBL1779869",
          "CHEMBL1779870",
          "CHEMBL1779871",
          "CHEMBL1779872",
          "CHEMBL1779873",
          "CHEMBL1779874",
          "CHEMBL1779875",
          "CHEMBL1779876",
          "CHEMBL1779877",
          "CHEMBL1779878",
          "CHEMBL1779879",
          "CHEMBL1779880",
          "CHEMBL1779881",
          "CHEMBL1779882",
          "CHEMBL1779883",
          "CHEMBL1779884",
          "CHEMBL1779885",
          "CHEMBL1779886",
          "CHEMBL1779887",
          "CHEMBL1779888",
          "CHEMBL1779889",
          "CHEMBL1779992",
          "CHEMBL178328",
          "CHEMBL1783858",
          "CHEMBL1783859",
          "CHEMBL1783860",
          "CHEMBL1783861",
          "CHEMBL1783862",
          "CHEMBL1783863",
          "CHEMBL1783864",
          "CHEMBL1783865",
          "CHEMBL1783866",
          "CHEMBL1783867",
          "CHEMBL1783868",
          "CHEMBL1783869",
          "CHEMBL1783870",
          "CHEMBL1783871",
          "CHEMBL1783872",
          "CHEMBL1783873",
          "CHEMBL1783874",
          "CHEMBL1783875",
          "CHEMBL1783876",
          "CHEMBL1783976",
          "CHEMBL1783977",
          "CHEMBL1783978",
          "CHEMBL1783979",
          "CHEMBL1783980",
          "CHEMBL1783981",
          "CHEMBL1783982",
          "CHEMBL1783983",
          "CHEMBL1783984",
          "CHEMBL1783985",
          "CHEMBL1783986",
          "CHEMBL1783987",
          "CHEMBL1783988",
          "CHEMBL1783989",
          "CHEMBL1784048",
          "CHEMBL1784049",
          "CHEMBL1784050",
          "CHEMBL1784051",
          "CHEMBL1784052",
          "CHEMBL1784053",
          "CHEMBL1784054",
          "CHEMBL1784055",
          "CHEMBL1784056",
          "CHEMBL1784057",
          "CHEMBL1784058",
          "CHEMBL1784059",
          "CHEMBL1784060",
          "CHEMBL1784061",
          "CHEMBL1784062",
          "CHEMBL1784063",
          "CHEMBL1784064",
          "CHEMBL1784065",
          "CHEMBL1784066",
          "CHEMBL1784067",
          "CHEMBL1784068",
          "CHEMBL1784069",
          "CHEMBL1784070",
          "CHEMBL1784071",
          "CHEMBL1784072",
          "CHEMBL1784073",
          "CHEMBL1784074",
          "CHEMBL1784075",
          "CHEMBL1784076",
          "CHEMBL1784077",
          "CHEMBL1784078",
          "CHEMBL1784099",
          "CHEMBL1784100",
          "CHEMBL1784101",
          "CHEMBL1784102",
          "CHEMBL1784103",
          "CHEMBL1784104",
          "CHEMBL1784105",
          "CHEMBL1784106",
          "CHEMBL178530",
          "CHEMBL178683",
          "CHEMBL178841",
          "CHEMBL178854",
          "CHEMBL179387",
          "CHEMBL1806522",
          "CHEMBL180713",
          "CHEMBL1808866",
          "CHEMBL1808867",
          "CHEMBL1808868",
          "CHEMBL1808869",
          "CHEMBL1808870",
          "CHEMBL1808871",
          "CHEMBL1808872",
          "CHEMBL1808873",
          "CHEMBL1808874",
          "CHEMBL1808875",
          "CHEMBL1808876",
          "CHEMBL1808877",
          "CHEMBL1808878",
          "CHEMBL1808879",
          "CHEMBL1808880",
          "CHEMBL1808881",
          "CHEMBL1808882",
          "CHEMBL1808883",
          "CHEMBL1808884",
          "CHEMBL1808885",
          "CHEMBL1808886",
          "CHEMBL1808887",
          "CHEMBL1808888",
          "CHEMBL1808889",
          "CHEMBL1808890",
          "CHEMBL1808891",
          "CHEMBL1808892",
          "CHEMBL1808893",
          "CHEMBL1808894",
          "CHEMBL1808895",
          "CHEMBL1808896",
          "CHEMBL1808897",
          "CHEMBL1808898",
          "CHEMBL1808899",
          "CHEMBL1808900",
          "CHEMBL1808901",
          "CHEMBL180964",
          "CHEMBL181169",
          "CHEMBL181332",
          "CHEMBL181411",
          "CHEMBL181424",
          "CHEMBL181610",
          "CHEMBL181769",
          "CHEMBL181915",
          "CHEMBL182130",
          "CHEMBL182558",
          "CHEMBL182762",
          "CHEMBL182771",
          "CHEMBL182950",
          "CHEMBL182973",
          "CHEMBL1830698",
          "CHEMBL1830707",
          "CHEMBL1830711",
          "CHEMBL183081",
          "CHEMBL183230",
          "CHEMBL183608",
          "CHEMBL183864",
          "CHEMBL184047",
          "CHEMBL184077",
          "CHEMBL184337",
          "CHEMBL184519",
          "CHEMBL184668",
          "CHEMBL184691",
          "CHEMBL184821",
          "CHEMBL184822",
          "CHEMBL184995",
          "CHEMBL185078",
          "CHEMBL185365",
          "CHEMBL185701",
          "CHEMBL185813",
          "CHEMBL185829",
          "CHEMBL185884",
          "CHEMBL185946",
          "CHEMBL186075",
          "CHEMBL186089",
          "CHEMBL186127",
          "CHEMBL186133",
          "CHEMBL186151",
          "CHEMBL186212",
          "CHEMBL186220",
          "CHEMBL186331",
          "CHEMBL186378",
          "CHEMBL186507",
          "CHEMBL186521",
          "CHEMBL186571",
          "CHEMBL186573",
          "CHEMBL186581",
          "CHEMBL186660",
          "CHEMBL186666",
          "CHEMBL186744",
          "CHEMBL186788",
          "CHEMBL186835",
          "CHEMBL186864",
          "CHEMBL186917",
          "CHEMBL186987",
          "CHEMBL187019",
          "CHEMBL187075",
          "CHEMBL187091",
          "CHEMBL187107",
          "CHEMBL187242",
          "CHEMBL187246",
          "CHEMBL187269",
          "CHEMBL187320",
          "CHEMBL187328",
          "CHEMBL187417",
          "CHEMBL187470",
          "CHEMBL187746",
          "CHEMBL188725",
          "CHEMBL188871",
          "CHEMBL188911",
          "CHEMBL189389",
          "CHEMBL189572",
          "CHEMBL189808",
          "CHEMBL190084",
          "CHEMBL190270",
          "CHEMBL190326",
          "CHEMBL190504",
          "CHEMBL191039",
          "CHEMBL191147",
          "CHEMBL194051",
          "CHEMBL194197",
          "CHEMBL194246",
          "CHEMBL194407",
          "CHEMBL194507",
          "CHEMBL194508",
          "CHEMBL194538",
          "CHEMBL194743",
          "CHEMBL195019",
          "CHEMBL1951658",
          "CHEMBL1951659",
          "CHEMBL1951660",
          "CHEMBL1951661",
          "CHEMBL1951662",
          "CHEMBL1951663",
          "CHEMBL1951664",
          "CHEMBL1951665",
          "CHEMBL1951666",
          "CHEMBL1951667",
          "CHEMBL1951668",
          "CHEMBL1951669",
          "CHEMBL195932",
          "CHEMBL195944",
          "CHEMBL195965",
          "CHEMBL196054",
          "CHEMBL196203",
          "CHEMBL196224",
          "CHEMBL196343",
          "CHEMBL196536",
          "CHEMBL196574",
          "CHEMBL196643",
          "CHEMBL196674",
          "CHEMBL197212",
          "CHEMBL197692",
          "CHEMBL197724",
          "CHEMBL197927",
          "CHEMBL197954",
          "CHEMBL198093",
          "CHEMBL198145",
          "CHEMBL198180",
          "CHEMBL198209",
          "CHEMBL198272",
          "CHEMBL198305",
          "CHEMBL198428",
          "CHEMBL198715",
          "CHEMBL198757",
          "CHEMBL198824",
          "CHEMBL198866",
          "CHEMBL199047",
          "CHEMBL199193",
          "CHEMBL201068",
          "CHEMBL201101",
          "CHEMBL2011870",
          "CHEMBL2011872",
          "CHEMBL2011873",
          "CHEMBL2011874",
          "CHEMBL2011875",
          "CHEMBL2011876",
          "CHEMBL2011877",
          "CHEMBL2011878",
          "CHEMBL2011879",
          "CHEMBL2011880",
          "CHEMBL201727",
          "CHEMBL201771",
          "CHEMBL201774",
          "CHEMBL201781",
          "CHEMBL201787",
          "CHEMBL201827",
          "CHEMBL201828",
          "CHEMBL201857",
          "CHEMBL201939",
          "CHEMBL201943",
          "CHEMBL201974",
          "CHEMBL202002",
          "CHEMBL202003",
          "CHEMBL202041",
          "CHEMBL202042",
          "CHEMBL202051",
          "CHEMBL202075",
          "CHEMBL202116",
          "CHEMBL202124",
          "CHEMBL202125",
          "CHEMBL202130",
          "CHEMBL2021372",
          "CHEMBL202203",
          "CHEMBL2022158",
          "CHEMBL2022159",
          "CHEMBL2022160",
          "CHEMBL2022161",
          "CHEMBL2022162",
          "CHEMBL2022163",
          "CHEMBL2022164",
          "CHEMBL2022165",
          "CHEMBL2022166",
          "CHEMBL2022167",
          "CHEMBL2022168",
          "CHEMBL2022169",
          "CHEMBL2022170",
          "CHEMBL2022171",
          "CHEMBL202277",
          "CHEMBL202307",
          "CHEMBL202323",
          "CHEMBL202331",
          "CHEMBL2024085",
          "CHEMBL202436",
          "CHEMBL202523",
          "CHEMBL202610",
          "CHEMBL202619",
          "CHEMBL202794",
          "CHEMBL202802",
          "CHEMBL202845",
          "CHEMBL202908",
          "CHEMBL203026",
          "CHEMBL203566",
          "CHEMBL203713",
          "CHEMBL203720",
          "CHEMBL204062",
          "CHEMBL204115",
          "CHEMBL204116",
          "CHEMBL204201",
          "CHEMBL204202",
          "CHEMBL204289",
          "CHEMBL204299",
          "CHEMBL204354",
          "CHEMBL204392",
          "CHEMBL204404",
          "CHEMBL204445",
          "CHEMBL204799",
          "CHEMBL204950",
          "CHEMBL205032",
          "CHEMBL205046",
          "CHEMBL205146",
          "CHEMBL205160",
          "CHEMBL205310",
          "CHEMBL205391",
          "CHEMBL205571",
          "CHEMBL205576",
          "CHEMBL205606",
          "CHEMBL205705",
          "CHEMBL206032",
          "CHEMBL206296",
          "CHEMBL2063423",
          "CHEMBL206372",
          "CHEMBL206422",
          "CHEMBL206427",
          "CHEMBL206579",
          "CHEMBL2069371",
          "CHEMBL2069372",
          "CHEMBL2069373",
          "CHEMBL2069374",
          "CHEMBL2069375",
          "CHEMBL2069376",
          "CHEMBL2069377",
          "CHEMBL2069378",
          "CHEMBL2069379",
          "CHEMBL2069380",
          "CHEMBL2069381",
          "CHEMBL2069382",
          "CHEMBL2069383",
          "CHEMBL2069384",
          "CHEMBL2069385",
          "CHEMBL2069386",
          "CHEMBL2069387",
          "CHEMBL2069388",
          "CHEMBL2069389",
          "CHEMBL2069392",
          "CHEMBL2069393",
          "CHEMBL2069394",
          "CHEMBL2069395",
          "CHEMBL2069396",
          "CHEMBL2069397",
          "CHEMBL2069398",
          "CHEMBL206998",
          "CHEMBL207021",
          "CHEMBL207097",
          "CHEMBL2071568",
          "CHEMBL2071569",
          "CHEMBL2071570",
          "CHEMBL2071571",
          "CHEMBL2071572",
          "CHEMBL2071573",
          "CHEMBL2071574",
          "CHEMBL2071575",
          "CHEMBL2071576",
          "CHEMBL2071577",
          "CHEMBL2071578",
          "CHEMBL2071579",
          "CHEMBL2071580",
          "CHEMBL2071581",
          "CHEMBL2071582",
          "CHEMBL2071583",
          "CHEMBL207703",
          "CHEMBL207733",
          "CHEMBL207744",
          "CHEMBL208163",
          "CHEMBL208314",
          "CHEMBL208326",
          "CHEMBL208351",
          "CHEMBL208391",
          "CHEMBL208505",
          "CHEMBL208506",
          "CHEMBL208730",
          "CHEMBL208731",
          "CHEMBL208781",
          "CHEMBL208927",
          "CHEMBL208976",
          "CHEMBL210550",
          "CHEMBL2112677",
          "CHEMBL2113099",
          "CHEMBL2113100",
          "CHEMBL211801",
          "CHEMBL212018",
          "CHEMBL212129",
          "CHEMBL212130",
          "CHEMBL212529",
          "CHEMBL212724",
          "CHEMBL212834",
          "CHEMBL213001",
          "CHEMBL213102",
          "CHEMBL213220",
          "CHEMBL213254",
          "CHEMBL213344",
          "CHEMBL213967",
          "CHEMBL213985",
          "CHEMBL214094",
          "CHEMBL214218",
          "CHEMBL214236",
          "CHEMBL214538",
          "CHEMBL214542",
          "CHEMBL214640",
          "CHEMBL214823",
          "CHEMBL214874",
          "CHEMBL214875",
          "CHEMBL215058",
          "CHEMBL215097",
          "CHEMBL215098",
          "CHEMBL2151045",
          "CHEMBL215120",
          "CHEMBL2151465",
          "CHEMBL2151466",
          "CHEMBL2151467",
          "CHEMBL2151468",
          "CHEMBL2151469",
          "CHEMBL2151470",
          "CHEMBL2151471",
          "CHEMBL2151472",
          "CHEMBL2151473",
          "CHEMBL2151474",
          "CHEMBL2151475",
          "CHEMBL2151476",
          "CHEMBL2151477",
          "CHEMBL2151478",
          "CHEMBL2151479",
          "CHEMBL2151480",
          "CHEMBL2151481",
          "CHEMBL2151482",
          "CHEMBL2151483",
          "CHEMBL2151484",
          "CHEMBL2151485",
          "CHEMBL2151486",
          "CHEMBL2151487",
          "CHEMBL2151488",
          "CHEMBL2151489",
          "CHEMBL215149",
          "CHEMBL2151490",
          "CHEMBL2151491",
          "CHEMBL2151492",
          "CHEMBL2151493",
          "CHEMBL2151494",
          "CHEMBL2151495",
          "CHEMBL2151496",
          "CHEMBL2151497",
          "CHEMBL2151498",
          "CHEMBL2151499",
          "CHEMBL2151500",
          "CHEMBL2151501",
          "CHEMBL2151502",
          "CHEMBL2151616",
          "CHEMBL2151617",
          "CHEMBL2151618",
          "CHEMBL2151619",
          "CHEMBL2151620",
          "CHEMBL2151621",
          "CHEMBL2151622",
          "CHEMBL2151623",
          "CHEMBL2151624",
          "CHEMBL2151625",
          "CHEMBL2151626",
          "CHEMBL2151627",
          "CHEMBL2151628",
          "CHEMBL2151629",
          "CHEMBL2151630",
          "CHEMBL2151631",
          "CHEMBL2151632",
          "CHEMBL2151633",
          "CHEMBL2151634",
          "CHEMBL2151635",
          "CHEMBL2151636",
          "CHEMBL2151637",
          "CHEMBL2151638",
          "CHEMBL2151639",
          "CHEMBL2151640",
          "CHEMBL2151641",
          "CHEMBL2151817",
          "CHEMBL2151818",
          "CHEMBL215282",
          "CHEMBL215300",
          "CHEMBL215353",
          "CHEMBL2153779",
          "CHEMBL2153780",
          "CHEMBL2153781",
          "CHEMBL2153782",
          "CHEMBL2153783",
          "CHEMBL2153784",
          "CHEMBL2153785",
          "CHEMBL2153786",
          "CHEMBL2153787",
          "CHEMBL2153788",
          "CHEMBL2153789",
          "CHEMBL2153790",
          "CHEMBL2153791",
          "CHEMBL2153792",
          "CHEMBL2153793",
          "CHEMBL2153794",
          "CHEMBL215561",
          "CHEMBL215702",
          "CHEMBL215746",
          "CHEMBL215748",
          "CHEMBL215861",
          "CHEMBL215941",
          "CHEMBL215957",
          "CHEMBL2164539",
          "CHEMBL2164540",
          "CHEMBL2164541",
          "CHEMBL2164542",
          "CHEMBL2164543",
          "CHEMBL2164544",
          "CHEMBL2164545",
          "CHEMBL2164546",
          "CHEMBL2164547",
          "CHEMBL2164548",
          "CHEMBL2164549",
          "CHEMBL2164550",
          "CHEMBL2164551",
          "CHEMBL2164552",
          "CHEMBL2164553",
          "CHEMBL2164554",
          "CHEMBL2164555",
          "CHEMBL2164556",
          "CHEMBL2164557",
          "CHEMBL2164558",
          "CHEMBL2164559",
          "CHEMBL2164560",
          "CHEMBL2169905",
          "CHEMBL2171702",
          "CHEMBL2171703",
          "CHEMBL2171704",
          "CHEMBL2171705",
          "CHEMBL2171706",
          "CHEMBL2171707",
          "CHEMBL2204445",
          "CHEMBL2205370",
          "CHEMBL2205371",
          "CHEMBL2205377",
          "CHEMBL2205378",
          "CHEMBL2205908",
          "CHEMBL2205909",
          "CHEMBL2205915",
          "CHEMBL2205920",
          "CHEMBL2205921",
          "CHEMBL2205925",
          "CHEMBL2205926",
          "CHEMBL2205927",
          "CHEMBL2205928",
          "CHEMBL2205930",
          "CHEMBL2208405",
          "CHEMBL2208407",
          "CHEMBL2208408",
          "CHEMBL2208410",
          "CHEMBL2208411",
          "CHEMBL223399",
          "CHEMBL223496",
          "CHEMBL223543",
          "CHEMBL223819",
          "CHEMBL223868",
          "CHEMBL223869",
          "CHEMBL224084",
          "CHEMBL224088",
          "CHEMBL224135",
          "CHEMBL224200",
          "CHEMBL224315",
          "CHEMBL224322",
          "CHEMBL224356",
          "CHEMBL224375",
          "CHEMBL224377",
          "CHEMBL224615",
          "CHEMBL224617",
          "CHEMBL224672",
          "CHEMBL224673",
          "CHEMBL224798",
          "CHEMBL224898",
          "CHEMBL225032",
          "CHEMBL225124",
          "CHEMBL225125",
          "CHEMBL225126",
          "CHEMBL225201",
          "CHEMBL225438",
          "CHEMBL225439",
          "CHEMBL225589",
          "CHEMBL225590",
          "CHEMBL226831",
          "CHEMBL226832",
          "CHEMBL226833",
          "CHEMBL227157",
          "CHEMBL227199",
          "CHEMBL227200",
          "CHEMBL227201",
          "CHEMBL227202",
          "CHEMBL227853",
          "CHEMBL230852",
          "CHEMBL230950",
          "CHEMBL230951",
          "CHEMBL231157",
          "CHEMBL2334972",
          "CHEMBL2334973",
          "CHEMBL2334974",
          "CHEMBL2334975",
          "CHEMBL2334976",
          "CHEMBL2334977",
          "CHEMBL2334978",
          "CHEMBL2334979",
          "CHEMBL2334980",
          "CHEMBL2334981",
          "CHEMBL2334982",
          "CHEMBL2334983",
          "CHEMBL2334984",
          "CHEMBL2334985",
          "CHEMBL2334986",
          "CHEMBL2334987",
          "CHEMBL2334988",
          "CHEMBL2334989",
          "CHEMBL2335279",
          "CHEMBL2335285",
          "CHEMBL2335291",
          "CHEMBL2335295",
          "CHEMBL2338557",
          "CHEMBL2338558",
          "CHEMBL2338559",
          "CHEMBL2338560",
          "CHEMBL2338561",
          "CHEMBL2338562",
          "CHEMBL2338563",
          "CHEMBL2338564",
          "CHEMBL2338565",
          "CHEMBL2338566",
          "CHEMBL2338567",
          "CHEMBL2338568",
          "CHEMBL2338569",
          "CHEMBL2338570",
          "CHEMBL2338571",
          "CHEMBL2338572",
          "CHEMBL2338573",
          "CHEMBL2338574",
          "CHEMBL2338575",
          "CHEMBL2338576",
          "CHEMBL2338577",
          "CHEMBL2338578",
          "CHEMBL2338579",
          "CHEMBL2338580",
          "CHEMBL2338581",
          "CHEMBL2338582",
          "CHEMBL2338583",
          "CHEMBL2338584",
          "CHEMBL2338585",
          "CHEMBL2338586",
          "CHEMBL2338587",
          "CHEMBL2338588",
          "CHEMBL2338589",
          "CHEMBL2338590",
          "CHEMBL2338591",
          "CHEMBL2338592",
          "CHEMBL2338593",
          "CHEMBL2338594",
          "CHEMBL2338595",
          "CHEMBL2338596",
          "CHEMBL2338597",
          "CHEMBL2338598",
          "CHEMBL2338599",
          "CHEMBL2338600",
          "CHEMBL2338601",
          "CHEMBL2338602",
          "CHEMBL2346711",
          "CHEMBL2346712",
          "CHEMBL2346713",
          "CHEMBL2346714",
          "CHEMBL2346715",
          "CHEMBL2346716",
          "CHEMBL2346717",
          "CHEMBL2346718",
          "CHEMBL2346719",
          "CHEMBL2346720",
          "CHEMBL2346721",
          "CHEMBL2346722",
          "CHEMBL2346723",
          "CHEMBL2346724",
          "CHEMBL2346725",
          "CHEMBL2346726",
          "CHEMBL2346727",
          "CHEMBL2346728",
          "CHEMBL2346729",
          "CHEMBL2346730",
          "CHEMBL2346731",
          "CHEMBL2346732",
          "CHEMBL2346733",
          "CHEMBL2346734",
          "CHEMBL2346735",
          "CHEMBL2346736",
          "CHEMBL2346737",
          "CHEMBL2346738",
          "CHEMBL2346739",
          "CHEMBL2349527",
          "CHEMBL2349528",
          "CHEMBL2349529",
          "CHEMBL2349530",
          "CHEMBL2349531",
          "CHEMBL2349532",
          "CHEMBL2349533",
          "CHEMBL2349534",
          "CHEMBL2349535",
          "CHEMBL2349536",
          "CHEMBL2349537",
          "CHEMBL2349538",
          "CHEMBL2349539",
          "CHEMBL2349540",
          "CHEMBL2349541",
          "CHEMBL2349542",
          "CHEMBL2349543",
          "CHEMBL2349544",
          "CHEMBL2349545",
          "CHEMBL2349546",
          "CHEMBL2349547",
          "CHEMBL2349548",
          "CHEMBL2349551",
          "CHEMBL2349552",
          "CHEMBL2349553",
          "CHEMBL235975",
          "CHEMBL235977",
          "CHEMBL236177",
          "CHEMBL236178",
          "CHEMBL236180",
          "CHEMBL236994",
          "CHEMBL238079",
          "CHEMBL239592",
          "CHEMBL239593",
          "CHEMBL239594",
          "CHEMBL239595",
          "CHEMBL239597",
          "CHEMBL239599",
          "CHEMBL239600",
          "CHEMBL239602",
          "CHEMBL239604",
          "CHEMBL239606",
          "CHEMBL239608",
          "CHEMBL239799",
          "CHEMBL239800",
          "CHEMBL239801",
          "CHEMBL239802",
          "CHEMBL241327",
          "CHEMBL245288",
          "CHEMBL245403",
          "CHEMBL245404",
          "CHEMBL245405",
          "CHEMBL245406",
          "CHEMBL245606",
          "CHEMBL245607",
          "CHEMBL245640",
          "CHEMBL245897",
          "CHEMBL245990",
          "CHEMBL245991",
          "CHEMBL246040",
          "CHEMBL246041",
          "CHEMBL246058",
          "CHEMBL246234",
          "CHEMBL246235",
          "CHEMBL246518",
          "CHEMBL246609",
          "CHEMBL246610",
          "CHEMBL246611",
          "CHEMBL246724",
          "CHEMBL246727",
          "CHEMBL246839",
          "CHEMBL246935",
          "CHEMBL247080",
          "CHEMBL247216",
          "CHEMBL247349",
          "CHEMBL247438",
          "CHEMBL247495",
          "CHEMBL247548",
          "CHEMBL247746",
          "CHEMBL247888",
          "CHEMBL247890",
          "CHEMBL247948",
          "CHEMBL247950",
          "CHEMBL248052",
          "CHEMBL248129",
          "CHEMBL248141",
          "CHEMBL248208",
          "CHEMBL248209",
          "CHEMBL248210",
          "CHEMBL248233",
          "CHEMBL248356",
          "CHEMBL248509",
          "CHEMBL252956",
          "CHEMBL253157",
          "CHEMBL253158",
          "CHEMBL253159",
          "CHEMBL253814",
          "CHEMBL255204",
          "CHEMBL255205",
          "CHEMBL255206",
          "CHEMBL255402",
          "CHEMBL255530",
          "CHEMBL255747",
          "CHEMBL255748",
          "CHEMBL255749",
          "CHEMBL255958",
          "CHEMBL256213",
          "CHEMBL256422",
          "CHEMBL256423",
          "CHEMBL256455",
          "CHEMBL256830",
          "CHEMBL256875",
          "CHEMBL257033",
          "CHEMBL257222",
          "CHEMBL257223",
          "CHEMBL257237",
          "CHEMBL257238",
          "CHEMBL257312",
          "CHEMBL257313",
          "CHEMBL257314",
          "CHEMBL257322",
          "CHEMBL257436",
          "CHEMBL257504",
          "CHEMBL257693",
          "CHEMBL257699",
          "CHEMBL257700",
          "CHEMBL257701",
          "CHEMBL257879",
          "CHEMBL257880",
          "CHEMBL257881",
          "CHEMBL257882",
          "CHEMBL257885",
          "CHEMBL258050",
          "CHEMBL258262",
          "CHEMBL258263",
          "CHEMBL258293",
          "CHEMBL260028",
          "CHEMBL268472",
          "CHEMBL268762",
          "CHEMBL270167",
          "CHEMBL270399",
          "CHEMBL270400",
          "CHEMBL270612",
          "CHEMBL270633",
          "CHEMBL271005",
          "CHEMBL271028",
          "CHEMBL271065",
          "CHEMBL271093",
          "CHEMBL271216",
          "CHEMBL271273",
          "CHEMBL271274",
          "CHEMBL271275",
          "CHEMBL271276",
          "CHEMBL271477",
          "CHEMBL271676",
          "CHEMBL271885",
          "CHEMBL272069",
          "CHEMBL272362",
          "CHEMBL272376",
          "CHEMBL272585",
          "CHEMBL272800",
          "CHEMBL272940",
          "CHEMBL273024",
          "CHEMBL273025",
          "CHEMBL273291",
          "CHEMBL274416",
          "CHEMBL275040",
          "CHEMBL275788",
          "CHEMBL279956",
          "CHEMBL280563",
          "CHEMBL284895",
          "CHEMBL292065",
          "CHEMBL296054",
          "CHEMBL303090",
          "CHEMBL305406",
          "CHEMBL313124",
          "CHEMBL315591",
          "CHEMBL315663",
          "CHEMBL319279",
          "CHEMBL319732",
          "CHEMBL327783",
          "CHEMBL329920",
          "CHEMBL330097",
          "CHEMBL332396",
          "CHEMBL332397",
          "CHEMBL332634",
          "CHEMBL337583",
          "CHEMBL34453",
          "CHEMBL359574",
          "CHEMBL359575",
          "CHEMBL359590",
          "CHEMBL359893",
          "CHEMBL360208",
          "CHEMBL360813",
          "CHEMBL361116",
          "CHEMBL361120",
          "CHEMBL361325",
          "CHEMBL361478",
          "CHEMBL361516",
          "CHEMBL361556",
          "CHEMBL361795",
          "CHEMBL361917",
          "CHEMBL361923",
          "CHEMBL361973",
          "CHEMBL362217",
          "CHEMBL362372",
          "CHEMBL362527",
          "CHEMBL362724",
          "CHEMBL362969",
          "CHEMBL363013",
          "CHEMBL363062",
          "CHEMBL363108",
          "CHEMBL363446",
          "CHEMBL363488",
          "CHEMBL363882",
          "CHEMBL363883",
          "CHEMBL363898",
          "CHEMBL363986",
          "CHEMBL364160",
          "CHEMBL364709",
          "CHEMBL364982",
          "CHEMBL365065",
          "CHEMBL365083",
          "CHEMBL365200",
          "CHEMBL365236",
          "CHEMBL365403",
          "CHEMBL365409",
          "CHEMBL365493",
          "CHEMBL365499",
          "CHEMBL365682",
          "CHEMBL365767",
          "CHEMBL365797",
          "CHEMBL365869",
          "CHEMBL365884",
          "CHEMBL366217",
          "CHEMBL366242",
          "CHEMBL366288",
          "CHEMBL366326",
          "CHEMBL366333",
          "CHEMBL367145",
          "CHEMBL369310",
          "CHEMBL370142",
          "CHEMBL370453",
          "CHEMBL370559",
          "CHEMBL370752",
          "CHEMBL370784",
          "CHEMBL370879",
          "CHEMBL371254",
          "CHEMBL371811",
          "CHEMBL371884",
          "CHEMBL372002",
          "CHEMBL372511",
          "CHEMBL372532",
          "CHEMBL373017",
          "CHEMBL373045",
          "CHEMBL373060",
          "CHEMBL373161",
          "CHEMBL374135",
          "CHEMBL374167",
          "CHEMBL374180",
          "CHEMBL374815",
          "CHEMBL375439",
          "CHEMBL376372",
          "CHEMBL377078",
          "CHEMBL377195",
          "CHEMBL377273",
          "CHEMBL377419",
          "CHEMBL377706",
          "CHEMBL377935",
          "CHEMBL378040",
          "CHEMBL378219",
          "CHEMBL378365",
          "CHEMBL379140",
          "CHEMBL379150",
          "CHEMBL380237",
          "CHEMBL380422",
          "CHEMBL380626",
          "CHEMBL380672",
          "CHEMBL380710",
          "CHEMBL380848",
          "CHEMBL380881",
          "CHEMBL381031",
          "CHEMBL381192",
          "CHEMBL381482",
          "CHEMBL381483",
          "CHEMBL381764",
          "CHEMBL381820",
          "CHEMBL381921",
          "CHEMBL382337",
          "CHEMBL382491",
          "CHEMBL382527",
          "CHEMBL382658",
          "CHEMBL382681",
          "CHEMBL382715",
          "CHEMBL382769",
          "CHEMBL383758",
          "CHEMBL383771",
          "CHEMBL383846",
          "CHEMBL384514",
          "CHEMBL384991",
          "CHEMBL385336",
          "CHEMBL385776",
          "CHEMBL386408",
          "CHEMBL386565",
          "CHEMBL386935",
          "CHEMBL387687",
          "CHEMBL387873",
          "CHEMBL387976",
          "CHEMBL388087",
          "CHEMBL388827",
          "CHEMBL389555",
          "CHEMBL389655",
          "CHEMBL389870",
          "CHEMBL389897",
          "CHEMBL389918",
          "CHEMBL390391",
          "CHEMBL390802",
          "CHEMBL390803",
          "CHEMBL390804",
          "CHEMBL390805",
          "CHEMBL391398",
          "CHEMBL391401",
          "CHEMBL391604",
          "CHEMBL391955",
          "CHEMBL39221",
          "CHEMBL393480",
          "CHEMBL393705",
          "CHEMBL393922",
          "CHEMBL393923",
          "CHEMBL394655",
          "CHEMBL394922",
          "CHEMBL394923",
          "CHEMBL395388",
          "CHEMBL395389",
          "CHEMBL395644",
          "CHEMBL395645",
          "CHEMBL395675",
          "CHEMBL395882",
          "CHEMBL396691",
          "CHEMBL396918",
          "CHEMBL397121",
          "CHEMBL397393",
          "CHEMBL397648",
          "CHEMBL398113",
          "CHEMBL398125",
          "CHEMBL398944",
          "CHEMBL399127",
          "CHEMBL399128",
          "CHEMBL399309",
          "CHEMBL399460",
          "CHEMBL400110",
          "CHEMBL400307",
          "CHEMBL40086",
          "CHEMBL401652",
          "CHEMBL401794",
          "CHEMBL401816",
          "CHEMBL401869",
          "CHEMBL401977",
          "CHEMBL401981",
          "CHEMBL401982",
          "CHEMBL402082",
          "CHEMBL402328",
          "CHEMBL402733",
          "CHEMBL402890",
          "CHEMBL403008",
          "CHEMBL403327",
          "CHEMBL403338",
          "CHEMBL403362",
          "CHEMBL403390",
          "CHEMBL403607",
          "CHEMBL404101",
          "CHEMBL404237",
          "CHEMBL404238",
          "CHEMBL404278",
          "CHEMBL404279",
          "CHEMBL404283",
          "CHEMBL404486",
          "CHEMBL404681",
          "CHEMBL404883",
          "CHEMBL405018",
          "CHEMBL406954",
          "CHEMBL407707",
          "CHEMBL408041",
          "CHEMBL408653",
          "CHEMBL411499",
          "CHEMBL414000",
          "CHEMBL414661",
          "CHEMBL414673",
          "CHEMBL415083",
          "CHEMBL420262",
          "CHEMBL42148",
          "CHEMBL424681",
          "CHEMBL425385",
          "CHEMBL426018",
          "CHEMBL426190",
          "CHEMBL426467",
          "CHEMBL42663",
          "CHEMBL426826",
          "CHEMBL427032",
          "CHEMBL428426",
          "CHEMBL428771",
          "CHEMBL428778",
          "CHEMBL428909",
          "CHEMBL429128",
          "CHEMBL429781",
          "CHEMBL430009",
          "CHEMBL430387",
          "CHEMBL432038",
          "CHEMBL434188",
          "CHEMBL435503",
          "CHEMBL438156",
          "CHEMBL439571",
          "CHEMBL439775",
          "CHEMBL440218",
          "CHEMBL440220",
          "CHEMBL441117",
          "CHEMBL442701",
          "CHEMBL44296",
          "CHEMBL443487",
          "CHEMBL443979",
          "CHEMBL444375",
          "CHEMBL445922",
          "CHEMBL446543",
          "CHEMBL452618",
          "CHEMBL453249",
          "CHEMBL456196",
          "CHEMBL456823",
          "CHEMBL457026",
          "CHEMBL457872",
          "CHEMBL457873",
          "CHEMBL460391",
          "CHEMBL460827",
          "CHEMBL461033",
          "CHEMBL461034",
          "CHEMBL461035",
          "CHEMBL461673",
          "CHEMBL464550",
          "CHEMBL46527",
          "CHEMBL466006",
          "CHEMBL468525",
          "CHEMBL468526",
          "CHEMBL469382",
          "CHEMBL486244",
          "CHEMBL488234",
          "CHEMBL493568",
          "CHEMBL493571",
          "CHEMBL493775",
          "CHEMBL493776",
          "CHEMBL493777",
          "CHEMBL501020",
          "CHEMBL502882",
          "CHEMBL505105",
          "CHEMBL508497",
          "CHEMBL511352",
          "CHEMBL511355",
          "CHEMBL511603",
          "CHEMBL512634",
          "CHEMBL538165",
          "CHEMBL539185",
          "CHEMBL540426",
          "CHEMBL549319",
          "CHEMBL550624",
          "CHEMBL551632",
          "CHEMBL551893",
          "CHEMBL551894",
          "CHEMBL551957",
          "CHEMBL551958",
          "CHEMBL552091",
          "CHEMBL552361",
          "CHEMBL556609",
          "CHEMBL561430",
          "CHEMBL561554",
          "CHEMBL564166",
          "CHEMBL564781",
          "CHEMBL566374",
          "CHEMBL566581",
          "CHEMBL568300",
          "CHEMBL568443",
          "CHEMBL569270",
          "CHEMBL570541",
          "CHEMBL575060",
          "CHEMBL577729",
          "CHEMBL577833",
          "CHEMBL578995",
          "CHEMBL579011",
          "CHEMBL584066",
          "CHEMBL584478",
          "CHEMBL592904",
          "CHEMBL592905",
          "CHEMBL592958",
          "CHEMBL592959",
          "CHEMBL593140",
          "CHEMBL593141",
          "CHEMBL593362",
          "CHEMBL593590",
          "CHEMBL593848",
          "CHEMBL594080",
          "CHEMBL594081",
          "CHEMBL594091",
          "CHEMBL594295",
          "CHEMBL594296",
          "CHEMBL594297",
          "CHEMBL594766",
          "CHEMBL594767",
          "CHEMBL594769",
          "CHEMBL594779",
          "CHEMBL594780",
          "CHEMBL594990",
          "CHEMBL594992",
          "CHEMBL594993",
          "CHEMBL595703",
          "CHEMBL595712",
          "CHEMBL595932",
          "CHEMBL595943",
          "CHEMBL596139",
          "CHEMBL596140",
          "CHEMBL596439",
          "CHEMBL596440",
          "CHEMBL596587",
          "CHEMBL596589",
          "CHEMBL59686",
          "CHEMBL607689",
          "CHEMBL607841",
          "CHEMBL608695",
          "CHEMBL608982",
          "CHEMBL609873",
          "CHEMBL609886",
          "CHEMBL610918",
          "CHEMBL611050",
          "CHEMBL611316",
          "CHEMBL63042",
          "CHEMBL63093",
          "CHEMBL65022",
          "CHEMBL65417",
          "CHEMBL65886",
          "CHEMBL66654",
          "CHEMBL76232",
          "CHEMBL8759",
          "CHEMBL88124",
          "CHEMBL88184",
          "CHEMBL8839",
          "CHEMBL88553",
          "CHEMBL88612",
          "CHEMBL88999",
          "CHEMBL89000",
          "CHEMBL90501",
          "CHEMBL92118",
          "CHEMBL92162",
          "CHEMBL94631",
          "CHEMBL95868",
          "CHEMBL9698",
          "CHEMBL97200",
          "CHEMBL9752",
          "CHEMBL97574",
          "CHEMBL9758",
          "CHEMBL9777",
          "CHEMBL99462"
        ],
        "number_of_missing_values": "0"
      },
      {
        "data_type": "numeric",
        "index": "1",
        "is_ignore": "false",
        "is_row_identifier": "false",
        "is_target": "false",
        "name": "FCFP4_1024b539",
        "number_of_missing_values": "0"
      },
      {
        "data_type": "numeric",
        "index": "2",
        "is_ignore": "false",
        "is_row_identifier": "false",
        "is_target": "false",
        "name": "FCFP4_1024b192",
        "number_of_missing_values": "0"
      },
      {
        "data_type": "numeric",
        "index": "3",
        "is_ignore": "false",
        "is_row_identifier": "false",
        "is_target": "false",
        "name": "FCFP4_1024b925",
        "number_of_missing_values": "0"
      },
      {
        "data_type": "numeric",
        "index": "4",
        "is_ignore": "false",
        "is_row_identifier": "false",
        "is_target": "false",
        "name": "FCFP4_1024b1016",
        "number_of_missing_values": "0"
      },
      {
        "data_type": "numeric",
        "index": "5",
        "is_ignore": "false",
        "is_row_identifier": "false",
        "is_target": "false",
        "name": "FCFP4_1024b43",
        "number_of_missing_values": "0"
      },
      {
        "data_type": "numeric",
        "index": "6",
        "is_ignore": "false",
        "is_row_identifier": "false",
        "is_target": "false",
        "name": "FCFP4_1024b360",
        "number_of_missing_values": "0"
      },
      {
        "data_type": "numeric",
        "index": "7",
        "is_ignore": "false",
        "is_row_identifier": "false",
        "is_target": "false",
        "name": "FCFP4_1024b1008",
        "number_of_missing_values": "0"
      },
      {
        "data_type": "numeric",
        "index": "8",
        "is_ignore": "false",
        "is_row_identifier": "false",
        "is_target": "false",
        "name": "FCFP4_1024b409",
        "number_of_missing_values": "0"
      },
      {
        "data_type": "numeric",
        "index": "9",
        "is_ignore": "false",
        "is_row_identifier": "false",
        "is_target": "false",
        "name": "FCFP4_1024b816",
        "number_of_missing_values": "0"
      },
      {
        "data_type": "numeric",
        "index": "10",
        "is_ignore": "false",
        "is_row_identifier": "false",
        "is_target": "false",
        "name": "FCFP4_1024b971",
        "number_of_missing_values": "0"
      },
      {
        "data_type": "numeric",
        "index": "11",
        "is_ignore": "false",
        "is_row_identifier": "false",
        "is_target": "false",
        "name": "FCFP4_1024b143",
        "number_of_missing_values": "0"
      },
      {
        "data_type": "numeric",
        "index": "12",
        "is_ignore": "false",
        "is_row_identifier": "false",
        "is_target": "false",
        "name": "FCFP4_1024b490",
        "number_of_missing_values": "0"
      },
      {
        "data_type": "numeric",
        "index": "13",
        "is_ignore": "false",
        "is_row_identifier": "false",
        "is_target": "false",
        "name": "FCFP4_1024b760",
        "number_of_missing_values": "0"
      },
      {
        "data_type": "numeric",
        "index": "14",
        "is_ignore": "false",
        "is_row_identifier": "false",
        "is_target": "false",
        "name": "FCFP4_1024b412",
        "number_of_missing_values": "0"
      },
      {
        "data_type": "numeric",
        "index": "15",
        "is_ignore": "false",
        "is_row_identifier": "false",
        "is_target": "false",
        "name": "FCFP4_1024b434",
        "number_of_missing_values": "0"
      },
      {
        "data_type": "numeric",
        "index": "16",
        "is_ignore": "false",
        "is_row_identifier": "false",
        "is_target": "false",
        "name": "FCFP4_1024b574",
        "number_of_missing_values": "0"
      },
      {
        "data_type": "numeric",
        "index": "17",
        "is_ignore": "false",
        "is_row_identifier": "false",
        "is_target": "false",
        "name": "FCFP4_1024b859",
        "number_of_missing_values": "0"
      },
      {
        "data_type": "numeric",
        "index": "18",
        "is_ignore": "false",
        "is_row_identifier": "false",
        "is_target": "false",
        "name": "FCFP4_1024b492",
        "number_of_missing_values": "0"
      },
      {
        "data_type": "numeric",
        "index": "19",
        "is_ignore": "false",
        "is_row_identifier": "false",
        "is_target": "false",
        "name": "FCFP4_1024b446",
        "number_of_missing_values": "0"
      },
      {
        "data_type": "numeric",
        "index": "20",
        "is_ignore": "false",
        "is_row_identifier": "false",
        "is_target": "false",
        "name": "FCFP4_1024b330",
        "number_of_missing_values": "0"
      },
      {
        "data_type": "numeric",
        "index": "21",
        "is_ignore": "false",
        "is_row_identifier": "false",
        "is_target": "false",
        "name": "FCFP4_1024b87",
        "number_of_missing_values": "0"
      },
      {
        "data_type": "numeric",
        "index": "22",
        "is_ignore": "false",
        "is_row_identifier": "false",
        "is_target": "false",
        "name": "FCFP4_1024b768",
        "number_of_missing_values": "0"
      },
      {
        "data_type": "numeric",
        "index": "23",
        "is_ignore": "false",
        "is_row_identifier": "false",
        "is_target": "false",
        "name": "FCFP4_1024b883",
        "number_of_missing_values": "0"
      },
      {
        "data_type": "numeric",
        "index": "24",
        "is_ignore": "false",
        "is_row_identifier": "false",
        "is_target": "false",
        "name": "FCFP4_1024b709",
        "number_of_missing_values": "0"
      },
      {
        "data_type": "numeric",
        "index": "25",
        "is_ignore": "false",
        "is_row_identifier": "false",
        "is_target": "false",
        "name": "FCFP4_1024b639",
        "number_of_missing_values": "0"
      },
      {
        "data_type": "numeric",
        "index": "26",
        "is_ignore": "false",
        "is_row_identifier": "false",
        "is_target": "false",
        "name": "FCFP4_1024b65",
        "number_of_missing_values": "0"
      },
      {
        "data_type": "numeric",
        "index": "27",
        "is_ignore": "false",
        "is_row_identifier": "false",
        "is_target": "false",
        "name": "FCFP4_1024b353",
        "number_of_missing_values": "0"
      },
      {
        "data_type": "numeric",
        "index": "28",
        "is_ignore": "false",
        "is_row_identifier": "false",
        "is_target": "false",
        "name": "FCFP4_1024b461",
        "number_of_missing_values": "0"
      },
      {
        "data_type": "numeric",
        "index": "29",
        "is_ignore": "false",
        "is_row_identifier": "false",
        "is_target": "false",
        "name": "FCFP4_1024b668",
        "number_of_missing_values": "0"
      },
      {
        "data_type": "numeric",
        "index": "30",
        "is_ignore": "false",
        "is_row_identifier": "false",
        "is_target": "false",
        "name": "FCFP4_1024b855",
        "number_of_missing_values": "0"
      },
      {
        "data_type": "numeric",
        "index": "31",
        "is_ignore": "false",
        "is_row_identifier": "false",
        "is_target": "false",
        "name": "FCFP4_1024b908",
        "number_of_missing_values": "0"
      },
      {
        "data_type": "numeric",
        "index": "32",
        "is_ignore": "false",
        "is_row_identifier": "false",
        "is_target": "false",
        "name": "FCFP4_1024b523",
        "number_of_missing_values": "0"
      },
      {
        "data_type": "numeric",
        "index": "33",
        "is_ignore": "false",
        "is_row_identifier": "false",
        "is_target": "false",
        "name": "FCFP4_1024b986",
        "number_of_missing_values": "0"
      },
      {
        "data_type": "numeric",
        "index": "34",
        "is_ignore": "false",
        "is_row_identifier": "false",
        "is_target": "false",
        "name": "FCFP4_1024b160",
        "number_of_missing_values": "0"
      },
      {
        "data_type": "numeric",
        "index": "35",
        "is_ignore": "false",
        "is_row_identifier": "false",
        "is_target": "false",
        "name": "FCFP4_1024b513",
        "number_of_missing_values": "0"
      },
      {
        "data_type": "numeric",
        "index": "36",
        "is_ignore": "false",
        "is_row_identifier": "false",
        "is_target": "false",
        "name": "FCFP4_1024b983",
        "number_of_missing_values": "0"
      },
      {
        "data_type": "numeric",
        "index": "37",
        "is_ignore": "false",
        "is_row_identifier": "false",
        "is_target": "false",
        "name": "FCFP4_1024b416",
        "number_of_missing_values": "0"
      },
      {
        "data_type": "numeric",
        "index": "38",
        "is_ignore": "false",
        "is_row_identifier": "false",
        "is_target": "false",
        "name": "FCFP4_1024b948",
        "number_of_missing_values": "0"
      },
      {
        "data_type": "numeric",
        "index": "39",
        "is_ignore": "false",
        "is_row_identifier": "false",
        "is_target": "false",
        "name": "FCFP4_1024b2",
        "number_of_missing_values": "0"
      },
      {
        "data_type": "numeric",
        "index": "40",
        "is_ignore": "false",
        "is_row_identifier": "false",
        "is_target": "false",
        "name": "FCFP4_1024b170",
        "number_of_missing_values": "0"
      },
      {
        "data_type": "numeric",
        "index": "41",
        "is_ignore": "false",
        "is_row_identifier": "false",
        "is_target": "false",
        "name": "FCFP4_1024b281",
        "number_of_missing_values": "0"
      },
      {
        "data_type": "numeric",
        "index": "42",
        "is_ignore": "false",
        "is_row_identifier": "false",
        "is_target": "false",
        "name": "FCFP4_1024b746",
        "number_of_missing_values": "0"
      },
      {
        "data_type": "numeric",
        "index": "43",
        "is_ignore": "false",
        "is_row_identifier": "false",
        "is_target": "false",
        "name": "FCFP4_1024b993",
        "number_of_missing_values": "0"
      },
      {
        "data_type": "numeric",
        "index": "44",
        "is_ignore": "false",
        "is_row_identifier": "false",
        "is_target": "false",
        "name": "FCFP4_1024b354",
        "number_of_missing_values": "0"
      },
      {
        "data_type": "numeric",
        "index": "45",
        "is_ignore": "false",
        "is_row_identifier": "false",
        "is_target": "false",
        "name": "FCFP4_1024b615",
        "number_of_missing_values": "0"
      },
      {
        "data_type": "numeric",
        "index": "46",
        "is_ignore": "false",
        "is_row_identifier": "false",
        "is_target": "false",
        "name": "FCFP4_1024b764",
        "number_of_missing_values": "0"
      },
      {
        "data_type": "numeric",
        "index": "47",
        "is_ignore": "false",
        "is_row_identifier": "false",
        "is_target": "false",
        "name": "FCFP4_1024b451",
        "number_of_missing_values": "0"
      },
      {
        "data_type": "numeric",
        "index": "48",
        "is_ignore": "false",
        "is_row_identifier": "false",
        "is_target": "false",
        "name": "FCFP4_1024b236",
        "number_of_missing_values": "0"
      },
      {
        "data_type": "numeric",
        "index": "49",
        "is_ignore": "false",
        "is_row_identifier": "false",
        "is_target": "false",
        "name": "FCFP4_1024b402",
        "number_of_missing_values": "0"
      },
      {
        "data_type": "numeric",
        "index": "50",
        "is_ignore": "false",
        "is_row_identifier": "false",
        "is_target": "false",
        "name": "FCFP4_1024b344",
        "number_of_missing_values": "0"
      },
      {
        "data_type": "numeric",
        "index": "51",
        "is_ignore": "false",
        "is_row_identifier": "false",
        "is_target": "false",
        "name": "FCFP4_1024b288",
        "number_of_missing_values": "0"
      },
      {
        "data_type": "numeric",
        "index": "52",
        "is_ignore": "false",
        "is_row_identifier": "false",
        "is_target": "false",
        "name": "FCFP4_1024b999",
        "number_of_missing_values": "0"
      },
      {
        "data_type": "numeric",
        "index": "53",
        "is_ignore": "false",
        "is_row_identifier": "false",
        "is_target": "false",
        "name": "FCFP4_1024b69",
        "number_of_missing_values": "0"
      },
      {
        "data_type": "numeric",
        "index": "54",
        "is_ignore": "false",
        "is_row_identifier": "false",
        "is_target": "false",
        "name": "FCFP4_1024b793",
        "number_of_missing_values": "0"
      },
      {
        "data_type": "numeric",
        "index": "55",
        "is_ignore": "false",
        "is_row_identifier": "false",
        "is_target": "false",
        "name": "FCFP4_1024b697",
        "number_of_missing_values": "0"
      },
      {
        "data_type": "numeric",
        "index": "56",
        "is_ignore": "false",
        "is_row_identifier": "false",
        "is_target": "false",
        "name": "FCFP4_1024b476",
        "number_of_missing_values": "0"
      },
      {
        "data_type": "numeric",
        "index": "57",
        "is_ignore": "false",
        "is_row_identifier": "false",
        "is_target": "false",
        "name": "FCFP4_1024b826",
        "number_of_missing_values": "0"
      },
      {
        "data_type": "numeric",
        "index": "58",
        "is_ignore": "false",
        "is_row_identifier": "false",
        "is_target": "false",
        "name": "FCFP4_1024b643",
        "number_of_missing_values": "0"
      },
      {
        "data_type": "numeric",
        "index": "59",
        "is_ignore": "false",
        "is_row_identifier": "false",
        "is_target": "false",
        "name": "FCFP4_1024b351",
        "number_of_missing_values": "0"
      },
      {
        "data_type": "numeric",
        "index": "60",
        "is_ignore": "false",
        "is_row_identifier": "false",
        "is_target": "false",
        "name": "FCFP4_1024b141",
        "number_of_missing_values": "0"
      },
      {
        "data_type": "numeric",
        "index": "61",
        "is_ignore": "false",
        "is_row_identifier": "false",
        "is_target": "false",
        "name": "FCFP4_1024b107",
        "number_of_missing_values": "0"
      },
      {
        "data_type": "numeric",
        "index": "62",
        "is_ignore": "false",
        "is_row_identifier": "false",
        "is_target": "false",
        "name": "FCFP4_1024b336",
        "number_of_missing_values": "0"
      },
      {
        "data_type": "numeric",
        "index": "63",
        "is_ignore": "false",
        "is_row_identifier": "false",
        "is_target": "false",
        "name": "FCFP4_1024b675",
        "number_of_missing_values": "0"
      },
      {
        "data_type": "numeric",
        "index": "64",
        "is_ignore": "false",
        "is_row_identifier": "false",
        "is_target": "false",
        "name": "FCFP4_1024b551",
        "number_of_missing_values": "0"
      },
      {
        "data_type": "numeric",
        "index": "65",
        "is_ignore": "false",
        "is_row_identifier": "false",
        "is_target": "false",
        "name": "FCFP4_1024b372",
        "number_of_missing_values": "0"
      },
      {
        "data_type": "numeric",
        "index": "66",
        "is_ignore": "false",
        "is_row_identifier": "false",
        "is_target": "false",
        "name": "FCFP4_1024b17",
        "number_of_missing_values": "0"
      },
      {
        "data_type": "numeric",
        "index": "67",
        "is_ignore": "false",
        "is_row_identifier": "false",
        "is_target": "false",
        "name": "FCFP4_1024b595",
        "number_of_missing_values": "0"
      },
      {
        "data_type": "numeric",
        "index": "68",
        "is_ignore": "false",
        "is_row_identifier": "false",
        "is_target": "false",
        "name": "FCFP4_1024b848",
        "number_of_missing_values": "0"
      },
      {
        "data_type": "numeric",
        "index": "69",
        "is_ignore": "false",
        "is_row_identifier": "false",
        "is_target": "false",
        "name": "FCFP4_1024b452",
        "number_of_missing_values": "0"
      },
      {
        "data_type": "numeric",
        "index": "70",
        "is_ignore": "false",
        "is_row_identifier": "false",
        "is_target": "false",
        "name": "FCFP4_1024b913",
        "number_of_missing_values": "0"
      },
      {
        "data_type": "numeric",
        "index": "71",
        "is_ignore": "false",
        "is_row_identifier": "false",
        "is_target": "false",
        "name": "FCFP4_1024b956",
        "number_of_missing_values": "0"
      },
      {
        "data_type": "numeric",
        "index": "72",
        "is_ignore": "false",
        "is_row_identifier": "false",
        "is_target": "false",
        "name": "FCFP4_1024b685",
        "number_of_missing_values": "0"
      },
      {
        "data_type": "numeric",
        "index": "73",
        "is_ignore": "false",
        "is_row_identifier": "false",
        "is_target": "false",
        "name": "FCFP4_1024b669",
        "number_of_missing_values": "0"
      },
      {
        "data_type": "numeric",
        "index": "74",
        "is_ignore": "false",
        "is_row_identifier": "false",
        "is_target": "false",
        "name": "FCFP4_1024b555",
        "number_of_missing_values": "0"
      },
      {
        "data_type": "numeric",
        "index": "75",
        "is_ignore": "false",
        "is_row_identifier": "false",
        "is_target": "false",
        "name": "FCFP4_1024b428",
        "number_of_missing_values": "0"
      },
      {
        "data_type": "numeric",
        "index": "76",
        "is_ignore": "false",
        "is_row_identifier": "false",
        "is_target": "false",
        "name": "FCFP4_1024b68",
        "number_of_missing_values": "0"
      },
      {
        "data_type": "numeric",
        "index": "77",
        "is_ignore": "false",
        "is_row_identifier": "false",
        "is_target": "false",
        "name": "FCFP4_1024b666",
        "number_of_missing_values": "0"
      },
      {
        "data_type": "numeric",
        "index": "78",
        "is_ignore": "false",
        "is_row_identifier": "false",
        "is_target": "false",
        "name": "FCFP4_1024b917",
        "number_of_missing_values": "0"
      },
      {
        "data_type": "numeric",
        "index": "79",
        "is_ignore": "false",
        "is_row_identifier": "false",
        "is_target": "false",
        "name": "FCFP4_1024b203",
        "number_of_missing_values": "0"
      },
      {
        "data_type": "numeric",
        "index": "80",
        "is_ignore": "false",
        "is_row_identifier": "false",
        "is_target": "false",
        "name": "FCFP4_1024b37",
        "number_of_missing_values": "0"
      },
      {
        "data_type": "numeric",
        "index": "81",
        "is_ignore": "false",
        "is_row_identifier": "false",
        "is_target": "false",
        "name": "FCFP4_1024b8",
        "number_of_missing_values": "0"
      },
      {
        "data_type": "numeric",
        "index": "82",
        "is_ignore": "false",
        "is_row_identifier": "false",
        "is_target": "false",
        "name": "FCFP4_1024b583",
        "number_of_missing_values": "0"
      },
      {
        "data_type": "numeric",
        "index": "83",
        "is_ignore": "false",
        "is_row_identifier": "false",
        "is_target": "false",
        "name": "FCFP4_1024b337",
        "number_of_missing_values": "0"
      },
      {
        "data_type": "numeric",
        "index": "84",
        "is_ignore": "false",
        "is_row_identifier": "false",
        "is_target": "false",
        "name": "FCFP4_1024b333",
        "number_of_missing_values": "0"
      },
      {
        "data_type": "numeric",
        "index": "85",
        "is_ignore": "false",
        "is_row_identifier": "false",
        "is_target": "false",
        "name": "FCFP4_1024b670",
        "number_of_missing_values": "0"
      },
      {
        "data_type": "numeric",
        "index": "86",
        "is_ignore": "false",
        "is_row_identifier": "false",
        "is_target": "false",
        "name": "FCFP4_1024b853",
        "number_of_missing_values": "0"
      },
      {
        "data_type": "numeric",
        "index": "87",
        "is_ignore": "false",
        "is_row_identifier": "false",
        "is_target": "false",
        "name": "FCFP4_1024b730",
        "number_of_missing_values": "0"
      },
      {
        "data_type": "numeric",
        "index": "88",
        "is_ignore": "false",
        "is_row_identifier": "false",
        "is_target": "false",
        "name": "FCFP4_1024b699",
        "number_of_missing_values": "0"
      },
      {
        "data_type": "numeric",
        "index": "89",
        "is_ignore": "false",
        "is_row_identifier": "false",
        "is_target": "false",
        "name": "FCFP4_1024b601",
        "number_of_missing_values": "0"
      },
      {
        "data_type": "numeric",
        "index": "90",
        "is_ignore": "false",
        "is_row_identifier": "false",
        "is_target": "false",
        "name": "FCFP4_1024b106",
        "number_of_missing_values": "0"
      },
      {
        "data_type": "numeric",
        "index": "91",
        "is_ignore": "false",
        "is_row_identifier": "false",
        "is_target": "false",
        "name": "FCFP4_1024b871",
        "number_of_missing_values": "0"
      },
      {
        "data_type": "numeric",
        "index": "92",
        "is_ignore": "false",
        "is_row_identifier": "false",
        "is_target": "false",
        "name": "FCFP4_1024b568",
        "number_of_missing_values": "0"
      },
      {
        "data_type": "numeric",
        "index": "93",
        "is_ignore": "false",
        "is_row_identifier": "false",
        "is_target": "false",
        "name": "FCFP4_1024b52",
        "number_of_missing_values": "0"
      },
      {
        "data_type": "numeric",
        "index": "94",
        "is_ignore": "false",
        "is_row_identifier": "false",
        "is_target": "false",
        "name": "FCFP4_1024b1",
        "number_of_missing_values": "0"
      },
      {
        "data_type": "numeric",
        "index": "95",
        "is_ignore": "false",
        "is_row_identifier": "false",
        "is_target": "false",
        "name": "FCFP4_1024b10",
        "number_of_missing_values": "0"
      },
      {
        "data_type": "numeric",
        "index": "96",
        "is_ignore": "false",
        "is_row_identifier": "false",
        "is_target": "false",
        "name": "FCFP4_1024b100",
        "number_of_missing_values": "0"
      },
      {
        "data_type": "numeric",
        "index": "97",
        "is_ignore": "false",
        "is_row_identifier": "false",
        "is_target": "false",
        "name": "FCFP4_1024b1000",
        "number_of_missing_values": "0"
      },
      {
        "data_type": "numeric",
        "index": "98",
        "is_ignore": "false",
        "is_row_identifier": "false",
        "is_target": "false",
        "name": "FCFP4_1024b1001",
        "number_of_missing_values": "0"
      },
      {
        "data_type": "numeric",
        "index": "99",
        "is_ignore": "false",
        "is_row_identifier": "false",
        "is_target": "false",
        "name": "FCFP4_1024b1002",
        "number_of_missing_values": "0"
      },
      {
        "data_type": "numeric",
        "index": "100",
        "is_ignore": "false",
        "is_row_identifier": "false",
        "is_target": "false",
        "name": "FCFP4_1024b1003",
        "number_of_missing_values": "0"
      },
      {
        "data_type": "numeric",
        "index": "101",
        "is_ignore": "false",
        "is_row_identifier": "false",
        "is_target": "false",
        "name": "FCFP4_1024b1004",
        "number_of_missing_values": "0"
      },
      {
        "data_type": "numeric",
        "index": "102",
        "is_ignore": "false",
        "is_row_identifier": "false",
        "is_target": "false",
        "name": "FCFP4_1024b1005",
        "number_of_missing_values": "0"
      },
      {
        "data_type": "numeric",
        "index": "103",
        "is_ignore": "false",
        "is_row_identifier": "false",
        "is_target": "true",
        "name": "pXC50",
        "number_of_missing_values": "0"
      }
    ]
  }
}