{
  "data_features": {
    "feature": [
      {
        "data_type": "nominal",
        "index": "0",
        "is_ignore": "false",
        "is_row_identifier": "true",
        "is_target": "false",
        "name": "molecule_id",
        "nominal_value": [
          "CHEMBL115774",
          "CHEMBL277792",
          "CHEMBL313360",
          "CHEMBL313386",
          "CHEMBL313472",
          "CHEMBL313896",
          "CHEMBL315046",
          "CHEMBL315843",
          "CHEMBL315900",
          "CHEMBL315901",
          "CHEMBL316200",
          "CHEMBL323885",
          "CHEMBL324891",
          "CHEMBL327108",
          "CHEMBL327617",
          "CHEMBL327641",
          "CHEMBL328886",
          "CHEMBL329651",
          "CHEMBL330731",
          "CHEMBL405651",
          "CHEMBL407540",
          "CHEMBL432770",
          "CHEMBL85744",
          "CHEMBL86390",
          "CHEMBL87159",
          "CHEMBL87300",
          "CHEMBL87786",
          "CHEMBL88187",
          "CHEMBL88188",
          "CHEMBL89057",
          "CHEMBL90622"
        ],
        "number_of_missing_values": "0"
      },
      {
        "data_type": "numeric",
        "index": "1",
        "is_ignore": "false",
        "is_row_identifier": "false",
        "is_target": "false",
        "name": "nH",
        "number_of_missing_values": "0"
      },
      {
        "data_type": "numeric",
        "index": "2",
        "is_ignore": "false",
        "is_row_identifier": "false",
        "is_target": "false",
        "name": "O.",
        "number_of_missing_values": "0"
      },
      {
        "data_type": "numeric",
        "index": "3",
        "is_ignore": "false",
        "is_row_identifier": "false",
        "is_target": "true",
        "name": "pXC50",
        "number_of_missing_values": "0"
      }
    ]
  }
}