"molecule_id","AMW","C.","H.","Me","Mi","Mp","Mv","MW","N.","nAB","nAT","nB","nBM","nBO","nBR","nBT","nC","nCL","nCsp","nCsp2","nCsp3","nDB","nF","nH","nHet","nHM","nI","nN","nO","nP","nS","nSK","nTB","nX","O.","RBF","RBN","SCBO","Se","Si","Sp","Sv","X.","pXC50"
{1 8.878,2 45.7,3 34.8,4 1.037,5 1.117,6 0.685,7 0.69,8 408.39,9 4.3,10 18,11 46,13 21,14 32,16 48,17 21,20 20,21 1,22 3,24 16,25 9,28 2,29 7,32 30,35 15.2,36 0.146,37 7,38 44,39 47.68,40 51.369,41 31.523,42 31.734,44 7.62}
{0 CHEMBL132201,1 9.381,2 48.8,3 30.2,4 1.039,5 1.112,6 0.71,7 0.721,8 403.37,9 7,10 18,11 43,13 22,14 32,16 45,17 21,19 1,20 20,22 3,24 13,25 9,28 3,29 6,32 30,33 1,35 14,36 0.133,37 6,38 46,39 44.687,40 47.827,41 30.551,42 30.987,44 7.721}
{0 CHEMBL132640,1 10.257,2 47.6,3 28.6,4 1.055,5 1.12,6 0.717,7 0.731,8 430.79,9 4.8,10 18,11 42,13 21,14 32,16 44,17 20,18 1,20 20,22 3,23 1,24 12,25 10,26 1,28 2,29 6,32 30,34 2,35 14.3,36 0.136,37 6,38 44,39 44.305,40 47.028,41 30.102,42 30.703,43 4.8,44 8.046}
{0 CHEMBL133745,1 9.786,2 46.7,3 28.9,4 1.059,5 1.122,6 0.692,7 0.718,8 440.36,9 4.4,10 18,11 45,13 23,14 34,16 47,17 21,20 21,22 5,23 1,24 13,25 11,28 2,29 8,32 32,34 1,35 17.8,36 0.149,37 7,38 48,39 47.636,40 50.503,41 31.153,42 32.305,43 2.2,44 6.52}
{0 CHEMBL134152,1 9.829,2 47.6,3 31,4 1.043,5 1.112,6 0.718,7 0.722,8 412.8,9 4.8,10 18,11 42,13 21,14 31,16 44,17 20,18 1,20 20,22 3,24 13,25 9,26 1,28 2,29 6,32 29,34 1,35 14.3,36 0.136,37 6,38 43,39 43.793,40 46.688,41 30.165,42 30.32,43 2.4,44 7.796}
{0 CHEMBL201515,1 5.766,2 36.6,3 58.5,4 0.982,5 1.132,6 0.611,7 0.555,8 472.78,11 82,13 2,14 38,16 86,17 30,20 3,21 27,22 2,24 48,25 4,29 4,32 34,35 4.9,36 0.012,37 1,38 40,39 80.516,40 92.802,41 50.092,42 45.502,44 4.004}
{0 CHEMBL206468,1 6.4,2 26.1,3 56.5,4 1.017,5 1.157,6 0.563,7 0.536,8 147.2,9 4.3,11 23,14 10,16 23,17 6,21 6,24 13,25 4,28 1,29 3,32 10,35 13,36 0.043,37 1,38 10,39 23.385,40 26.618,41 12.938,42 12.327,44 6.167}
{0 CHEMBL213661,1 6.319,2 35.7,3 54.8,4 0.995,5 1.136,6 0.613,7 0.57,8 265.39,9 2.4,10 6,11 42,13 6,14 20,16 43,17 15,20 6,21 9,24 23,25 4,28 1,29 3,32 19,35 7.1,36 0.116,37 5,38 23,39 41.803,40 47.694,41 25.745,42 23.961,44 5.914}
{0 CHEMBL215137,1 6.659,2 25,3 55,4 1.025,5 1.16,6 0.559,7 0.54,8 133.17,9 5,11 20,14 9,16 20,17 5,21 5,24 11,25 4,28 1,29 3,32 9,35 15,36 0.05,37 1,38 9,39 20.502,40 23.203,41 11.176,42 10.8,44 6.432}
{0 CHEMBL287432,1 8.559,2 27.6,3 41.4,4 1.066,5 1.156,6 0.586,7 0.61,8 248.22,9 6.9,11 29,13 2,14 18,16 30,17 8,20 2,21 6,22 2,24 12,25 9,28 2,29 7,32 17,35 24.1,36 0.033,37 1,38 20,39 30.913,40 33.538,41 17,42 17.68,44 4.838}
{0 CHEMBL489798,1 9.113,2 27.6,3 41.4,4 1.057,5 1.147,6 0.627,7 0.626,8 264.29,9 6.9,11 29,13 2,14 18,16 30,17 8,20 2,21 6,22 2,24 12,25 9,26 1,28 2,29 6,31 1,32 17,35 20.7,36 0.033,37 1,38 20,39 30.662,40 33.249,41 18.193,42 18.153,44 4.526}
{0 CHEMBL551566,1 7.467,2 41.7,3 45.8,4 1.014,5 1.121,6 0.648,7 0.627,8 358.42,10 11,11 48,13 13,14 28,16 50,17 20,20 13,21 7,22 2,24 22,25 6,29 6,32 26,35 12.5,36 0.1,37 5,38 35.5,39 48.683,40 53.824,41 31.102,42 30.084,44 4.009}
