{
  "data_set_description": {
    "collection_date": "November 2013",
    "creator": "Dr Jeremy Besnard, Dr Ivan Olier, Dr Noureddin Sadawi, Dr Larisa Soldatova, Dr Crina Grosan, Prof Ross King, Dr Richard Bickerton, Prof Andrew Hopkins and Dr Willem van Hoorn",
    "default_target_attribute": "pXC50",
    "description": "This dataset contains QSAR data (from ChEMBL version 17) showing activity values (unit is pseudo-pCI50) of several compounds on drug target ChEMBL_ID: CHEMBL3994 (TID: 10356), and it has 47 rows and 43 features (not including molecule IDs and class feature: molecule_id and pXC50). The features represent Basic Molecular Descriptors which were generated from SMILES strings.  Missing value imputation was applied to this dataset (By choosing the Median).",
    "description_version": "1",
    "file_id": "3495359",
    "format": "ARFF",
    "id": "33033",
    "licence": "Public",
    "md5_checksum": "83b57db4beeec0a09da0e3b8a43935d6",
    "minio_url": "https://data.openml.org/datasets/0003/33033/dataset_33033.pq",
    "name": "QSAR-DATASET-FOR-DRUG-TARGET-CHEMBL3994",
    "original_data_url": "https://www.ebi.ac.uk/chembl/target/inspect/CHEMBL3994",
    "parquet_url": "https://data.openml.org/datasets/0003/33033/dataset_33033.pq",
    "processing_date": "2018-10-04 03:09:15",
    "row_id_attribute": "molecule_id",
    "status": "deactivated",
    "tag": [
      "MetaQSAR",
      "study_13"
    ],
    "upload_date": "2016-07-15T11:44:31",
    "url": "https://api.openml.org/data/v1/download/3495359/QSAR-DATASET-FOR-DRUG-TARGET-CHEMBL3994.arff",
    "version": "9",
    "visibility": "public"
  }
}