{
  "data_set_description": {
    "collection_date": "November 2013",
    "creator": "Dr Jeremy Besnard, Dr Ivan Olier, Dr Noureddin Sadawi, Dr Larisa Soldatova, Dr Crina Grosan, Prof Ross King, Dr Richard Bickerton, Prof Andrew Hopkins and Dr Willem van Hoorn",
    "default_target_attribute": "pXC50",
    "description": "This dataset contains QSAR data (from ChEMBL version 17) showing activity values (unit is pseudo-pCI50) of several compounds on drug target ChEMBL_ID: CHEMBL3948 (TID: 17080), and it has 1135 rows and 1358 features (not including molecule IDs and class feature: molecule_id and pXC50). The features represent Molecular Descriptors which were generated from SMILES strings. Missing value imputation was applied to this dataset (By choosing the Median).",
    "description_version": "1",
    "file_id": "3495216",
    "format": "ARFF",
    "id": "33028",
    "licence": "Public",
    "md5_checksum": "9429cc679bc793a8de43f0dd3f6084be",
    "minio_url": "https://data.openml.org/datasets/0003/33028/dataset_33028.pq",
    "name": "QSAR-DATASET-FOR-DRUG-TARGET-CHEMBL3948",
    "original_data_url": "https://www.ebi.ac.uk/chembl/target/inspect/CHEMBL3948",
    "parquet_url": "https://data.openml.org/datasets/0003/33028/dataset_33028.pq",
    "processing_date": "2018-10-04 03:19:13",
    "row_id_attribute": "molecule_id",
    "status": "deactivated",
    "tag": [
      "MetaQSAR",
      "study_13"
    ],
    "upload_date": "2016-07-15T11:43:43",
    "url": "https://api.openml.org/data/v1/download/3495216/QSAR-DATASET-FOR-DRUG-TARGET-CHEMBL3948.arff",
    "version": "10",
    "visibility": "public"
  }
}