"molecule_id","FCFP4_1024b1","FCFP4_1024b10","FCFP4_1024b100","FCFP4_1024b1000","FCFP4_1024b1001","FCFP4_1024b1002","FCFP4_1024b1003","FCFP4_1024b1004","FCFP4_1024b1005","FCFP4_1024b1006","FCFP4_1024b1007","FCFP4_1024b1008","FCFP4_1024b1009","FCFP4_1024b101","FCFP4_1024b1010","FCFP4_1024b1011","FCFP4_1024b1012","FCFP4_1024b1013","FCFP4_1024b1014","FCFP4_1024b1015","FCFP4_1024b1016","FCFP4_1024b1017","FCFP4_1024b1018","FCFP4_1024b1019","FCFP4_1024b102","FCFP4_1024b1020","FCFP4_1024b1021","FCFP4_1024b1022","FCFP4_1024b1023","FCFP4_1024b1024","FCFP4_1024b103","FCFP4_1024b104","FCFP4_1024b105","FCFP4_1024b106","FCFP4_1024b107","FCFP4_1024b108","FCFP4_1024b109","FCFP4_1024b11","FCFP4_1024b110","FCFP4_1024b111","FCFP4_1024b112","FCFP4_1024b113","FCFP4_1024b114","FCFP4_1024b115","FCFP4_1024b116","FCFP4_1024b117","FCFP4_1024b118","FCFP4_1024b119","FCFP4_1024b12","FCFP4_1024b120","FCFP4_1024b121","pXC50"
{1 1,16 1,24 1,50 1,52 5}
{0 CHEMBL101253,1 1,52 5}
{0 CHEMBL103667,1 1,2 1,35 1,52 4.523}
{0 CHEMBL105442,1 1,52 5}
{0 CHEMBL1173655,1 1,2 1,35 1,52 5}
{0 CHEMBL119385,1 1,7 1,18 1,52 5}
{0 CHEMBL1230020,1 1,35 1,52 5}
{0 CHEMBL1236107,1 1,52 5}
{0 CHEMBL1240703,1 1,8 1,44 1,52 5.155}
{0 CHEMBL1241674,1 1,26 1,52 5.347}
{0 CHEMBL124660,1 1,2 1,35 1,52 5}
{0 CHEMBL1287853,1 1,2 1,52 6.658}
{0 CHEMBL1289926,1 1,4 1,27 1,36 1,50 1,52 5}
{0 CHEMBL1336,1 1,35 1,36 1,49 1,52 5.62}
{0 CHEMBL1421,1 1,2 1,16 1,35 1,52 5}
{0 CHEMBL14762,1 1,35 1,52 5}
{0 CHEMBL1543343,1 1,35 1,52 6.553}
{0 CHEMBL1614701,1 1,39 1,52 5}
{0 CHEMBL162,1 1,36 1,44 1,52 8.745}
{0 CHEMBL1721885,1 1,2 1,35 1,50 1,52 6.886}
{0 CHEMBL1789941,1 1,2 1,39 1,52 5}
{0 CHEMBL180022,1 1,2 1,35 1,52 6.027}
{0 CHEMBL1908391,1 1,2 1,35 1,38 1,52 5}
{0 CHEMBL1908392,1 1,2 1,8 1,52 5.959}
{0 CHEMBL1908393,1 1,2 1,35 1,52 7.009}
{0 CHEMBL1908394,1 1,2 1,49 1,52 5}
{0 CHEMBL1908395,1 1,2 1,24 1,35 1,52 6.108}
{0 CHEMBL1908396,1 1,35 1,52 5}
{0 CHEMBL1908397,1 1,4 1,50 1,52 6.854}
{0 CHEMBL191003,1 1,23 1,26 1,52 5}
{0 CHEMBL1929238,1 1,2 1,6 1,35 1,52 4.523}
{0 CHEMBL1967116,1 1,26 1,35 1,52 6.6}
{0 CHEMBL1970317,1 1,26 1,35 1,52 6.2}
{0 CHEMBL1972659,1 1,52 4.8}
{0 CHEMBL1990346,4 1,26 1,52 4.8}
{0 CHEMBL1991180,1 1,26 1,38 1,52 4.9}
{0 CHEMBL1992679,1 1,35 1,52 6.77}
{0 CHEMBL1997023,1 1,35 1,42 1,52 5.3}
{0 CHEMBL1998585,1 1,21 1,26 1,27 1,35 1,49 1,52 5.6}
{0 CHEMBL215152,1 1,2 1,4 1,35 1,50 1,52 5}
{0 CHEMBL2203524,1 1,2 1,13 1,42 1,52 8.155}
{0 CHEMBL2203525,1 1,30 1,42 1,52 7.959}
{0 CHEMBL2203526,1 1,35 1,52 6.42}
{0 CHEMBL2203527,1 1,35 1,52 6.276}
{0 CHEMBL2203528,1 1,35 1,52 7.119}
{0 CHEMBL2203529,1 1,35 1,52 6.237}
{0 CHEMBL2203530,1 1,35 1,52 6.824}
{0 CHEMBL2203531,1 1,35 1,52 6.523}
{0 CHEMBL2203532,1 1,35 1,52 6.009}
{0 CHEMBL2203533,1 1,35 1,52 5}
{0 CHEMBL2203534,1 1,3 1,35 1,52 5}
{0 CHEMBL2203535,1 1,35 1,52 5}
{0 CHEMBL2203536,1 1,3 1,35 1,52 5.796}
{0 CHEMBL2204228,1 1,35 1,52 5}
{0 CHEMBL2204229,1 1,35 1,52 5}
{0 CHEMBL2204230,1 1,35 1,52 5}
{0 CHEMBL2204231,1 1,35 1,52 5.137}
{0 CHEMBL2204232,1 1,35 1,52 5.398}
{0 CHEMBL2204233,1 1,35 1,52 5.796}
{0 CHEMBL2204234,1 1,35 1,52 5.796}
{0 CHEMBL2204235,1 1,35 1,52 6.796}
{0 CHEMBL2204236,1 1,35 1,52 6.387}
{0 CHEMBL2204237,1 1,35 1,52 6.602}
{0 CHEMBL2204238,1 1,35 1,52 6.959}
{0 CHEMBL2204239,1 1,24 1,35 1,52 7.854}
{0 CHEMBL2204240,1 1,35 1,52 6.569}
{0 CHEMBL2204241,1 1,35 1,52 7.108}
{0 CHEMBL221959,1 1,2 1,10 1,52 5}
{0 CHEMBL223360,1 1,4 1,26 1,35 1,52 5.42}
{0 CHEMBL230011,26 1,52 5}
{0 CHEMBL2309006,1 1,7 1,44 1,52 7.585}
{0 CHEMBL2309609,1 1,8 1,44 1,52 5}
{0 CHEMBL2333365,1 1,6 1,8 1,26 1,52 5}
{0 CHEMBL24828,1 1,2 1,52 5.854}
{0 CHEMBL248757,1 1,2 1,3 1,35 1,50 1,52 5.786}
{0 CHEMBL249697,1 1,35 1,52 5}
{0 CHEMBL255863,1 1,35 1,49 1,52 5}
{0 CHEMBL259084,1 1,15 1,52 5}
{0 CHEMBL261849,1 1,26 1,52 5}
{0 CHEMBL278041,16 1,24 1,52 5}
{0 CHEMBL288441,1 1,2 1,52 7.432}
{0 CHEMBL296468,1 1,35 1,45 1,52 5}
{0 CHEMBL300138,1 1,2 1,52 5.31}
{0 CHEMBL31965,1 1,2 1,35 1,52 5}
{0 CHEMBL377300,1 1,50 1,52 5.495}
{0 CHEMBL379218,1 1,4 1,50 1,52 6.658}
{0 CHEMBL384304,1 1,2 1,26 1,35 1,52 5}
{0 CHEMBL386051,1 1,52 5}
{0 CHEMBL428690,1 1,2 1,52 5.77}
{0 CHEMBL440084,1 1,52 5}
{0 CHEMBL445813,1 1,4 1,35 1,52 5}
{0 CHEMBL450786,1 1,2 1,24 1,35 1,50 1,52 6.076}
{0 CHEMBL464552,1 1,2 1,36 1,52 7.155}
{0 CHEMBL475251,1 1,20 1,35 1,47 1,52 6.013}
{0 CHEMBL477772,1 1,52 5}
{0 CHEMBL483321,1 1,36 1,52 5}
{0 CHEMBL491473,1 1,2 1,50 1,52 6.268}
{0 CHEMBL494089,1 1,26 1,38 1,52 5}
{0 CHEMBL509032,1 1,2 1,52 8.495}
{0 CHEMBL513909,1 1,2 1,17 1,52 5.959}
{0 CHEMBL521851,1 1,2 1,4 1,38 1,52 5}
{0 CHEMBL522892,1 1,2 1,31 1,35 1,52 5}
{0 CHEMBL525191,1 1,6 1,16 1,23 1,52 5}
{0 CHEMBL535,1 1,2 1,35 1,50 1,52 7.77}
{0 CHEMBL553,1 1,8 1,52 5}
{0 CHEMBL554,1 1,31 1,52 5}
{0 CHEMBL558752,1 1,35 1,39 1,49 1,52 5}
{0 CHEMBL572878,1 1,2 1,4 1,16 1,35 1,50 1,52 5}
{0 CHEMBL572881,1 1,35 1,52 5}
{0 CHEMBL573339,1 1,21 1,38 1,52 5}
{0 CHEMBL574738,1 1,2 1,16 1,35 1,36 1,49 1,52 5.921}
{0 CHEMBL576982,1 1,2 1,35 1,38 1,52 5}
{0 CHEMBL601719,1 1,26 1,52 5}
{0 CHEMBL607707,1 1,2 1,35 1,52 5.347}
{0 CHEMBL608154,1 1,35 1,52 5}
{0 CHEMBL91829,1 1,2 1,31 1,52 5.547}
{0 CHEMBL939,1 1,2 1,52 5}
{0 CHEMBL941,1 1,2 1,35 1,52 5}
