{
  "data_features": {
    "feature": [
      {
        "data_type": "nominal",
        "index": "0",
        "is_ignore": "false",
        "is_row_identifier": "true",
        "is_target": "false",
        "name": "molecule_id",
        "nominal_value": [
          "CHEMBL107558",
          "CHEMBL107667",
          "CHEMBL107919",
          "CHEMBL107920",
          "CHEMBL107971",
          "CHEMBL1080910",
          "CHEMBL1081077",
          "CHEMBL1081797",
          "CHEMBL1081998",
          "CHEMBL108428",
          "CHEMBL108604",
          "CHEMBL1087016",
          "CHEMBL108716",
          "CHEMBL109226",
          "CHEMBL109564",
          "CHEMBL109587",
          "CHEMBL109946",
          "CHEMBL110024",
          "CHEMBL110996",
          "CHEMBL110998",
          "CHEMBL111101",
          "CHEMBL111106",
          "CHEMBL111109",
          "CHEMBL111241",
          "CHEMBL111258",
          "CHEMBL111653",
          "CHEMBL111689",
          "CHEMBL111761",
          "CHEMBL111790",
          "CHEMBL115543",
          "CHEMBL1269815",
          "CHEMBL1270537",
          "CHEMBL1270636",
          "CHEMBL1270738",
          "CHEMBL1270840",
          "CHEMBL1270942",
          "CHEMBL1271045",
          "CHEMBL1271149",
          "CHEMBL1271252",
          "CHEMBL1271353",
          "CHEMBL1271461",
          "CHEMBL130058",
          "CHEMBL130147",
          "CHEMBL130930",
          "CHEMBL131912",
          "CHEMBL132292",
          "CHEMBL132734",
          "CHEMBL132849",
          "CHEMBL1332325",
          "CHEMBL133449",
          "CHEMBL133789",
          "CHEMBL133808",
          "CHEMBL133837",
          "CHEMBL133980",
          "CHEMBL134036",
          "CHEMBL134081",
          "CHEMBL1411333",
          "CHEMBL143111",
          "CHEMBL144066",
          "CHEMBL144235",
          "CHEMBL144336",
          "CHEMBL144361",
          "CHEMBL144443",
          "CHEMBL144454",
          "CHEMBL144455",
          "CHEMBL144504",
          "CHEMBL144594",
          "CHEMBL144608",
          "CHEMBL144616",
          "CHEMBL144650",
          "CHEMBL144849",
          "CHEMBL144880",
          "CHEMBL144881",
          "CHEMBL144883",
          "CHEMBL145039",
          "CHEMBL145143",
          "CHEMBL145669",
          "CHEMBL146893",
          "CHEMBL147097",
          "CHEMBL147498",
          "CHEMBL147872",
          "CHEMBL148015",
          "CHEMBL148063",
          "CHEMBL148067",
          "CHEMBL148388",
          "CHEMBL148389",
          "CHEMBL148393",
          "CHEMBL1718628",
          "CHEMBL1721173",
          "CHEMBL1729550",
          "CHEMBL1734760",
          "CHEMBL177249",
          "CHEMBL177382",
          "CHEMBL1790239",
          "CHEMBL1790240",
          "CHEMBL193537",
          "CHEMBL194526",
          "CHEMBL194533",
          "CHEMBL194920",
          "CHEMBL195729",
          "CHEMBL195909",
          "CHEMBL196002",
          "CHEMBL196683",
          "CHEMBL196727",
          "CHEMBL197133",
          "CHEMBL197248",
          "CHEMBL197523",
          "CHEMBL197618",
          "CHEMBL197686",
          "CHEMBL197782",
          "CHEMBL197783",
          "CHEMBL197791",
          "CHEMBL197903",
          "CHEMBL198175",
          "CHEMBL198273",
          "CHEMBL198375",
          "CHEMBL198451",
          "CHEMBL198473",
          "CHEMBL199101",
          "CHEMBL199201",
          "CHEMBL2012487",
          "CHEMBL2012488",
          "CHEMBL2012489",
          "CHEMBL2012490",
          "CHEMBL2012491",
          "CHEMBL2012492",
          "CHEMBL2012493",
          "CHEMBL2012494",
          "CHEMBL2012495",
          "CHEMBL2012496",
          "CHEMBL2012497",
          "CHEMBL2012498",
          "CHEMBL2012499",
          "CHEMBL2012500",
          "CHEMBL2012501",
          "CHEMBL2012502",
          "CHEMBL2012503",
          "CHEMBL2012505",
          "CHEMBL2012506",
          "CHEMBL2012507",
          "CHEMBL2012508",
          "CHEMBL2012509",
          "CHEMBL2012510",
          "CHEMBL2012511",
          "CHEMBL202677",
          "CHEMBL202678",
          "CHEMBL203012",
          "CHEMBL203376",
          "CHEMBL203992",
          "CHEMBL204009",
          "CHEMBL204064",
          "CHEMBL204157",
          "CHEMBL2047284",
          "CHEMBL2047286",
          "CHEMBL2047297",
          "CHEMBL2047299",
          "CHEMBL2047300",
          "CHEMBL2048420",
          "CHEMBL2048423",
          "CHEMBL2048425",
          "CHEMBL2048430",
          "CHEMBL2049112",
          "CHEMBL2049113",
          "CHEMBL2049114",
          "CHEMBL2049115",
          "CHEMBL2049116",
          "CHEMBL2049117",
          "CHEMBL2049118",
          "CHEMBL2049121",
          "CHEMBL204955",
          "CHEMBL205683",
          "CHEMBL205987",
          "CHEMBL206110",
          "CHEMBL206325",
          "CHEMBL206502",
          "CHEMBL207791",
          "CHEMBL208835",
          "CHEMBL212788",
          "CHEMBL214575",
          "CHEMBL214862",
          "CHEMBL214956",
          "CHEMBL215524",
          "CHEMBL215579",
          "CHEMBL215837",
          "CHEMBL215924",
          "CHEMBL217237",
          "CHEMBL217611",
          "CHEMBL217958",
          "CHEMBL218000",
          "CHEMBL218168",
          "CHEMBL218449",
          "CHEMBL218670",
          "CHEMBL218726",
          "CHEMBL218933",
          "CHEMBL218935",
          "CHEMBL219282",
          "CHEMBL219522",
          "CHEMBL219643",
          "CHEMBL219698",
          "CHEMBL219699",
          "CHEMBL219701",
          "CHEMBL231695",
          "CHEMBL231713",
          "CHEMBL231727",
          "CHEMBL231728",
          "CHEMBL231729",
          "CHEMBL231732",
          "CHEMBL231938",
          "CHEMBL231942",
          "CHEMBL231943",
          "CHEMBL231944",
          "CHEMBL231957",
          "CHEMBL231971",
          "CHEMBL232140",
          "CHEMBL232171",
          "CHEMBL232172",
          "CHEMBL232332",
          "CHEMBL232333",
          "CHEMBL232348",
          "CHEMBL232372",
          "CHEMBL232534",
          "CHEMBL232536",
          "CHEMBL232539",
          "CHEMBL232726",
          "CHEMBL232955",
          "CHEMBL233163",
          "CHEMBL233343",
          "CHEMBL233546",
          "CHEMBL233548",
          "CHEMBL234190",
          "CHEMBL234397",
          "CHEMBL234483",
          "CHEMBL234688",
          "CHEMBL234690",
          "CHEMBL234803",
          "CHEMBL234804",
          "CHEMBL243913",
          "CHEMBL244102",
          "CHEMBL244103",
          "CHEMBL244105",
          "CHEMBL244107",
          "CHEMBL244108",
          "CHEMBL244109",
          "CHEMBL244290",
          "CHEMBL244294",
          "CHEMBL244295",
          "CHEMBL244298",
          "CHEMBL244299",
          "CHEMBL244315",
          "CHEMBL244483",
          "CHEMBL244484",
          "CHEMBL244485",
          "CHEMBL244487",
          "CHEMBL244503",
          "CHEMBL262932",
          "CHEMBL263088",
          "CHEMBL263319",
          "CHEMBL263369",
          "CHEMBL263417",
          "CHEMBL263561",
          "CHEMBL264099",
          "CHEMBL264249",
          "CHEMBL264642",
          "CHEMBL264643",
          "CHEMBL265227",
          "CHEMBL267059",
          "CHEMBL268064",
          "CHEMBL268328",
          "CHEMBL269006",
          "CHEMBL269345",
          "CHEMBL274769",
          "CHEMBL275003",
          "CHEMBL275946",
          "CHEMBL276037",
          "CHEMBL278216",
          "CHEMBL281079",
          "CHEMBL281443",
          "CHEMBL281753",
          "CHEMBL282733",
          "CHEMBL284285",
          "CHEMBL284474",
          "CHEMBL284498",
          "CHEMBL285018",
          "CHEMBL285075",
          "CHEMBL285186",
          "CHEMBL285685",
          "CHEMBL285915",
          "CHEMBL286141",
          "CHEMBL286211",
          "CHEMBL286382",
          "CHEMBL286430",
          "CHEMBL286648",
          "CHEMBL286837",
          "CHEMBL287156",
          "CHEMBL287270",
          "CHEMBL287368",
          "CHEMBL287468",
          "CHEMBL287469",
          "CHEMBL288976",
          "CHEMBL289020",
          "CHEMBL289432",
          "CHEMBL290927",
          "CHEMBL291807",
          "CHEMBL292032",
          "CHEMBL292089",
          "CHEMBL293867",
          "CHEMBL294544",
          "CHEMBL295437",
          "CHEMBL295849",
          "CHEMBL296147",
          "CHEMBL296565",
          "CHEMBL296793",
          "CHEMBL297091",
          "CHEMBL297640",
          "CHEMBL298273",
          "CHEMBL302226",
          "CHEMBL302433",
          "CHEMBL302594",
          "CHEMBL302603",
          "CHEMBL302823",
          "CHEMBL303084",
          "CHEMBL303157",
          "CHEMBL303187",
          "CHEMBL304120",
          "CHEMBL304128",
          "CHEMBL304683",
          "CHEMBL304827",
          "CHEMBL304829",
          "CHEMBL30484",
          "CHEMBL304924",
          "CHEMBL305188",
          "CHEMBL305329",
          "CHEMBL305557",
          "CHEMBL306062",
          "CHEMBL30612",
          "CHEMBL30635",
          "CHEMBL307065",
          "CHEMBL307684",
          "CHEMBL307831",
          "CHEMBL308050",
          "CHEMBL308052",
          "CHEMBL308435",
          "CHEMBL308588",
          "CHEMBL309531",
          "CHEMBL309536",
          "CHEMBL310859",
          "CHEMBL311426",
          "CHEMBL311554",
          "CHEMBL311626",
          "CHEMBL313645",
          "CHEMBL314325",
          "CHEMBL320990",
          "CHEMBL321380",
          "CHEMBL321437",
          "CHEMBL322093",
          "CHEMBL322282",
          "CHEMBL322763",
          "CHEMBL323054",
          "CHEMBL323221",
          "CHEMBL323956",
          "CHEMBL325345",
          "CHEMBL325540",
          "CHEMBL326247",
          "CHEMBL326456",
          "CHEMBL327117",
          "CHEMBL32762",
          "CHEMBL32941",
          "CHEMBL330204",
          "CHEMBL33033",
          "CHEMBL330643",
          "CHEMBL33318",
          "CHEMBL33377",
          "CHEMBL33394",
          "CHEMBL33435",
          "CHEMBL334510",
          "CHEMBL33473",
          "CHEMBL334746",
          "CHEMBL33487",
          "CHEMBL33489",
          "CHEMBL33506",
          "CHEMBL33532",
          "CHEMBL335845",
          "CHEMBL33617",
          "CHEMBL33629",
          "CHEMBL33630",
          "CHEMBL336623",
          "CHEMBL337126",
          "CHEMBL33742",
          "CHEMBL337490",
          "CHEMBL337502",
          "CHEMBL33781",
          "CHEMBL337875",
          "CHEMBL33818",
          "CHEMBL33820",
          "CHEMBL33873",
          "CHEMBL338960",
          "CHEMBL33940",
          "CHEMBL33945",
          "CHEMBL33946",
          "CHEMBL34055",
          "CHEMBL34156",
          "CHEMBL341621",
          "CHEMBL341676",
          "CHEMBL342097",
          "CHEMBL342337",
          "CHEMBL342348",
          "CHEMBL342531",
          "CHEMBL342740",
          "CHEMBL342745",
          "CHEMBL342791",
          "CHEMBL342968",
          "CHEMBL343017",
          "CHEMBL343245",
          "CHEMBL343842",
          "CHEMBL34387",
          "CHEMBL344137",
          "CHEMBL344329",
          "CHEMBL344543",
          "CHEMBL344697",
          "CHEMBL344728",
          "CHEMBL344762",
          "CHEMBL344767",
          "CHEMBL345027",
          "CHEMBL34738",
          "CHEMBL356557",
          "CHEMBL356767",
          "CHEMBL356798",
          "CHEMBL357236",
          "CHEMBL357398",
          "CHEMBL357468",
          "CHEMBL357899",
          "CHEMBL357900",
          "CHEMBL358988",
          "CHEMBL370151",
          "CHEMBL370212",
          "CHEMBL370656",
          "CHEMBL371069",
          "CHEMBL371109",
          "CHEMBL371294",
          "CHEMBL371335",
          "CHEMBL371751",
          "CHEMBL371850",
          "CHEMBL372591",
          "CHEMBL372886",
          "CHEMBL373836",
          "CHEMBL374106",
          "CHEMBL374122",
          "CHEMBL374265",
          "CHEMBL374503",
          "CHEMBL376285",
          "CHEMBL376890",
          "CHEMBL377378",
          "CHEMBL377486",
          "CHEMBL377594",
          "CHEMBL380544",
          "CHEMBL381121",
          "CHEMBL381226",
          "CHEMBL381265",
          "CHEMBL381506",
          "CHEMBL381569",
          "CHEMBL381593",
          "CHEMBL381628",
          "CHEMBL382104",
          "CHEMBL382581",
          "CHEMBL382733",
          "CHEMBL382830",
          "CHEMBL383216",
          "CHEMBL383479",
          "CHEMBL383606",
          "CHEMBL383832",
          "CHEMBL384562",
          "CHEMBL384982",
          "CHEMBL385694",
          "CHEMBL385971",
          "CHEMBL387441",
          "CHEMBL387603",
          "CHEMBL389148",
          "CHEMBL389382",
          "CHEMBL389834",
          "CHEMBL389835",
          "CHEMBL390182",
          "CHEMBL390399",
          "CHEMBL390630",
          "CHEMBL391025",
          "CHEMBL391098",
          "CHEMBL391323",
          "CHEMBL391324",
          "CHEMBL391436",
          "CHEMBL391624",
          "CHEMBL391625",
          "CHEMBL391833",
          "CHEMBL391834",
          "CHEMBL392046",
          "CHEMBL392370",
          "CHEMBL392905",
          "CHEMBL394576",
          "CHEMBL397480",
          "CHEMBL397491",
          "CHEMBL399407",
          "CHEMBL399820",
          "CHEMBL400435",
          "CHEMBL400634",
          "CHEMBL407378",
          "CHEMBL407822",
          "CHEMBL409602",
          "CHEMBL410157",
          "CHEMBL410229",
          "CHEMBL410988",
          "CHEMBL415325",
          "CHEMBL416862",
          "CHEMBL418815",
          "CHEMBL42224",
          "CHEMBL422485",
          "CHEMBL422838",
          "CHEMBL423204",
          "CHEMBL423935",
          "CHEMBL424893",
          "CHEMBL425437",
          "CHEMBL42769",
          "CHEMBL427783",
          "CHEMBL428311",
          "CHEMBL429338",
          "CHEMBL430734",
          "CHEMBL430930",
          "CHEMBL431164",
          "CHEMBL431369",
          "CHEMBL432578",
          "CHEMBL433499",
          "CHEMBL433676",
          "CHEMBL434623",
          "CHEMBL434696",
          "CHEMBL435083",
          "CHEMBL436130",
          "CHEMBL436461",
          "CHEMBL437171",
          "CHEMBL438551",
          "CHEMBL439157",
          "CHEMBL439681",
          "CHEMBL440808",
          "CHEMBL44239",
          "CHEMBL442649",
          "CHEMBL44387",
          "CHEMBL445900",
          "CHEMBL446344",
          "CHEMBL44763",
          "CHEMBL447913",
          "CHEMBL447996",
          "CHEMBL449425",
          "CHEMBL45259",
          "CHEMBL45317",
          "CHEMBL45318",
          "CHEMBL453277",
          "CHEMBL455020",
          "CHEMBL458264",
          "CHEMBL460583",
          "CHEMBL462733",
          "CHEMBL46658",
          "CHEMBL46670",
          "CHEMBL46702",
          "CHEMBL46869",
          "CHEMBL47023",
          "CHEMBL47090",
          "CHEMBL493632",
          "CHEMBL493633",
          "CHEMBL493792",
          "CHEMBL493975",
          "CHEMBL493982",
          "CHEMBL493983",
          "CHEMBL494618",
          "CHEMBL494816",
          "CHEMBL495422",
          "CHEMBL498785",
          "CHEMBL500551",
          "CHEMBL506808",
          "CHEMBL507697",
          "CHEMBL521531",
          "CHEMBL523854",
          "CHEMBL553108",
          "CHEMBL559808",
          "CHEMBL561338",
          "CHEMBL597092",
          "CHEMBL611206",
          "CHEMBL62584",
          "CHEMBL62775",
          "CHEMBL63192",
          "CHEMBL63305",
          "CHEMBL63381",
          "CHEMBL63402",
          "CHEMBL63426",
          "CHEMBL63966",
          "CHEMBL65004",
          "CHEMBL65425",
          "CHEMBL65476",
          "CHEMBL65778",
          "CHEMBL66585",
          "CHEMBL66958",
          "CHEMBL67308",
          "CHEMBL68372",
          "CHEMBL68458",
          "CHEMBL69359",
          "CHEMBL70013",
          "CHEMBL71140",
          "CHEMBL71246",
          "CHEMBL71411",
          "CHEMBL71444",
          "CHEMBL72854",
          "CHEMBL75636",
          "CHEMBL75688",
          "CHEMBL7587",
          "CHEMBL7610",
          "CHEMBL7627",
          "CHEMBL7642",
          "CHEMBL76641",
          "CHEMBL76719",
          "CHEMBL77179",
          "CHEMBL77316",
          "CHEMBL77367",
          "CHEMBL7758",
          "CHEMBL79087",
          "CHEMBL80232",
          "CHEMBL80289",
          "CHEMBL80296",
          "CHEMBL80343",
          "CHEMBL80455",
          "CHEMBL80623",
          "CHEMBL80672",
          "CHEMBL80942",
          "CHEMBL80943",
          "CHEMBL80975",
          "CHEMBL88513",
          "CHEMBL90682",
          "CHEMBL90698",
          "CHEMBL90864",
          "CHEMBL91441",
          "CHEMBL91987",
          "CHEMBL95216",
          "CHEMBL95359",
          "CHEMBL95632",
          "CHEMBL97110",
          "CHEMBL97498",
          "CHEMBL97706",
          "CHEMBL97780",
          "CHEMBL97952",
          "CHEMBL98231",
          "CHEMBL98805"
        ],
        "number_of_missing_values": "0"
      },
      {
        "data_type": "numeric",
        "index": "1",
        "is_ignore": "false",
        "is_row_identifier": "false",
        "is_target": "false",
        "name": "AMW",
        "number_of_missing_values": "0"
      },
      {
        "data_type": "numeric",
        "index": "2",
        "is_ignore": "false",
        "is_row_identifier": "false",
        "is_target": "false",
        "name": "C.",
        "number_of_missing_values": "0"
      },
      {
        "data_type": "numeric",
        "index": "3",
        "is_ignore": "false",
        "is_row_identifier": "false",
        "is_target": "false",
        "name": "H.",
        "number_of_missing_values": "0"
      },
      {
        "data_type": "numeric",
        "index": "4",
        "is_ignore": "false",
        "is_row_identifier": "false",
        "is_target": "false",
        "name": "Me",
        "number_of_missing_values": "0"
      },
      {
        "data_type": "numeric",
        "index": "5",
        "is_ignore": "false",
        "is_row_identifier": "false",
        "is_target": "false",
        "name": "Mi",
        "number_of_missing_values": "0"
      },
      {
        "data_type": "numeric",
        "index": "6",
        "is_ignore": "false",
        "is_row_identifier": "false",
        "is_target": "false",
        "name": "Mp",
        "number_of_missing_values": "0"
      },
      {
        "data_type": "numeric",
        "index": "7",
        "is_ignore": "false",
        "is_row_identifier": "false",
        "is_target": "false",
        "name": "Mv",
        "number_of_missing_values": "0"
      },
      {
        "data_type": "numeric",
        "index": "8",
        "is_ignore": "false",
        "is_row_identifier": "false",
        "is_target": "false",
        "name": "MW",
        "number_of_missing_values": "0"
      },
      {
        "data_type": "numeric",
        "index": "9",
        "is_ignore": "false",
        "is_row_identifier": "false",
        "is_target": "false",
        "name": "N.",
        "number_of_missing_values": "0"
      },
      {
        "data_type": "numeric",
        "index": "10",
        "is_ignore": "false",
        "is_row_identifier": "false",
        "is_target": "false",
        "name": "nAB",
        "number_of_missing_values": "0"
      },
      {
        "data_type": "numeric",
        "index": "11",
        "is_ignore": "false",
        "is_row_identifier": "false",
        "is_target": "false",
        "name": "nAT",
        "number_of_missing_values": "0"
      },
      {
        "data_type": "numeric",
        "index": "12",
        "is_ignore": "false",
        "is_row_identifier": "false",
        "is_target": "false",
        "name": "nB",
        "number_of_missing_values": "0"
      },
      {
        "data_type": "numeric",
        "index": "13",
        "is_ignore": "false",
        "is_row_identifier": "false",
        "is_target": "false",
        "name": "nBM",
        "number_of_missing_values": "0"
      },
      {
        "data_type": "numeric",
        "index": "14",
        "is_ignore": "false",
        "is_row_identifier": "false",
        "is_target": "false",
        "name": "nBO",
        "number_of_missing_values": "0"
      },
      {
        "data_type": "numeric",
        "index": "15",
        "is_ignore": "false",
        "is_row_identifier": "false",
        "is_target": "false",
        "name": "nBR",
        "number_of_missing_values": "0"
      },
      {
        "data_type": "numeric",
        "index": "16",
        "is_ignore": "false",
        "is_row_identifier": "false",
        "is_target": "false",
        "name": "nBT",
        "number_of_missing_values": "0"
      },
      {
        "data_type": "numeric",
        "index": "17",
        "is_ignore": "false",
        "is_row_identifier": "false",
        "is_target": "false",
        "name": "nC",
        "number_of_missing_values": "0"
      },
      {
        "data_type": "numeric",
        "index": "18",
        "is_ignore": "false",
        "is_row_identifier": "false",
        "is_target": "false",
        "name": "nCL",
        "number_of_missing_values": "0"
      },
      {
        "data_type": "numeric",
        "index": "19",
        "is_ignore": "false",
        "is_row_identifier": "false",
        "is_target": "false",
        "name": "nCsp",
        "number_of_missing_values": "0"
      },
      {
        "data_type": "numeric",
        "index": "20",
        "is_ignore": "false",
        "is_row_identifier": "false",
        "is_target": "false",
        "name": "nCsp2",
        "number_of_missing_values": "0"
      },
      {
        "data_type": "numeric",
        "index": "21",
        "is_ignore": "false",
        "is_row_identifier": "false",
        "is_target": "false",
        "name": "nCsp3",
        "number_of_missing_values": "0"
      },
      {
        "data_type": "numeric",
        "index": "22",
        "is_ignore": "false",
        "is_row_identifier": "false",
        "is_target": "false",
        "name": "nDB",
        "number_of_missing_values": "0"
      },
      {
        "data_type": "numeric",
        "index": "23",
        "is_ignore": "false",
        "is_row_identifier": "false",
        "is_target": "false",
        "name": "nF",
        "number_of_missing_values": "0"
      },
      {
        "data_type": "numeric",
        "index": "24",
        "is_ignore": "false",
        "is_row_identifier": "false",
        "is_target": "false",
        "name": "nH",
        "number_of_missing_values": "0"
      },
      {
        "data_type": "numeric",
        "index": "25",
        "is_ignore": "false",
        "is_row_identifier": "false",
        "is_target": "false",
        "name": "nHet",
        "number_of_missing_values": "0"
      },
      {
        "data_type": "numeric",
        "index": "26",
        "is_ignore": "false",
        "is_row_identifier": "false",
        "is_target": "false",
        "name": "nHM",
        "number_of_missing_values": "0"
      },
      {
        "data_type": "numeric",
        "index": "27",
        "is_ignore": "false",
        "is_row_identifier": "false",
        "is_target": "false",
        "name": "nI",
        "number_of_missing_values": "0"
      },
      {
        "data_type": "numeric",
        "index": "28",
        "is_ignore": "false",
        "is_row_identifier": "false",
        "is_target": "false",
        "name": "nN",
        "number_of_missing_values": "0"
      },
      {
        "data_type": "numeric",
        "index": "29",
        "is_ignore": "false",
        "is_row_identifier": "false",
        "is_target": "false",
        "name": "nO",
        "number_of_missing_values": "0"
      },
      {
        "data_type": "numeric",
        "index": "30",
        "is_ignore": "false",
        "is_row_identifier": "false",
        "is_target": "false",
        "name": "nP",
        "number_of_missing_values": "0"
      },
      {
        "data_type": "numeric",
        "index": "31",
        "is_ignore": "false",
        "is_row_identifier": "false",
        "is_target": "false",
        "name": "nS",
        "number_of_missing_values": "0"
      },
      {
        "data_type": "numeric",
        "index": "32",
        "is_ignore": "false",
        "is_row_identifier": "false",
        "is_target": "false",
        "name": "nSK",
        "number_of_missing_values": "0"
      },
      {
        "data_type": "numeric",
        "index": "33",
        "is_ignore": "false",
        "is_row_identifier": "false",
        "is_target": "false",
        "name": "nTB",
        "number_of_missing_values": "0"
      },
      {
        "data_type": "numeric",
        "index": "34",
        "is_ignore": "false",
        "is_row_identifier": "false",
        "is_target": "false",
        "name": "nX",
        "number_of_missing_values": "0"
      },
      {
        "data_type": "numeric",
        "index": "35",
        "is_ignore": "false",
        "is_row_identifier": "false",
        "is_target": "false",
        "name": "O.",
        "number_of_missing_values": "0"
      },
      {
        "data_type": "numeric",
        "index": "36",
        "is_ignore": "false",
        "is_row_identifier": "false",
        "is_target": "false",
        "name": "RBF",
        "number_of_missing_values": "0"
      },
      {
        "data_type": "numeric",
        "index": "37",
        "is_ignore": "false",
        "is_row_identifier": "false",
        "is_target": "false",
        "name": "RBN",
        "number_of_missing_values": "0"
      },
      {
        "data_type": "numeric",
        "index": "38",
        "is_ignore": "false",
        "is_row_identifier": "false",
        "is_target": "false",
        "name": "SCBO",
        "number_of_missing_values": "0"
      },
      {
        "data_type": "numeric",
        "index": "39",
        "is_ignore": "false",
        "is_row_identifier": "false",
        "is_target": "false",
        "name": "Se",
        "number_of_missing_values": "0"
      },
      {
        "data_type": "numeric",
        "index": "40",
        "is_ignore": "false",
        "is_row_identifier": "false",
        "is_target": "false",
        "name": "Si",
        "number_of_missing_values": "0"
      },
      {
        "data_type": "numeric",
        "index": "41",
        "is_ignore": "false",
        "is_row_identifier": "false",
        "is_target": "false",
        "name": "Sp",
        "number_of_missing_values": "0"
      },
      {
        "data_type": "numeric",
        "index": "42",
        "is_ignore": "false",
        "is_row_identifier": "false",
        "is_target": "false",
        "name": "Sv",
        "number_of_missing_values": "0"
      },
      {
        "data_type": "numeric",
        "index": "43",
        "is_ignore": "false",
        "is_row_identifier": "false",
        "is_target": "false",
        "name": "X.",
        "number_of_missing_values": "0"
      },
      {
        "data_type": "numeric",
        "index": "44",
        "is_ignore": "false",
        "is_row_identifier": "false",
        "is_target": "true",
        "name": "pXC50",
        "number_of_missing_values": "0"
      }
    ]
  }
}