{
  "data_set_description": {
    "collection_date": "November 2013",
    "creator": "Dr Jeremy Besnard, Dr Ivan Olier, Dr Noureddin Sadawi, Dr Larisa Soldatova, Dr Crina Grosan, Prof Ross King, Dr Richard Bickerton, Prof Andrew Hopkins and Dr Willem van Hoorn",
    "default_target_attribute": "pXC50",
    "description": "This dataset contains QSAR data (from ChEMBL version 17) showing activity values (unit is pseudo-pCI50) of several compounds on drug target ChEMBL_ID: CHEMBL2857 (TID: 12464), and it has 473 rows and 43 features (not including molecule IDs and class feature: molecule_id and pXC50). The features represent Basic Molecular Descriptors which were generated from SMILES strings.  Missing value imputation was applied to this dataset (By choosing the Median).",
    "description_version": "1",
    "file_id": "3492642",
    "format": "ARFF",
    "id": "32922",
    "licence": "Public",
    "md5_checksum": "ada22b1cccabc9edb85a5acaa2da6a0e",
    "minio_url": "https://data.openml.org/datasets/0003/32922/dataset_32922.pq",
    "name": "QSAR-DATASET-FOR-DRUG-TARGET-CHEMBL2857",
    "original_data_url": "https://www.ebi.ac.uk/chembl/target/inspect/CHEMBL2857",
    "parquet_url": "https://data.openml.org/datasets/0003/32922/dataset_32922.pq",
    "processing_date": "2018-10-04 03:08:34",
    "row_id_attribute": "molecule_id",
    "status": "deactivated",
    "tag": [
      "MetaQSAR",
      "study_13"
    ],
    "upload_date": "2016-07-15T11:27:16",
    "url": "https://api.openml.org/data/v1/download/3492642/QSAR-DATASET-FOR-DRUG-TARGET-CHEMBL2857.arff",
    "version": "8",
    "visibility": "public"
  }
}