"molecule_id","GATS5v","AAC","AECC","ALOGP","ALOGP2","AMR","AMW","ARR","ATS1e","ATS1i","ATS1m","ATS1p","ATS1s","ATS1v","ATS2e","ATS2i","ATS2m","ATS2p","ATS2s","ATS2v","ATS3e","ATS3i","ATS3m","ATS3p","ATS3s","ATS3v","ATS4e","ATS4i","ATS4m","ATS4p","ATS4s","ATS4v","ATS5e","ATS5i","ATS5m","ATS5p","ATS5s","ATS5v","ATS6e","ATS6i","ATS6m","ATS6p","ATS6s","ATS6v","ATS7e","ATS7i","ATS7m","ATS7p","ATS7s","ATS7v","ATS8e","ATS8i","ATS8m","ATS8p","ATS8s","ATS8v","ATSC1e","ATSC1i","ATSC1m","ATSC1p","ATSC1s","ATSC1v","ATSC2e","ATSC2i","ATSC2m","ATSC2p","ATSC2s","ATSC2v","ATSC3e","ATSC3i","ATSC3m","ATSC3p","ATSC3s","ATSC3v","ATSC4e","ATSC4i","ATSC4m","ATSC4p","ATSC4s","ATSC4v","ATSC5e","ATSC5i","ATSC5m","ATSC5p","ATSC5s","ATSC5v","ATSC6e","ATSC6i","ATSC6m","ATSC6p","ATSC6s","ATSC6v","ATSC7e","ATSC7i","ATSC7m","ATSC7p","ATSC7s","ATSC7v","ATSC8e","ATSC8i","ATSC8m","ATSC8p","ATSC8s","ATSC8v","BAC","BBI","BIC0","BIC1","BIC2","BIC3","BIC4","BIC5","pXC50"
{1 0.906,2 1.233,3 15.542,4 6.486,5 42.067,6 98.874,7 6.121,8 0.25,9 4.005,10 4.132,11 3.363,12 3.527,13 4.994,14 3.456,15 4.569,16 4.774,17 3.556,18 3.862,19 5.559,20 3.733,21 4.808,22 5.08,23 3.549,24 3.951,25 5.638,26 3.779,27 4.817,28 5.099,29 3.432,30 3.861,31 5.662,32 3.681,33 4.709,34 4.998,35 3.27,36 3.748,37 5.482,38 3.559,39 4.566,40 4.855,41 3.199,42 3.667,43 5.282,44 3.476,45 4.536,46 4.815,47 3.178,48 3.592,49 5.438,50 3.409,51 4.4,52 4.678,53 3.075,54 3.527,55 5.133,56 3.346,57 0.056,58 0.668,59 12.824,60 5.76,61 7.724,62 7.735,63 0.26,64 1.053,65 22.366,66 9.145,67 41.77,68 12.651,69 0.168,70 1.261,71 27.505,72 11.055,73 34.92,74 15.72,75 0.247,76 1.204,77 27.975,78 10.485,79 43.875,80 14.941,81 0.252,82 1.071,83 25.016,84 9.34,85 35.566,86 13.332,87 0.149,88 0.965,89 21.38,90 8.497,91 20.455,92 12.175,93 0.421,94 0.9,95 21.309,96 7.86,97 48.677,98 11.221,99 0.14,100 0.822,101 18.177,102 7.212,103 17.385,104 10.275,105 27,106 27,107 0.209,108 0.479,109 0.654,110 0.743,111 0.809,112 0.853,113 7.222}
{0 CHEMBL143392,1 1.026,2 1.258,3 13.182,4 5.017,5 25.171,6 89.773,7 6.301,8 0.273,9 3.894,10 4.016,11 3.279,12 3.418,13 4.92,14 3.355,15 4.444,16 4.642,17 3.476,18 3.743,19 5.471,20 3.626,21 4.666,22 4.916,23 3.429,24 3.819,25 5.55,26 3.664,27 4.625,28 4.887,29 3.347,30 3.745,31 5.473,32 3.583,33 4.54,34 4.8,35 3.347,36 3.681,37 5.428,38 3.528,39 4.521,40 4.777,41 3.267,42 3.585,43 5.479,44 3.447,45 4.369,46 4.617,47 3.165,48 3.463,49 5.312,50 3.329,51 4.313,52 4.563,53 3.022,54 3.371,55 5.335,56 3.213,57 0.046,58 0.59,59 11.194,60 5.07,61 7.862,62 6.721,63 0.245,64 0.926,65 19.673,66 8.008,67 39.98,68 10.972,69 0.221,70 1.088,71 24.382,72 9.452,73 40.695,74 13.224,75 0.209,76 1.029,77 23.319,78 8.953,79 35.82,80 12.608,81 0.132,82 0.96,83 21.258,84 8.373,85 28.556,86 11.822,87 0.249,88 0.889,89 21.416,90 7.63,91 40.292,92 10.628,93 0.186,94 0.776,95 18.313,96 6.666,97 29.313,98 9.274,99 0.424,100 0.714,101 17.587,102 6.152,103 50.584,104 8.617,105 29,106 25,107 0.219,108 0.532,109 0.781,110 0.881,111 0.888,112 0.888,113 5}
{0 CHEMBL144091,1 0.902,2 1.233,3 15.375,4 6.065,5 36.778,6 98.822,7 6.121,8 0.25,9 4.005,10 4.132,11 3.363,12 3.527,13 4.994,14 3.456,15 4.569,16 4.774,17 3.556,18 3.862,19 5.553,20 3.733,21 4.807,22 5.071,23 3.512,24 3.955,25 5.621,26 3.78,27 4.805,28 5.086,29 3.412,30 3.886,31 5.588,32 3.698,33 4.705,34 4.99,35 3.388,36 3.785,37 5.531,38 3.613,39 4.581,40 4.842,41 3.314,42 3.676,43 5.517,44 3.521,45 4.507,46 4.783,47 3.153,48 3.56,49 5.351,50 3.395,51 4.339,52 4.603,53 3.082,54 3.464,55 5.126,56 3.304,57 0.056,58 0.668,59 12.824,60 5.76,61 7.716,62 7.735,63 0.26,64 1.053,65 22.366,66 9.145,67 40.97,68 12.651,69 0.211,70 1.256,71 27.615,72 10.994,73 36.532,74 15.568,75 0.234,76 1.213,77 27.495,78 10.609,79 36.827,80 15.122,81 0.203,82 1.091,83 24.871,84 9.532,85 33.653,86 13.59,87 0.207,88 0.964,89 22.292,90 8.341,91 38.529,92 11.753,93 0.226,94 0.871,95 20.637,96 7.543,97 32.481,98 10.676,99 0.15,100 0.766,101 17.34,102 6.663,103 17.834,104 9.412,105 31,106 27,107 0.209,108 0.493,109 0.705,110 0.796,111 0.853,112 0.865,113 7}
{0 CHEMBL144092,1 0.893,2 1.258,3 13.818,4 5.152,5 26.544,6 89.62,7 6.301,8 0.273,9 3.894,10 4.016,11 3.279,12 3.418,13 4.92,14 3.355,15 4.444,16 4.642,17 3.476,18 3.743,19 5.479,20 3.626,21 4.661,22 4.912,23 3.427,24 3.828,25 5.528,26 3.668,27 4.659,28 4.93,29 3.318,30 3.75,31 5.492,32 3.575,33 4.542,34 4.817,35 3.291,36 3.633,37 5.429,38 3.478,39 4.394,40 4.638,41 3.209,42 3.505,43 5.416,44 3.373,45 4.304,46 4.566,47 3.028,48 3.366,49 5.222,50 3.225,51 4.096,52 4.33,53 2.957,54 3.266,55 4.937,56 3.134,57 0.046,58 0.59,59 11.194,60 5.07,61 7.862,62 6.721,63 0.245,64 0.926,65 19.673,66 8.008,67 41.396,68 10.972,69 0.19,70 1.095,71 24.089,72 9.549,73 37.361,74 13.406,75 0.217,76 1.054,77 24.094,78 9.188,79 37.181,80 13.008,81 0.183,82 0.932,83 21.446,84 8.106,85 32.459,86 11.472,87 0.187,88 0.802,89 18.749,90 6.895,91 37.91,92 9.581,93 0.211,94 0.71,95 17.179,96 6.103,97 32.653,98 8.52,99 0.126,100 0.61,101 13.799,102 5.259,103 15.292,104 7.289,105 29,106 25,107 0.219,108 0.528,109 0.751,110 0.83,111 0.859,112 0.859,113 5.699}
{0 CHEMBL144178,1 1.002,2 1.284,3 14.75,4 6.809,5 46.365,6 104.996,7 6.418,8 0.25,9 3.996,10 4.123,11 3.452,12 3.595,13 4.959,14 3.485,15 4.554,16 4.757,17 3.642,18 3.946,19 5.499,20 3.767,21 4.801,22 5.065,23 3.625,24 4.021,25 5.579,26 3.812,27 4.795,28 5.076,29 3.567,30 3.981,31 5.533,32 3.751,33 4.695,34 4.966,35 3.571,36 3.92,37 5.499,38 3.698,39 4.654,40 4.922,41 3.467,42 3.832,43 5.517,44 3.614,45 4.524,46 4.792,47 3.375,48 3.715,49 5.374,50 3.499,51 4.414,52 4.671,53 3.333,54 3.594,55 5.307,56 3.388,57 0.059,58 0.677,59 13.507,60 6.102,61 7.512,62 7.987,63 0.219,64 1.12,65 25.726,66 10.566,67 34.831,68 13.585,69 0.194,70 1.322,71 29.738,72 12.144,73 30.896,74 16.232,75 0.194,76 1.309,77 31.03,78 12.313,79 30.39,80 16.148,81 0.144,82 1.212,83 29.018,84 11.551,85 27.787,86 14.921,87 0.195,88 1.136,89 29.078,90 10.898,91 33.774,92 13.748,93 0.154,94 1.002,95 25.314,96 9.618,97 25.456,98 12.18,99 0.226,100 0.883,101 23.707,102 8.271,103 32.177,104 10.532,105 31,106 27,107 0.217,108 0.493,109 0.724,110 0.828,111 0.878,112 0.89,113 5}
{0 CHEMBL144207,1 0.91,2 1.211,3 16.923,4 6.977,5 48.677,6 108.024,7 5.976,8 0.231,9 4.105,10 4.236,11 3.441,12 3.626,13 5.063,14 3.548,15 4.68,16 4.89,17 3.63,18 3.968,19 5.622,20 3.829,21 4.934,22 5.207,23 3.59,24 4.067,25 5.706,26 3.881,27 4.933,28 5.22,29 3.499,30 4.006,31 5.676,32 3.807,33 4.846,34 5.137,35 3.476,36 3.916,37 5.623,38 3.731,39 4.738,40 5.011,41 3.409,42 3.822,43 5.611,44 3.65,45 4.676,46 4.961,47 3.263,48 3.723,49 5.461,50 3.54,51 4.535,52 4.813,53 3.2,54 3.641,55 5.259,56 3.462,57 0.066,58 0.745,59 14.431,60 6.449,61 7.5,62 8.741,63 0.274,64 1.18,65 25.012,66 10.276,67 40.334,68 14.311,69 0.229,70 1.416,71 31.025,72 12.423,73 35.473,74 17.681,75 0.25,76 1.37,77 30.807,78 12.018,79 36.167,80 17.198,81 0.22,82 1.25,83 28.207,84 10.946,85 34.25,86 15.669,87 0.225,88 1.123,89 25.717,90 9.769,91 38.861,92 13.875,93 0.24,94 1.03,95 23.996,96 8.967,97 32.167,98 12.785,99 0.168,100 0.927,101 20.788,102 8.107,103 17.417,104 11.544,105 33,106 29,107 0.2,108 0.462,109 0.662,110 0.752,111 0.821,112 0.859,113 7.456}
{0 CHEMBL144297,1 0.939,2 1.201,3 17.63,4 7.433,5 55.251,6 112.625,7 5.914,8 0.222,9 4.151,10 4.284,11 3.478,12 3.672,13 5.095,14 3.591,15 4.731,16 4.943,17 3.665,18 4.017,19 5.655,20 3.875,21 4.992,22 5.269,23 3.627,24 4.119,25 5.746,26 3.928,27 4.991,28 5.282,29 3.539,30 4.061,31 5.712,32 3.858,33 4.907,34 5.196,35 3.48,36 3.98,37 5.656,38 3.787,39 4.798,40 5.081,41 3.473,42 3.907,43 5.593,44 3.725,45 4.758,46 5.037,47 3.406,48 3.809,49 5.623,50 3.64,51 4.626,52 4.894,53 3.267,54 3.713,55 5.427,56 3.539,57 0.071,58 0.784,59 15.227,60 6.793,61 8.038,62 9.241,63 0.281,64 1.243,65 26.321,66 10.841,67 41.147,68 15.134,69 0.238,70 1.495,71 32.697,72 13.132,73 36.095,74 18.724,75 0.258,76 1.449,77 32.439,78 12.719,79 35.193,80 18.225,81 0.266,82 1.325,83 29.959,84 11.597,85 36.13,86 16.573,87 0.183,88 1.216,89 26.823,90 10.67,91 31.173,92 15.244,93 0.256,94 1.118,95 26.167,96 9.686,97 41.051,98 13.773,99 0.226,100 0.998,101 22.975,102 8.661,103 28.643,104 12.279,105 36,106 30,107 0.197,108 0.448,109 0.653,110 0.761,111 0.826,112 0.862,113 5}
{0 CHEMBL144428,1 0.923,2 1.175,3 20,4 8.802,5 77.47,6 126.428,7 5.76,8 0.2,9 4.279,10 4.417,11 3.58,12 3.798,13 5.187,14 3.71,15 4.871,16 5.088,17 3.763,18 4.152,19 5.748,20 3.999,21 5.149,22 5.435,23 3.731,24 4.26,25 5.857,26 4.057,27 5.148,28 5.445,29 3.651,30 4.21,31 5.831,32 3.996,33 5.078,34 5.379,35 3.632,36 4.137,37 5.786,38 3.933,39 4.994,40 5.282,41 3.575,42 4.062,43 5.776,44 3.867,45 4.946,46 5.244,47 3.453,48 3.985,49 5.65,50 3.779,51 4.84,52 5.134,53 3.401,54 3.923,55 5.486,56 3.719,57 0.084,58 0.9,59 17.593,60 7.824,61 9.519,62 10.733,63 0.301,64 1.433,65 30.204,66 12.529,67 43.408,68 17.587,69 0.263,70 1.732,71 37.619,72 15.246,73 37.923,74 21.811,75 0.28,76 1.683,77 37.259,78 14.813,79 38.155,80 21.274,81 0.253,82 1.564,83 34.699,84 13.748,85 37.543,86 19.753,87 0.259,88 1.439,89 32.337,90 12.593,91 41.938,92 18.02,93 0.267,94 1.346,95 30.52,96 11.786,97 34.047,98 16.911,99 0.202,100 1.245,101 27.443,102 10.953,103 20.673,104 15.705,105 37,106 33,107 0.187,108 0.412,109 0.588,110 0.67,111 0.738,112 0.792,113 5}
{0 CHEMBL144564,1 0.915,2 1.198,3 16.923,4 6.854,5 46.981,6 109.779,7 5.816,8 0.231,9 4.136,10 4.271,11 3.446,12 3.646,13 5.064,14 3.563,15 4.714,16 4.926,17 3.639,18 3.996,19 5.626,20 3.852,21 4.994,22 5.273,23 3.601,24 4.102,25 5.726,26 3.908,27 4.998,28 5.293,29 3.511,30 4.045,31 5.703,32 3.838,33 4.915,34 5.214,35 3.488,36 3.963,37 5.641,38 3.766,39 4.822,40 5.105,41 3.424,42 3.881,43 5.633,44 3.694,45 4.773,46 5.067,47 3.284,48 3.796,49 5.497,50 3.596,51 4.654,52 4.947,53 3.219,54 3.718,55 5.313,56 3.519,57 0.071,58 0.775,59 15.164,60 6.713,61 8.24,62 9.171,63 0.279,64 1.219,65 25.979,66 10.631,67 39.966,68 14.895,69 0.252,70 1.467,71 32.573,72 12.87,73 34.447,74 18.427,75 0.273,76 1.423,77 32.41,78 12.481,79 36.004,80 17.977,81 0.231,82 1.308,83 29.706,84 11.472,85 33.463,86 16.54,87 0.237,88 1.195,89 27.518,90 10.415,91 38.008,92 14.937,93 0.251,94 1.111,95 25.932,96 9.696,97 30.985,98 13.959,99 0.184,100 1.014,101 22.935,102 8.891,103 18.053,104 12.796,105 33,106 29,107 0.197,108 0.452,109 0.647,110 0.764,111 0.831,112 0.868,113 7.398}
{0 CHEMBL144581,1 0.988,2 1.211,3 16.308,4 6.977,5 48.677,6 108.024,7 5.976,8 0.231,9 4.105,10 4.236,11 3.441,12 3.626,13 5.063,14 3.548,15 4.68,16 4.89,17 3.63,18 3.968,19 5.623,20 3.829,21 4.934,22 5.207,23 3.59,24 4.067,25 5.704,26 3.881,27 4.933,28 5.221,29 3.524,30 4.013,31 5.668,32 3.819,33 4.848,34 5.128,35 3.525,36 3.945,37 5.643,38 3.767,39 4.815,40 5.093,41 3.451,42 3.865,43 5.658,44 3.694,45 4.703,46 4.983,47 3.361,48 3.763,49 5.53,50 3.592,51 4.611,52 4.882,53 3.244,54 3.674,55 5.535,56 3.492,57 0.066,58 0.745,59 14.431,60 6.449,61 7.5,62 8.741,63 0.274,64 1.18,65 25.012,66 10.276,67 40.445,68 14.311,69 0.229,70 1.416,71 31.025,72 12.423,73 35.695,74 17.681,75 0.251,76 1.373,77 30.815,78 12.037,79 34.751,80 17.214,81 0.206,82 1.273,83 28.465,84 11.134,85 32.945,86 15.881,87 0.278,88 1.187,89 27.823,90 10.291,91 39.667,92 14.622,93 0.225,94 1.069,95 24.768,96 9.287,97 30.75,98 13.217,99 0.448,100 0.968,101 22.935,102 8.426,103 51.667,104 11.987,105 33,106 29,107 0.2,108 0.462,109 0.679,110 0.779,111 0.843,112 0.881,113 6.495}
{0 CHEMBL144674,1 0.991,2 1.233,3 14.75,4 6.065,5 36.778,6 98.822,7 6.121,8 0.25,9 4.005,10 4.132,11 3.363,12 3.527,13 4.994,14 3.456,15 4.569,16 4.774,17 3.556,18 3.862,19 5.553,20 3.733,21 4.807,22 5.071,23 3.512,24 3.955,25 5.619,26 3.78,27 4.805,28 5.086,29 3.44,30 3.894,31 5.579,32 3.711,33 4.709,34 4.979,35 3.441,36 3.817,37 5.552,38 3.652,39 4.67,40 4.939,41 3.36,42 3.725,43 5.569,44 3.571,45 4.539,46 4.809,47 3.261,48 3.607,49 5.428,50 3.455,51 4.431,52 4.687,53 3.131,54 3.503,55 5.435,56 3.339,57 0.056,58 0.668,59 12.824,60 5.76,61 7.716,62 7.735,63 0.26,64 1.053,65 22.366,66 9.145,67 41.081,68 12.651,69 0.211,70 1.256,71 27.615,72 10.994,73 36.754,74 15.568,75 0.235,76 1.215,77 27.499,78 10.626,79 35.361,80 15.135,81 0.186,82 1.114,83 25.063,84 9.713,85 32.298,86 13.782,87 0.263,88 1.028,89 24.46,90 8.875,91 39.784,92 12.515,93 0.208,94 0.909,95 21.37,96 7.862,97 30.929,98 11.105,99 0.431,100 0.808,101 19.513,102 6.989,103 52.309,104 9.857,105 31,106 27,107 0.209,108 0.493,109 0.724,110 0.828,111 0.878,112 0.89,113 5}
{0 CHEMBL145094,1 0.921,2 1.184,3 16.923,4 7.164,5 51.321,6 108.816,7 5.666,8 0.231,9 4.165,10 4.304,11 3.452,12 3.666,13 5.056,14 3.578,15 4.763,16 4.98,17 3.648,18 4.029,19 5.629,20 3.877,21 5.061,22 5.349,23 3.613,24 4.14,25 5.751,26 3.937,27 5.06,28 5.36,29 3.523,30 4.082,31 5.729,32 3.867,33 4.979,34 5.285,35 3.499,36 4.007,37 5.658,38 3.799,39 4.9,40 5.191,41 3.439,42 3.936,43 5.655,44 3.737,45 4.862,46 5.163,47 3.304,48 3.864,49 5.532,50 3.65,51 4.761,52 5.066,53 3.238,54 3.79,55 5.364,56 3.573,57 0.076,58 0.803,59 15.867,60 6.965,61 8.391,62 9.583,63 0.288,64 1.269,65 27.22,66 11.076,67 39.038,68 15.624,69 0.277,70 1.525,71 34.315,72 13.381,73 33.605,74 19.285,75 0.295,76 1.471,77 33.894,78 12.903,79 35.615,80 18.698,81 0.241,82 1.362,83 31.097,84 11.959,85 32.505,86 17.349,87 0.249,88 1.261,89 29.198,90 11.017,91 36.902,92 15.928,93 0.26,94 1.186,95 27.749,96 10.38,97 29.667,98 15.061,99 0.198,100 1.094,101 24.921,102 9.617,103 18.383,104 13.955,105 33,106 29,107 0.195,108 0.409,109 0.577,110 0.669,111 0.745,112 0.804,113 5}
{0 CHEMBL145194,1 0.998,2 1.258,3 13.182,4 5.152,5 26.544,6 89.62,7 6.301,8 0.273,9 3.894,10 4.016,11 3.279,12 3.418,13 4.92,14 3.355,15 4.444,16 4.642,17 3.476,18 3.743,19 5.479,20 3.626,21 4.661,22 4.912,23 3.427,24 3.828,25 5.526,26 3.668,27 4.659,28 4.93,29 3.348,30 3.759,31 5.482,32 3.59,33 4.546,34 4.805,35 3.349,36 3.671,37 5.453,38 3.524,39 4.501,40 4.756,41 3.26,42 3.563,43 5.473,44 3.43,45 4.344,46 4.598,47 3.151,48 3.423,49 5.31,50 3.295,51 4.212,52 4.439,53 3.012,54 3.313,55 5.3,56 3.175,57 0.046,58 0.59,59 11.194,60 5.07,61 7.862,62 6.721,63 0.245,64 0.926,65 19.673,66 8.008,67 41.507,68 10.972,69 0.19,70 1.095,71 24.089,72 9.549,73 37.584,74 13.406,75 0.218,76 1.056,77 24.095,78 9.203,79 35.654,80 13.017,81 0.163,82 0.953,83 21.551,84 8.277,85 31.042,86 11.64,87 0.248,88 0.869,89 20.997,90 7.446,91 39.737,92 10.362,93 0.188,94 0.748,95 17.864,96 6.422,97 30.938,98 8.946,99 0.41,100 0.653,101 16.004,102 5.593,103 50.042,104 7.737,105 29,106 25,107 0.219,108 0.528,109 0.772,110 0.866,111 0.888,112 0.888,113 5}
{0 CHEMBL147680,1 0.92,2 1.192,3 18.607,4 8.311,5 69.068,6 117.278,7 5.858,8 0.214,9 4.196,10 4.33,11 3.513,12 3.715,13 5.127,14 3.632,15 4.78,16 4.994,17 3.699,18 4.064,19 5.693,20 3.918,21 5.049,22 5.334,23 3.694,24 4.165,25 5.799,26 3.972,27 5.055,28 5.349,29 3.594,30 4.093,31 5.819,32 3.892,33 4.971,34 5.272,35 3.458,36 4.004,37 5.667,38 3.795,39 4.863,40 5.165,41 3.4,42 3.942,43 5.505,44 3.729,45 4.841,46 5.136,47 3.383,48 3.886,49 5.632,50 3.678,51 4.742,52 5.038,53 3.3,54 3.838,55 5.387,56 3.63,57 0.075,58 0.823,59 16.019,60 7.137,61 8.58,62 9.74,63 0.288,64 1.307,65 27.622,66 11.404,67 43.459,68 15.954,69 0.21,70 1.578,71 34.243,72 13.889,73 37.632,74 19.878,75 0.28,76 1.517,77 34.516,78 13.275,79 44.839,80 19.045,81 0.278,82 1.385,83 31.506,84 12.145,85 35.648,86 17.449,87 0.185,88 1.283,89 28.014,90 11.335,91 21.746,92 16.315,93 0.452,94 1.217,95 27.94,96 10.699,97 49.611,98 15.379,99 0.174,100 1.142,101 24.909,102 10.078,103 18.79,104 14.469,105 31,106 31,107 0.193,108 0.421,109 0.572,110 0.653,111 0.719,112 0.779,113 5}
{0 CHEMBL17815,1 1.007,2 1.416,3 10.458,4 6.244,5 38.983,6 96.709,7 7.664,8 0.615,9 3.892,10 3.985,11 3.478,12 3.475,13 4.984,14 3.438,15 4.417,16 4.573,17 3.859,18 3.859,19 5.425,20 3.805,21 4.614,22 4.771,23 4.014,24 3.991,25 5.683,26 3.928,27 4.737,28 4.913,29 3.984,30 4.029,31 5.805,32 3.931,33 4.731,34 4.942,35 3.879,36 3.969,37 5.749,38 3.843,39 4.663,40 4.861,41 3.646,42 3.894,43 5.641,44 3.743,45 4.498,46 4.728,47 3.541,48 3.73,49 5.434,50 3.579,51 4.403,52 4.64,53 3.397,54 3.549,55 5.362,56 3.408,57 0.021,58 0.542,59 9.107,60 4.571,61 8.028,62 5.642,63 0.102,64 0.888,65 17.871,66 7.755,67 14.332,68 9.77,69 0.224,70 1.054,71 24.052,72 9.409,73 25.789,74 11.684,75 0.332,76 1.17,77 27.036,78 10.54,79 40.203,80 13.152,81 0.354,82 1.146,83 30.698,84 10.777,85 50.68,86 13.743,87 0.387,88 1.028,89 32.971,90 10.235,91 46.049,92 12.657,93 0.27,94 0.917,95 24.643,96 8.773,97 29.698,98 11.62,99 0.206,100 0.813,101 22.477,102 7.719,103 31.513,104 9.985,105 31,106 37,107 0.245,108 0.609,109 0.812,110 0.841,111 0.841,112 0.841,113 4.398}
{0 CHEMBL2112001,1 1.016,2 1.247,3 15.741,4 6.184,5 38.246,6 109.715,7 6.628,8 0.429,9 4.043,10 4.157,11 3.488,12 3.618,13 5.095,14 3.56,15 4.576,16 4.752,17 3.711,18 3.96,19 5.631,20 3.854,21 4.814,22 5.048,23 3.66,24 4.054,25 5.694,26 3.901,27 4.832,28 5.095,29 3.545,30 3.98,31 5.647,32 3.808,33 4.737,34 4.993,35 3.542,36 3.9,37 5.614,38 3.746,39 4.7,40 4.953,41 3.469,42 3.816,43 5.63,44 3.672,45 4.573,46 4.825,47 3.381,48 3.709,49 5.499,50 3.567,51 4.487,52 4.736,53 3.261,54 3.61,55 5.509,56 3.457,57 0.05,58 0.667,59 12.244,60 5.744,61 9.093,62 7.511,63 0.245,64 1.083,65 21.751,66 9.373,67 42.939,68 12.563,69 0.194,70 1.34,71 27.909,72 11.704,73 40.653,74 16.099,75 0.23,76 1.331,77 28.829,78 11.637,79 39.762,80 16.167,81 0.179,82 1.214,83 26.108,84 10.598,85 35.035,86 14.68,87 0.262,88 1.136,89 25.642,90 9.813,91 43.644,92 13.369,93 0.204,94 1.009,95 22.432,96 8.73,97 34.46,98 11.935,99 0.436,100 0.911,101 20.927,102 7.876,103 56.619,104 10.79,105 8,106 33,107 0.207,108 0.512,109 0.708,110 0.837,111 0.873,112 0.881,113 5.301}
{0 CHEMBL275887,1 0.941,2 1.558,3 15.6,4 8.679,5 75.33,6 184.13,7 7.941,8 0.647,9 4.481,10 4.596,11 4.146,12 4.114,13 5.542,14 4.062,15 5.024,16 5.185,17 4.556,18 4.552,19 6.005,20 4.475,21 5.281,22 5.457,23 4.607,24 4.731,25 6.198,26 4.61,27 5.459,28 5.695,29 4.602,30 4.758,31 6.282,32 4.627,33 5.424,34 5.635,35 4.698,36 4.795,37 6.319,38 4.684,39 5.506,40 5.708,41 4.654,42 4.887,43 6.364,44 4.738,45 5.567,46 5.799,47 4.726,48 4.898,49 6.395,50 4.755,51 5.591,52 5.818,53 4.737,54 4.879,55 6.463,56 4.73,57 0.112,58 1.167,59 15.628,60 7.453,61 15.854,62 9.606,63 0.24,64 1.946,65 32.129,66 13.535,67 31.076,68 17.225,69 0.315,70 2.44,71 47.672,72 18.54,73 40.156,74 23.379,75 0.389,76 2.794,77 58.455,78 22.179,79 51.682,80 29.149,81 0.545,82 2.876,83 54.018,84 19.643,85 50.65,86 24.988,87 0.518,88 3.076,89 63.014,90 23.579,91 49.929,92 29.545,93 0.441,94 3.149,95 65.045,96 25.468,97 54.57,98 33.544,99 0.373,100 3.199,101 64.957,102 25.174,103 58.989,104 33.526,105 17,106 74,107 0.233,108 0.57,109 0.738,110 0.846,111 0.856,112 0.856,113 5.553}
{0 CHEMBL341664,1 0.917,2 1.192,3 18.464,4 7.889,5 62.241,6 117.226,7 5.858,8 0.214,9 4.196,10 4.33,11 3.513,12 3.715,13 5.127,14 3.632,15 4.78,16 4.994,17 3.699,18 4.064,19 5.687,20 3.918,21 5.047,22 5.328,23 3.663,24 4.168,25 5.784,26 3.973,27 5.046,28 5.339,29 3.578,30 4.113,31 5.757,32 3.906,33 4.968,34 5.266,35 3.557,36 4.033,37 5.708,38 3.837,39 4.874,40 5.155,41 3.495,42 3.949,43 5.697,44 3.765,45 4.82,46 5.113,47 3.362,48 3.862,49 5.56,50 3.667,51 4.699,52 4.986,53 3.306,54 3.792,55 5.379,56 3.599,57 0.075,58 0.823,59 16.019,60 7.137,61 8.552,62 9.74,63 0.288,64 1.307,65 27.622,66 11.404,67 41.929,68 15.954,69 0.246,70 1.574,71 34.352,72 13.839,73 36.745,74 19.759,75 0.266,76 1.527,77 34.056,78 13.418,79 37.183,80 19.246,81 0.237,82 1.407,83 31.477,84 12.35,85 35.969,86 17.721,87 0.243,88 1.282,89 29.058,90 11.186,91 40.472,92 15.961,93 0.254,94 1.188,95 27.284,96 10.381,97 33.121,98 14.86,99 0.186,100 1.087,101 24.148,102 9.535,103 19.124,104 13.639,105 35,106 31,107 0.193,108 0.435,109 0.623,110 0.709,111 0.779,112 0.83,113 6.495}
{0 CHEMBL344557,1 0.923,2 1.201,3 17.704,4 7.15,5 51.115,6 114.061,7 5.914,8 0.222,9 4.151,10 4.284,11 3.478,12 3.672,13 5.101,14 3.591,15 4.723,16 4.933,17 3.665,18 4.015,19 5.649,20 3.873,21 4.994,22 5.271,23 3.628,24 4.116,25 5.752,26 3.927,27 4.985,28 5.274,29 3.539,30 4.058,31 5.717,32 3.856,33 4.907,34 5.202,35 3.517,36 3.98,37 5.656,38 3.787,39 4.816,40 5.093,41 3.455,42 3.895,43 5.66,44 3.716,45 4.758,46 5.048,47 3.317,48 3.803,49 5.521,50 3.613,51 4.629,52 4.916,53 3.252,54 3.717,55 5.33,56 3.529,57 0.071,58 0.784,59 15.227,60 6.793,61 8.522,62 9.241,63 0.279,64 1.237,65 26.154,66 10.783,67 40.163,68 15.043,69 0.251,70 1.492,71 32.833,72 13.081,73 37.091,74 18.638,75 0.256,76 1.443,77 32.272,78 12.662,79 37.364,80 18.134,81 0.215,82 1.332,83 29.713,84 11.7,85 33.735,86 16.784,87 0.235,88 1.213,89 27.604,90 10.57,91 39.755,92 15.053,93 0.248,94 1.119,95 25.855,96 9.766,97 33,98 13.957,99 0.18,100 1.009,101 22.604,102 8.846,103 19.343,104 12.647,105 34,106 30,107 0.197,108 0.461,109 0.652,110 0.766,111 0.831,112 0.867,113 6.45}
{0 CHEMBL357912,1 0.915,2 1.221,3 16.24,4 6.521,5 42.52,6 103.423,7 6.045,8 0.24,9 4.056,10 4.186,11 3.403,12 3.578,13 5.029,14 3.503,15 4.626,16 4.833,17 3.594,18 3.916,19 5.588,20 3.782,21 4.872,22 5.141,23 3.552,24 4.013,25 5.67,26 3.832,27 4.873,28 5.163,29 3.495,30 3.944,31 5.644,32 3.753,33 4.789,34 5.071,35 3.412,36 3.832,37 5.641,38 3.657,39 4.654,40 4.933,41 3.266,42 3.737,43 5.446,44 3.552,45 4.59,46 4.885,47 3.196,48 3.652,49 5.299,50 3.463,51 4.478,52 4.737,53 3.182,54 3.581,55 5.404,56 3.408,57 0.061,58 0.707,59 13.63,60 6.105,61 7.613,62 8.239,63 0.267,64 1.117,65 23.694,66 9.711,67 40.686,68 13.483,69 0.22,70 1.336,71 29.332,72 11.71,73 37.162,74 16.63,75 0.201,76 1.296,77 29.05,78 11.372,79 34.633,80 16.306,81 0.266,82 1.157,83 27.132,84 10.054,85 43.104,86 14.305,87 0.21,88 1.036,89 23.545,90 9.048,91 30.861,92 12.887,93 0.183,94 0.96,95 21.848,96 8.42,97 21.798,98 12.07,99 0.405,100 0.866,101 20.222,102 7.542,103 44.307,104 10.687,105 30,106 28,107 0.204,108 0.47,109 0.658,110 0.742,111 0.815,112 0.856,113 7.301}
{0 CHEMBL359008,1 0.932,2 1.258,3 15.615,4 5.728,5 32.811,6 105.114,7 6.74,8 0.444,9 3.991,10 4.102,11 3.451,12 3.57,13 5.062,14 3.515,15 4.516,16 4.687,17 3.678,18 3.907,19 5.597,20 3.808,21 4.744,22 4.97,23 3.625,24 3.999,25 5.654,26 3.852,27 4.763,28 5.021,29 3.479,30 3.913,31 5.612,32 3.742,33 4.658,34 4.922,35 3.452,36 3.804,37 5.547,38 3.651,39 4.527,40 4.762,41 3.382,42 3.697,43 5.535,44 3.563,45 4.468,46 4.729,47 3.227,48 3.579,49 5.378,50 3.434,51 4.267,52 4.512,53 3.155,54 3.46,55 5.131,56 3.329,57 0.045,58 0.626,59 11.383,60 5.384,61 8.971,62 6.977,63 0.237,64 1.016,65 20.278,66 8.769,67 42.461,68 11.653,69 0.181,70 1.253,71 25.93,72 10.916,73 40.172,74 14.901,75 0.219,76 1.246,77 26.983,78 10.881,79 41.03,80 15.028,81 0.188,82 1.116,83 24.337,84 9.736,85 35.429,86 13.471,87 0.191,88 0.973,89 21.328,90 8.404,91 40.438,92 11.353,93 0.226,94 0.9,95 20.466,96 7.777,97 36.983,98 10.588,99 0.141,100 0.753,101 16.353,102 6.53,103 20.81,104 8.903,105 8,106 32,107 0.211,108 0.523,109 0.698,110 0.814,111 0.854,112 0.854,113 5.301}
{0 CHEMBL359394,1 0.892,2 1.273,3 13.238,4 5.117,5 26.187,6 85.071,7 6.409,8 0.286,9 3.833,10 3.953,11 3.234,12 3.359,13 4.881,14 3.3,15 4.376,16 4.569,17 3.434,18 3.677,19 5.446,20 3.567,21 4.581,22 4.834,23 3.423,24 3.754,25 5.498,26 3.605,27 4.592,28 4.858,29 3.29,30 3.644,31 5.525,32 3.487,33 4.454,34 4.728,35 3.101,36 3.5,37 5.316,38 3.337,39 4.266,40 4.537,41 3.016,42 3.395,43 5.076,44 3.232,45 4.225,46 4.482,47 2.991,48 3.296,49 5.267,50 3.146,51 4.034,52 4.284,53 2.865,54 3.208,55 4.881,56 3.064,57 0.041,58 0.551,59 10.367,60 4.724,61 7.886,62 6.21,63 0.238,64 0.862,65 18.304,66 7.437,67 41.022,68 10.122,69 0.128,70 1.018,71 22.167,72 8.889,73 32.905,74 12.493,75 0.218,76 0.967,77 22.853,78 8.369,79 43.689,80 11.773,81 0.232,82 0.832,83 19.953,84 7.209,85 36.124,86 10.151,87 0.118,88 0.723,89 16.159,90 6.328,91 20.275,92 8.968,93 0.394,94 0.658,95 16.091,96 5.692,97 48.235,98 7.994,99 0.109,100 0.577,101 12.844,102 5.014,103 16.951,104 7.007,105 24,106 24,107 0.224,108 0.536,109 0.73,110 0.818,111 0.856,112 0.856,113 5.222}
{0 CHEMBL422311,1 0.915,2 1.198,3 16.923,4 6.854,5 46.981,6 109.779,7 5.816,8 0.231,9 4.136,10 4.271,11 3.446,12 3.646,13 5.064,14 3.563,15 4.714,16 4.926,17 3.639,18 3.996,19 5.626,20 3.852,21 4.994,22 5.273,23 3.601,24 4.102,25 5.726,26 3.908,27 4.998,28 5.293,29 3.511,30 4.045,31 5.703,32 3.838,33 4.915,34 5.214,35 3.488,36 3.963,37 5.641,38 3.766,39 4.822,40 5.105,41 3.424,42 3.881,43 5.633,44 3.694,45 4.773,46 5.067,47 3.284,48 3.796,49 5.497,50 3.596,51 4.654,52 4.947,53 3.219,54 3.718,55 5.313,56 3.519,57 0.071,58 0.775,59 15.164,60 6.713,61 8.24,62 9.171,63 0.279,64 1.219,65 25.979,66 10.631,67 39.966,68 14.895,69 0.252,70 1.467,71 32.573,72 12.87,73 34.447,74 18.427,75 0.273,76 1.423,77 32.41,78 12.481,79 36.004,80 17.977,81 0.231,82 1.308,83 29.706,84 11.472,85 33.463,86 16.54,87 0.237,88 1.195,89 27.518,90 10.415,91 38.008,92 14.937,93 0.251,94 1.111,95 25.932,96 9.696,97 30.985,98 13.959,99 0.184,100 1.014,101 22.935,102 8.891,103 18.053,104 12.796,105 33,106 29,107 0.197,108 0.452,109 0.647,110 0.764,111 0.831,112 0.868,113 5.602}
