"molecule_id","AMW","C.","H.","Me","Mi","Mp","Mv","MW","N.","nAB","nAT","nB","nBM","nBO","nBR","nBT","nC","nCL","nCsp","nCsp2","nCsp3","nDB","nF","nH","nHet","nHM","nI","nN","nO","nP","nS","nSK","nTB","nX","O.","RBF","RBN","SCBO","Se","Si","Sp","Sv","X.","pXC50"
{1 8.311,2 45.3,3 37.7,4 1.015,5 1.123,6 0.693,7 0.678,8 440.5,9 11.3,10 27,11 53,13 28,14 37,16 57,17 24,20 21,21 3,22 1,24 20,25 9,28 6,29 3,32 33,35 5.7,36 0.123,37 7,38 51.5,39 53.778,40 59.524,41 36.727,42 35.96,44 8.25}
{0 CHEMBL1017,1 7.459,2 47.8,3 43.5,4 0.993,5 1.113,6 0.693,7 0.657,8 514.67,9 5.8,10 32,11 69,13 33,14 44,16 74,17 33,20 27,21 6,22 1,24 30,25 6,28 4,29 2,32 39,35 2.9,36 0.095,37 7,38 61,39 68.549,40 76.81,41 47.83,42 45.364,44 9.638}
{0 CHEMBL1069,1 7.141,2 39.3,3 47.5,4 1.002,5 1.133,6 0.648,7 0.616,8 435.58,9 8.2,10 17,11 61,13 19,14 34,16 63,17 24,20 15,21 9,22 2,24 29,25 8,28 5,29 3,32 32,35 4.9,36 0.159,37 10,38 44.5,39 61.094,40 69.102,41 39.529,42 37.573,44 8.469}
{0 CHEMBL1202852,1 8.193,2 42.9,3 38.8,4 1.014,5 1.131,6 0.684,7 0.668,8 401.47,9 14.3,10 23,11 49,13 24,14 33,16 52,17 21,20 18,21 3,22 1,24 19,25 9,28 7,29 2,32 30,35 4.1,36 0.135,37 7,38 45.5,39 49.669,40 55.398,41 33.517,42 32.74,44 7.167}
{0 CHEMBL1237156,1 7.648,2 41.4,3 43.1,4 1.006,5 1.132,6 0.669,7 0.643,8 443.56,9 12.1,10 23,11 58,13 24,14 36,16 61,17 24,20 18,21 6,22 1,24 25,25 9,28 7,29 2,32 33,35 3.4,36 0.148,37 9,38 48.5,39 58.32,40 65.644,41 38.801,42 37.321,44 7.815}
{0 CHEMBL1237157,1 7.81,2 41.8,3 41.8,4 1.008,5 1.131,6 0.673,7 0.651,8 429.53,9 12.7,10 23,11 55,13 24,14 35,16 58,17 23,20 18,21 5,22 1,24 23,25 9,28 7,29 2,32 32,35 3.6,36 0.155,37 9,38 47.5,39 55.436,40 62.229,41 37.04,42 35.794,44 8.752}
{0 CHEMBL128318,1 7.264,2 45.5,3 45.5,4 0.994,5 1.118,6 0.678,7 0.642,8 399.53,9 5.5,10 22,11 55,13 23,14 33,16 58,17 25,20 20,21 5,22 1,24 25,25 5,28 3,29 2,32 30,35 3.6,36 0.121,37 7,38 45,39 54.68,40 61.481,41 37.301,42 35.289,44 7.8}
{0 CHEMBL131365,1 7.359,2 45,3 45,4 0.998,5 1.118,6 0.675,7 0.642,8 441.57,9 5,10 22,11 60,13 24,14 36,16 63,17 27,20 21,21 6,22 2,24 27,25 6,28 3,29 3,32 33,35 5,36 0.127,37 8,38 49,39 59.891,40 67.106,41 40.517,42 38.53,44 8}
{0 CHEMBL141065,1 7.869,2 40.4,3 42.1,4 1.015,5 1.133,6 0.661,7 0.644,8 448.53,9 10.5,10 17,11 57,13 21,14 35,16 59,17 23,20 17,21 6,22 4,24 24,25 10,28 6,29 4,32 33,35 7,36 0.186,37 11,38 47.5,39 57.872,40 64.564,41 37.705,42 36.729,44 7.658}
{0 CHEMBL143118,1 8.278,2 40.8,3 40.8,4 1.016,5 1.127,6 0.681,7 0.658,8 587.72,9 9.9,10 23,11 71,13 29,14 45,16 74,17 29,20 23,21 6,22 6,24 29,25 13,26 1,28 7,29 5,31 1,32 42,35 7,36 0.176,37 13,38 62.5,39 72.145,40 80.022,41 48.335,42 46.706,44 8.824}
{0 CHEMBL146275,1 7.166,2 40.6,3 46.9,4 0.998,5 1.131,6 0.657,7 0.623,8 458.62,9 9.4,10 17,11 64,13 19,14 38,16 68,17 26,20 15,21 11,22 2,24 30,25 8,28 6,29 2,32 34,35 3.1,36 0.103,37 7,38 48.5,39 63.869,40 72.391,41 42.08,42 39.88,44 7.097}
{0 CHEMBL189568,1 7.798,2 37.7,3 47.5,4 1.004,5 1.124,6 0.673,7 0.625,8 475.69,9 4.9,10 16,11 61,13 19,14 34,16 63,17 23,20 14,21 9,22 3,24 29,25 9,26 2,28 3,29 4,31 2,32 32,35 6.6,36 0.175,37 11,38 45,39 61.254,40 68.57,41 41.029,42 38.146,44 5}
{0 CHEMBL191,1 7.98,2 41.5,3 43.4,4 1.004,5 1.13,6 0.683,7 0.649,8 422.96,9 11.3,10 22,11 53,13 22,14 33,16 56,17 22,18 1,20 16,21 6,24 23,25 8,26 1,28 6,29 1,32 30,34 1,35 1.9,36 0.143,37 8,38 44,39 53.214,40 59.88,41 36.199,42 34.412,43 1.9,44 7.618}
{0 CHEMBL2111971,1 7.409,2 41.8,3 45.5,4 1.006,5 1.125,6 0.658,7 0.631,8 407.51,9 5.5,10 17,11 55,13 19,14 32,16 57,17 23,20 17,21 6,22 2,24 25,25 7,28 3,29 4,32 30,35 7.3,36 0.175,37 10,38 42.5,39 55.334,40 61.9,41 36.211,42 34.718,44 8.456}
{0 CHEMBL2111972,1 7.869,2 40.4,3 42.1,4 1.015,5 1.133,6 0.661,7 0.644,8 448.53,9 10.5,10 17,11 57,13 21,14 35,16 59,17 23,20 17,21 6,22 4,24 24,25 10,28 6,29 4,32 33,35 7,36 0.186,37 11,38 47.5,39 57.872,40 64.564,41 37.705,42 36.729,44 7.928}
{0 CHEMBL2111973,1 8.422,2 42,3 42,4 1.013,5 1.12,6 0.691,7 0.66,8 581.14,9 5.8,10 23,11 69,13 27,14 43,16 72,17 29,18 1,20 23,21 6,22 4,24 29,25 11,26 2,28 4,29 5,31 1,32 40,34 1,35 7.2,36 0.167,37 12,38 58.5,39 69.931,40 77.302,41 47.699,42 45.523,43 1.4,44 8.886}
{0 CHEMBL217673,1 7.338,2 39.1,3 48.4,4 1.001,5 1.126,6 0.658,7 0.617,8 469.66,9 4.7,10 17,11 64,13 20,14 35,16 66,17 25,20 16,21 9,22 3,24 31,25 8,26 1,28 3,29 4,31 1,32 33,35 6.3,36 0.167,37 11,38 46.5,39 64.061,40 72.065,41 42.142,42 39.486,44 5}
{0 CHEMBL239393,1 7.511,2 35.9,3 50,4 1.004,5 1.127,6 0.656,7 0.608,8 480.71,9 3.1,10 11,11 64,13 15,14 33,16 65,17 23,20 12,21 11,22 4,24 32,25 9,26 2,28 2,29 5,31 2,32 32,35 7.8,36 0.169,37 11,38 42.5,39 64.247,40 72.112,41 42,42 38.893,44 5}
{0 CHEMBL239394,1 7.804,2 36.2,3 48.3,4 1.008,5 1.126,6 0.663,7 0.618,8 452.65,9 3.4,10 11,11 58,13 15,14 31,16 59,17 21,20 12,21 9,22 4,24 28,25 9,26 2,28 2,29 5,31 2,32 30,35 8.6,36 0.186,37 11,38 40.5,39 58.48,40 65.281,41 38.477,42 35.839,44 5}
{0 CHEMBL239396,1 7.979,2 34.4,3 49.2,4 1.007,5 1.125,6 0.67,7 0.616,8 486.74,9 3.3,10 10,11 61,13 14,14 32,16 62,17 21,20 10,21 11,22 4,24 30,25 10,26 3,28 2,29 5,31 3,32 31,35 8.2,36 0.177,37 11,38 41,39 61.44,40 68.616,41 40.887,42 37.553,44 5}
{0 CHEMBL241696,1 7.646,2 34.9,3 49.2,4 1.007,5 1.13,6 0.655,7 0.609,8 481.7,9 4.8,10 11,11 63,13 15,14 33,16 64,17 22,20 11,21 11,22 4,24 31,25 10,26 2,28 3,29 5,31 2,32 32,35 7.9,36 0.172,37 11,38 42.5,39 63.465,40 71.195,41 41.245,42 38.388,44 5}
{0 CHEMBL241697,1 7.716,2 34.4,3 49.2,4 1.011,5 1.13,6 0.651,7 0.608,8 470.67,9 3.3,10 10,11 61,13 14,14 32,16 62,17 21,20 10,21 11,22 4,24 30,25 10,26 2,28 2,29 6,31 2,32 31,35 9.8,36 0.177,37 11,38 41,39 61.691,40 68.906,41 39.693,42 37.081,44 5}
{0 CHEMBL245434,1 7.64,2 42,3 46.9,4 0.999,5 1.116,6 0.683,7 0.635,8 618.88,9 2.5,10 23,11 81,13 27,14 46,16 84,17 34,20 24,21 10,22 4,24 38,25 9,26 2,28 2,29 5,31 2,32 43,35 6.2,36 0.155,37 13,38 61.5,39 80.898,40 90.357,41 55.284,42 51.473,44 5}
{0 CHEMBL245840,1 7.216,2 38.6,3 50.6,4 0.996,5 1.123,6 0.66,7 0.609,8 598.9,9 2.4,10 17,11 83,13 21,14 43,16 85,17 32,20 18,21 14,22 4,24 42,25 9,26 2,28 2,29 5,31 2,32 41,35 6,36 0.188,37 16,38 55.5,39 82.665,40 93.188,41 54.807,42 50.527,44 5}
{0 CHEMBL246043,1 7.524,2 39.2,3 48.6,4 1,5 1.121,6 0.669,7 0.621,8 556.81,9 2.7,10 17,11 74,13 21,14 40,16 76,17 29,20 18,21 11,22 4,24 36,25 9,26 2,28 2,29 5,31 2,32 38,35 6.8,36 0.158,37 12,38 52.5,39 74.014,40 82.942,41 49.523,42 45.947,44 5}
{0 CHEMBL246044,1 7.535,2 41.7,3 47.6,4 0.997,5 1.116,6 0.679,7 0.631,8 632.91,9 2.4,10 23,11 84,13 27,14 47,16 87,17 35,20 24,21 11,22 4,24 40,25 9,26 2,28 2,29 5,31 2,32 44,35 6,36 0.172,37 15,38 62.5,39 83.781,40 93.772,41 57.046,42 53,44 5}
{0 CHEMBL246253,1 7.927,2 38,3 47.9,4 1.003,5 1.119,6 0.682,7 0.628,8 562.84,9 2.8,10 16,11 71,13 20,14 39,16 73,17 27,20 16,21 11,22 4,24 34,25 10,26 3,28 2,29 5,31 3,32 37,35 7,36 0.178,37 13,38 51,39 71.207,40 79.447,41 48.409,42 44.607,44 5}
{0 CHEMBL246254,1 7.162,2 35.6,3 52.1,4 0.999,5 1.128,6 0.648,7 0.596,8 522.8,9 2.7,10 11,11 73,13 15,14 36,16 74,17 26,20 12,21 14,22 4,24 38,25 9,26 2,28 2,29 5,31 2,32 35,35 6.8,36 0.189,37 14,38 45.5,39 72.898,40 82.357,41 47.284,42 43.473,44 5}
{0 CHEMBL246255,1 7.511,2 35.9,3 50,4 1.004,5 1.127,6 0.656,7 0.608,8 480.71,9 3.1,10 11,11 64,13 15,14 33,16 65,17 23,20 12,21 11,22 4,24 32,25 9,26 2,28 2,29 5,31 2,32 32,35 7.8,36 0.169,37 11,38 42.5,39 64.247,40 72.112,41 42,42 38.893,44 5}
{0 CHEMBL246459,1 7.95,2 33.8,3 49.2,4 1.01,5 1.127,6 0.663,7 0.612,8 516.77,9 3.1,10 11,11 65,13 16,14 34,16 66,17 22,20 11,21 11,22 5,24 32,25 11,26 3,28 2,29 6,31 3,32 33,35 9.2,36 0.182,37 12,38 44.5,39 65.651,40 73.241,41 43.102,42 39.795,44 5}
{0 CHEMBL246460,1 7.65,2 36.1,3 49.2,4 1.006,5 1.126,6 0.66,7 0.613,8 466.68,9 3.3,10 11,11 61,13 15,14 32,16 62,17 22,20 12,21 10,22 4,24 30,25 9,26 2,28 2,29 5,31 2,32 31,35 8.2,36 0.177,37 11,38 41.5,39 61.363,40 68.696,41 40.239,42 37.366,44 5}
{0 CHEMBL246461,1 7.302,2 35.5,3 51.6,4 0.999,5 1.127,6 0.654,7 0.6,8 452.7,9 3.2,10 11,11 62,13 14,14 31,16 63,17 22,20 11,21 11,22 3,24 32,25 8,26 2,28 2,29 4,31 2,32 30,35 6.5,36 0.175,37 11,38 39.5,39 61.92,40 69.902,41 40.546,42 37.178,44 5}
{0 CHEMBL246665,1 7.44,2 34.9,3 50.8,4 1.004,5 1.129,6 0.651,7 0.601,8 468.7,9 3.2,10 11,11 63,13 14,14 32,16 64,17 22,20 11,21 11,22 3,24 32,25 9,26 2,28 2,29 5,31 2,32 31,35 7.9,36 0.188,37 12,38 40.5,39 63.247,40 71.112,41 41,42 37.893,44 5}
{0 CHEMBL246666,1 7.162,2 35.6,3 52.1,4 0.999,5 1.128,6 0.648,7 0.596,8 522.8,9 2.7,10 11,11 73,13 15,14 36,16 74,17 26,20 12,21 14,22 4,24 38,25 9,26 2,28 2,29 5,31 2,32 35,35 6.8,36 0.189,37 14,38 45.5,39 72.898,40 82.357,41 47.284,42 43.473,44 5}
{0 CHEMBL246667,1 7.645,2 39.4,3 47.9,4 1.002,5 1.12,6 0.673,7 0.626,8 542.78,9 2.8,10 17,11 71,13 21,14 39,16 73,17 28,20 18,21 10,22 4,24 34,25 9,26 2,28 2,29 5,31 2,32 37,35 7,36 0.178,37 13,38 51.5,39 71.131,40 79.527,41 47.762,42 44.42,44 5}
{0 CHEMBL246875,1 7.414,2 39,3 49.4,4 0.999,5 1.122,6 0.666,7 0.617,8 570.84,9 2.6,10 17,11 77,13 21,14 41,16 79,17 30,20 18,21 12,22 4,24 38,25 9,26 2,28 2,29 5,31 2,32 39,35 6.5,36 0.177,37 14,38 53.5,39 76.898,40 86.357,41 51.284,42 47.473,44 5}
{0 CHEMBL246876,1 7.576,2 36.2,3 49.3,4 1.007,5 1.127,6 0.655,7 0.611,8 522.75,9 2.9,10 11,11 69,13 15,14 37,16 71,17 25,20 12,21 13,22 4,24 34,25 10,26 2,28 2,29 6,31 2,32 35,35 8.7,36 0.155,37 11,38 46.5,39 69.458,40 77.736,41 45.216,42 42.135,44 5}
{0 CHEMBL246877,1 7.645,2 39.4,3 47.9,4 1.002,5 1.12,6 0.673,7 0.626,8 542.78,9 2.8,10 17,11 71,13 21,14 39,16 73,17 28,20 18,21 10,22 4,24 34,25 9,26 2,28 2,29 5,31 2,32 37,35 7,36 0.164,37 12,38 51.5,39 71.131,40 79.527,41 47.762,42 44.42,44 5}
{0 CHEMBL247079,1 7.064,2 35.5,3 52.6,4 0.997,5 1.129,6 0.645,7 0.592,8 536.83,9 2.6,10 11,11 76,13 15,14 37,16 77,17 27,20 12,21 15,22 4,24 40,25 9,26 2,28 2,29 5,31 2,32 36,35 6.6,36 0.208,37 16,38 46.5,39 75.781,40 85.772,41 49.046,42 45,44 5}
{0 CHEMBL247482,1 7.748,2 41.3,3 46.3,4 1.001,5 1.118,6 0.682,7 0.637,8 619.87,9 3.8,10 23,11 80,13 27,14 46,16 83,17 33,20 23,21 10,22 4,24 37,25 10,26 2,28 3,29 5,31 2,32 43,35 6.3,36 0.169,37 14,38 61.5,39 80.116,40 89.44,41 54.529,42 50.968,44 5}
{0 CHEMBL255111,1 7.761,2 43.8,3 43.8,4 0.996,5 1.12,6 0.695,7 0.654,8 496.69,9 9.4,10 22,11 64,13 25,14 40,16 68,17 28,20 21,21 7,22 3,24 28,25 8,26 1,28 6,29 1,31 1,32 36,35 1.6,36 0.132,37 9,38 54,39 63.734,40 71.686,41 44.512,42 41.825,44 10.1}
{0 CHEMBL255532,1 7.925,2 42.9,3 42.9,4 1.004,5 1.122,6 0.688,7 0.654,8 554.73,9 8.6,10 22,11 70,13 26,14 44,16 74,17 30,20 22,21 8,22 4,24 30,25 10,26 1,28 6,29 3,31 1,32 40,35 4.3,36 0.149,37 11,38 59,39 70.272,40 78.52,41 48.182,42 45.781,44 9.6}
{0 CHEMBL257671,1 8.595,2 42.9,3 42.9,4 1.004,5 1.121,6 0.695,7 0.657,8 601.62,9 8.6,10 22,11 70,13 26,14 44,16 74,17 30,20 22,21 8,22 4,24 30,25 10,26 1,28 6,29 3,32 40,35 4.3,36 0.149,37 11,38 59,39 70.29,40 78.467,41 48.676,42 45.99,44 9.8}
{0 CHEMBL257869,1 8.731,2 42.6,3 44.4,4 1.006,5 1.116,6 0.692,7 0.65,8 471.45,9 3.7,10 16,11 54,13 19,14 32,16 56,17 23,20 17,21 6,22 3,24 24,25 7,26 1,28 2,29 4,32 30,35 7.4,36 0.179,37 10,38 43,39 54.327,40 60.268,41 37.347,42 35.093,44 8.3}
{0 CHEMBL257870,1 8.493,2 43.8,3 43.8,4 0.996,5 1.119,6 0.703,7 0.657,8 543.58,9 9.4,10 22,11 64,13 25,14 40,16 68,17 28,20 21,21 7,22 3,24 28,25 8,26 1,28 6,29 1,32 36,35 1.6,36 0.132,37 9,38 54,39 63.752,40 71.633,41 45.006,42 42.034,44 10.1}
{0 CHEMBL258684,1 8.206,2 48.2,3 37.5,4 1.004,5 1.118,6 0.711,7 0.688,8 459.55,9 12.5,10 29,11 56,13 30,14 40,16 61,17 27,20 25,21 2,22 1,24 21,25 8,28 7,29 1,32 35,35 1.8,36 0.098,37 6,38 55.5,39 56.225,40 62.604,41 39.824,42 38.552,44 5.523}
{0 CHEMBL258685,1 7.579,2 43.1,3 43.1,4 1,5 1.128,6 0.678,7 0.648,8 439.57,9 12.1,10 23,11 58,13 24,14 37,16 62,17 25,20 19,21 6,22 1,24 25,25 8,28 7,29 1,32 33,35 1.7,36 0.129,37 8,38 49.5,39 57.992,40 65.434,41 39.347,42 37.606,44 7.276}
{0 CHEMBL258891,1 7.914,2 44.2,3 40.4,4 1.004,5 1.127,6 0.689,7 0.664,8 411.51,9 13.5,10 27,11 52,13 27,14 35,16 56,17 23,20 19,21 4,24 21,25 8,28 7,29 1,32 31,35 1.9,36 0.125,37 7,38 48.5,39 52.225,40 58.604,41 35.824,42 34.552,44 6.836}
{0 CHEMBL259114,1 7.737,2 43.6,3 41.8,4 1.002,5 1.128,6 0.683,7 0.656,8 425.54,9 12.7,10 23,11 55,13 24,14 36,16 59,17 24,20 19,21 5,22 1,24 23,25 8,28 7,29 1,32 32,35 1.8,36 0.119,37 7,38 48.5,39 55.109,40 62.019,41 37.586,42 36.079,44 7.745}
{0 CHEMBL259116,1 7.737,2 43.6,3 41.8,4 1.002,5 1.128,6 0.683,7 0.656,8 425.54,9 12.7,10 23,11 55,13 24,14 36,16 59,17 24,20 19,21 5,22 1,24 23,25 8,28 7,29 1,32 32,35 1.8,36 0.102,37 6,38 48.5,39 55.109,40 62.019,41 37.586,42 36.079,44 5.638}
{0 CHEMBL259353,1 7.737,2 43.6,3 41.8,4 1.002,5 1.128,6 0.683,7 0.656,8 425.54,9 12.7,10 23,11 55,13 24,14 36,16 59,17 24,20 19,21 5,22 1,24 23,25 8,28 7,29 1,32 32,35 1.8,36 0.119,37 7,38 48.5,39 55.109,40 62.019,41 37.586,42 36.079,44 7.409}
{0 CHEMBL259397,1 7.93,2 46,3 40,4 1.002,5 1.122,6 0.696,7 0.671,8 396.49,9 12,10 23,11 50,13 24,14 34,16 54,17 23,20 19,21 4,22 1,24 20,25 7,28 6,29 1,32 30,35 2,36 0.093,37 5,38 46.5,39 50.123,40 56.106,41 34.819,42 33.531,44 5}
{0 CHEMBL259575,1 8.69,2 43.6,3 38.2,4 1.017,5 1.133,6 0.698,7 0.678,8 477.97,9 12.7,10 23,11 55,13 24,14 38,16 59,17 24,18 1,20 19,21 5,22 1,23 1,24 21,25 10,26 1,28 7,29 1,32 34,34 2,35 1.8,36 0.119,37 7,38 50.5,39 55.945,40 62.303,41 38.381,42 37.29,43 3.6,44 6.37}
{0 CHEMBL260578,1 7.957,2 43.9,3 40.4,4 1.008,5 1.127,6 0.685,7 0.663,8 453.55,9 12.3,10 23,11 57,13 25,14 38,16 61,17 25,20 20,21 5,22 2,24 23,25 9,28 7,29 2,32 34,35 3.5,36 0.131,37 8,38 51.5,39 57.436,40 64.229,41 39.04,42 37.794,44 6.943}
{0 CHEMBL261248,1 7.746,2 45.3,3 41.5,4 1,5 1.123,6 0.69,7 0.661,8 410.52,9 11.3,10 23,11 53,13 24,14 35,16 57,17 24,20 19,21 5,22 1,24 22,25 7,28 6,29 1,32 31,35 1.9,36 0.105,37 6,38 47.5,39 53.007,40 59.521,41 36.58,42 35.058,44 6.812}
{0 CHEMBL261765,1 7.579,2 43.1,3 43.1,4 1,5 1.128,6 0.678,7 0.648,8 439.57,9 12.1,10 23,11 58,13 24,14 37,16 62,17 25,20 19,21 6,22 1,24 25,25 8,28 7,29 1,32 33,35 1.7,36 0.113,37 7,38 49.5,39 57.992,40 65.434,41 39.347,42 37.606,44 6.907}
{0 CHEMBL262098,1 8.363,2 43.6,3 40,4 1.008,5 1.127,6 0.699,7 0.671,8 459.98,9 12.7,10 23,11 55,13 24,14 37,16 59,17 24,18 1,20 19,21 5,22 1,24 22,25 9,26 1,28 7,29 1,32 33,34 1,35 1.8,36 0.119,37 7,38 49.5,39 55.432,40 61.963,41 38.443,42 36.906,43 1.8,44 7.119}
{0 CHEMBL264946,1 8.373,2 47.7,3 36.4,4 1.008,5 1.12,6 0.711,7 0.693,8 368.43,9 13.6,10 23,11 44,13 24,14 32,16 48,17 21,20 19,21 2,22 1,24 16,25 7,28 6,29 1,32 28,35 2.3,36 0.083,37 4,38 44.5,39 44.356,40 49.275,41 31.296,42 30.477,44 5}
{0 CHEMBL265208,1 7.579,2 43.1,3 43.1,4 1,5 1.128,6 0.678,7 0.648,8 439.57,9 12.1,10 23,11 58,13 24,14 37,16 62,17 25,20 19,21 6,22 1,24 25,25 8,28 7,29 1,32 33,35 1.7,36 0.113,37 7,38 49.5,39 57.992,40 65.434,41 39.347,42 37.606,44 7.046}
{0 CHEMBL265452,1 7.737,2 43.6,3 41.8,4 1.002,5 1.128,6 0.683,7 0.656,8 425.54,9 12.7,10 23,11 55,13 24,14 36,16 59,17 24,20 19,21 5,22 1,24 23,25 8,28 7,29 1,32 32,35 1.8,36 0.102,37 6,38 48.5,39 55.109,40 62.019,41 37.586,42 36.079,44 6.536}
{0 CHEMBL265697,1 7.914,2 44.2,3 40.4,4 1.004,5 1.127,6 0.689,7 0.664,8 411.51,9 13.5,10 23,11 52,13 24,14 35,16 56,17 23,20 19,21 4,22 1,24 21,25 8,28 7,29 1,32 31,35 1.9,36 0.089,37 5,38 47.5,39 52.225,40 58.604,41 35.824,42 34.552,44 5.728}
{0 CHEMBL265958,1 7.576,2 41.7,3 43.3,4 1.002,5 1.132,6 0.673,7 0.644,8 454.59,9 13.3,10 23,11 60,13 24,14 38,16 64,17 25,20 19,21 6,22 1,24 26,25 9,28 8,29 1,32 34,35 1.7,36 0.125,37 8,38 50.5,39 60.094,40 67.933,41 40.353,42 38.627,44 6.907}
{0 CHEMBL271264,1 8.595,2 42.9,3 42.9,4 1.004,5 1.121,6 0.695,7 0.657,8 601.62,9 8.6,10 22,11 70,13 26,14 44,16 74,17 30,20 22,21 8,22 4,24 30,25 10,26 1,28 6,29 3,32 40,35 4.3,36 0.149,37 11,38 59,39 70.29,40 78.467,41 48.676,42 45.99,44 9.9}
{0 CHEMBL288174,1 7.473,2 38.5,3 48.7,4 0.999,5 1.125,6 0.668,7 0.619,8 582.86,9 5.1,10 21,11 78,13 24,14 43,16 81,17 30,20 17,21 13,22 3,24 38,25 10,26 2,28 4,29 4,31 2,32 40,35 5.1,36 0.148,37 12,38 56.5,39 77.89,40 87.729,41 52.08,42 48.275,44 8.959}
{0 CHEMBL289614,1 7.121,2 39.5,3 49.4,4 0.996,5 1.126,6 0.657,7 0.613,8 576.83,9 4.9,10 22,11 81,13 25,14 44,16 84,17 32,20 19,21 13,22 3,24 40,25 9,26 1,28 4,29 4,31 1,32 41,35 4.9,36 0.143,37 12,38 58,39 80.698,40 91.224,41 53.194,42 49.614,44 8.678}
{0 CHEMBL294628,1 7.431,2 32.3,3 48.9,4 1.013,5 1.144,6 0.629,7 0.598,8 988.35,9 9.8,10 11,11 133,13 20,14 71,16 136,17 43,20 18,21 25,22 9,24 65,25 25,26 2,28 13,29 10,31 2,32 68,35 7.5,36 0.154,37 21,38 85.5,39 134.723,40 152.207,41 83.711,42 79.497,44 9.09}
{0 CHEMBL315104,1 7.431,2 43.9,3 43.9,4 0.994,5 1.127,6 0.682,7 0.647,8 423.57,9 12.3,10 27,11 57,13 27,14 36,16 61,17 25,20 19,21 6,24 25,25 7,28 7,32 32,36 0.098,37 6,38 49.5,39 56.665,40 64.225,41 38.892,42 36.891,44 9.097}
{0 CHEMBL315444,1 7.288,2 41,3 45.9,4 1,5 1.131,6 0.661,7 0.629,8 444.59,9 9.8,10 17,11 61,13 19,14 37,16 65,17 25,20 15,21 10,22 2,24 28,25 8,28 6,29 2,32 33,35 3.3,36 0.108,37 7,38 47.5,39 60.985,40 68.976,41 40.319,42 38.353,44 7.602}
{0 CHEMBL342261,1 7.409,2 41.8,3 45.5,4 1.006,5 1.125,6 0.658,7 0.631,8 407.51,9 5.5,10 17,11 55,13 19,14 32,16 57,17 23,20 17,21 6,22 2,24 25,25 7,28 3,29 4,32 30,35 7.3,36 0.175,37 10,38 42.5,39 55.334,40 61.9,41 36.211,42 34.718,44 7.917}
{0 CHEMBL344464,1 8.422,2 42,3 42,4 1.013,5 1.12,6 0.691,7 0.66,8 581.14,9 5.8,10 23,11 69,13 27,14 43,16 72,17 29,18 1,20 23,21 6,22 4,24 29,25 11,26 2,28 4,29 5,31 1,32 40,34 1,35 7.2,36 0.167,37 12,38 58.5,39 69.931,40 77.302,41 47.699,42 45.523,43 1.4,44 8.602}
{0 CHEMBL358359,1 7.166,2 40.6,3 46.9,4 0.998,5 1.131,6 0.657,7 0.623,8 458.62,9 9.4,10 17,11 64,13 19,14 38,16 68,17 26,20 15,21 11,22 2,24 30,25 8,28 6,29 2,32 34,35 3.1,36 0.103,37 7,38 48.5,39 63.869,40 72.391,41 42.08,42 39.88,44 7.854}
{0 CHEMBL392514,1 7.65,2 36.1,3 49.2,4 1.006,5 1.126,6 0.66,7 0.613,8 466.68,9 3.3,10 11,11 61,13 15,14 32,16 62,17 22,20 12,21 10,22 4,24 30,25 9,26 2,28 2,29 5,31 2,32 31,35 8.2,36 0.177,37 11,38 41.5,39 61.363,40 68.696,41 40.239,42 37.366,44 5}
{0 CHEMBL394734,1 7.754,2 42.3,3 46.2,4 1,5 1.115,6 0.686,7 0.64,8 604.85,9 2.6,10 23,11 78,13 27,14 45,16 81,17 33,20 24,21 9,22 4,24 36,25 9,26 2,28 2,29 5,31 2,32 42,35 6.4,36 0.16,37 13,38 60.5,39 78.014,40 86.942,41 53.523,42 49.947,44 5}
{0 CHEMBL394964,1 7.951,2 36.4,3 48.5,4 1.005,5 1.122,6 0.676,7 0.622,8 524.79,9 3,10 11,11 66,13 15,14 36,16 68,17 24,20 12,21 12,22 4,24 32,25 10,26 3,28 2,29 5,31 3,32 34,35 7.6,36 0.162,37 11,38 45.5,39 66.323,40 74.032,41 44.648,42 41.08,44 5}
{0 CHEMBL395387,1 7.641,2 38.4,3 47.9,4 1.003,5 1.124,6 0.668,7 0.622,8 557.8,9 4.1,10 17,11 73,13 21,14 40,16 75,17 28,20 17,21 11,22 4,24 35,25 10,26 2,28 3,29 5,31 2,32 38,35 6.8,36 0.173,37 13,38 52.5,39 73.232,40 82.025,41 48.767,42 45.441,44 5}
{0 CHEMBL396849,1 7.511,2 35.3,3 50,4 1.007,5 1.128,6 0.65,7 0.605,8 510.74,9 2.9,10 11,11 68,13 15,14 35,16 69,17 24,20 12,21 12,22 4,24 34,25 10,26 2,28 2,29 6,31 2,32 34,35 8.8,36 0.188,37 13,38 44.5,39 68.458,40 76.736,41 44.216,42 41.135,44 5}
{0 CHEMBL396850,1 7.583,2 36.5,3 49.2,4 1.002,5 1.127,6 0.663,7 0.614,8 477.71,9 4.8,10 11,11 63,13 15,14 33,16 64,17 23,19 1,20 11,21 11,22 3,24 31,25 9,26 2,28 3,29 4,31 2,32 32,33 1,35 6.3,36 0.188,37 12,38 43.5,39 63.138,40 70.985,41 41.79,42 38.673,44 5}
{0 CHEMBL397084,1 7.65,2 36.1,3 49.2,4 1.006,5 1.126,6 0.66,7 0.613,8 466.68,9 3.3,10 11,11 61,13 15,14 32,16 62,17 22,20 12,21 10,22 4,24 30,25 9,26 2,28 2,29 5,31 2,32 31,35 8.2,36 0.177,37 11,38 41.5,39 61.363,40 68.696,41 40.239,42 37.366,44 5}
{0 CHEMBL408187,1 7.746,2 45.3,3 41.5,4 1,5 1.123,6 0.69,7 0.661,8 410.52,9 11.3,10 23,11 53,13 24,14 35,16 57,17 24,20 19,21 5,22 1,24 22,25 7,28 6,29 1,32 31,35 1.9,36 0.105,37 6,38 47.5,39 53.007,40 59.521,41 36.58,42 35.058,44 5.523}
{0 CHEMBL408188,1 8.064,2 43.6,3 40,4 1.011,5 1.134,6 0.682,7 0.663,8 443.53,9 12.7,10 23,11 55,13 24,14 37,16 59,17 24,20 19,21 5,22 1,23 1,24 22,25 9,28 7,29 1,32 33,34 1,35 1.8,36 0.119,37 7,38 49.5,39 55.621,40 62.359,41 37.523,42 36.462,43 1.8,44 7.155}
{0 CHEMBL408227,1 8.363,2 43.6,3 40,4 1.008,5 1.127,6 0.699,7 0.671,8 459.98,9 12.7,10 23,11 55,13 24,14 37,16 59,17 24,18 1,20 19,21 5,22 1,24 22,25 9,26 1,28 7,29 1,32 33,34 1,35 1.8,36 0.119,37 7,38 49.5,39 55.432,40 61.963,41 38.443,42 36.906,43 1.8,44 6.775}
{0 CHEMBL408403,1 7.167,2 34.2,3 48.6,4 1.013,5 1.144,6 0.621,7 0.597,8 1046.34,9 8.9,10 17,11 146,13 27,14 78,16 149,17 50,20 25,21 25,22 10,24 71,25 25,28 13,29 12,32 75,35 8.2,36 0.195,37 29,38 96.5,39 147.875,40 167.032,41 90.609,42 87.133,44 9.398}
{0 CHEMBL409095,1 7.722,2 42.4,3 42.4,4 1.005,5 1.13,6 0.675,7 0.65,8 455.57,9 11.9,10 23,11 59,13 24,14 38,16 63,17 25,20 19,21 6,22 1,24 25,25 9,28 7,29 2,32 34,35 3.4,36 0.127,37 8,38 50.5,39 59.32,40 66.644,41 39.801,42 38.321,44 6.588}
{0 CHEMBL409722,1 7.737,2 43.6,3 41.8,4 1.002,5 1.128,6 0.683,7 0.656,8 425.54,9 12.7,10 27,11 55,13 27,14 36,16 59,17 24,20 19,21 5,24 23,25 8,28 7,29 1,32 32,35 1.8,36 0.136,37 8,38 49.5,39 55.109,40 62.019,41 37.586,42 36.079,44 6.595}
{0 CHEMBL409744,1 7.914,2 44.2,3 40.4,4 1.004,5 1.127,6 0.689,7 0.664,8 411.51,9 13.5,10 23,11 52,13 24,14 35,16 56,17 23,20 19,21 4,22 1,24 21,25 8,28 7,29 1,32 31,35 1.9,36 0.107,37 6,38 47.5,39 52.225,40 58.604,41 35.824,42 34.552,44 6.967}
{0 CHEMBL410105,1 7.579,2 43.1,3 43.1,4 1,5 1.128,6 0.678,7 0.648,8 439.57,9 12.1,10 23,11 58,13 24,14 37,16 62,17 25,20 19,21 6,22 1,24 25,25 8,28 7,29 1,32 33,35 1.7,36 0.113,37 7,38 49.5,39 57.992,40 65.434,41 39.347,42 37.606,44 7.092}
{0 CHEMBL410125,1 7.581,2 44.6,3 42.9,4 0.998,5 1.124,6 0.685,7 0.653,8 424.55,9 10.7,10 23,11 56,13 24,14 36,16 60,17 25,20 20,21 5,22 1,24 24,25 7,28 6,29 1,32 32,35 1.8,36 0.117,37 7,38 48.5,39 55.891,40 62.936,41 38.341,42 36.584,44 6.223}
{0 CHEMBL410325,1 7.581,2 44.6,3 42.9,4 0.998,5 1.124,6 0.685,7 0.653,8 424.55,9 10.7,10 23,11 56,13 24,14 36,16 60,17 25,20 19,21 6,22 1,24 24,25 7,28 6,29 1,32 32,35 1.8,36 0.117,37 7,38 48.5,39 55.891,40 62.936,41 38.341,42 36.584,44 7.022}
{0 CHEMBL410487,1 8.363,2 43.6,3 40,4 1.008,5 1.127,6 0.699,7 0.671,8 459.98,9 12.7,10 23,11 55,13 24,14 37,16 59,17 24,18 1,20 19,21 5,22 1,24 22,25 9,26 1,28 7,29 1,32 33,34 1,35 1.8,36 0.119,37 7,38 49.5,39 55.432,40 61.963,41 38.443,42 36.906,43 1.8,44 6.336}
{0 CHEMBL416477,1 7.821,2 43.4,3 41.5,4 1.006,5 1.127,6 0.68,7 0.656,8 414.51,9 11.3,10 23,11 53,13 24,14 34,16 56,17 23,20 19,21 4,22 1,24 22,25 8,28 6,29 2,32 31,35 3.8,36 0.143,37 8,38 46.5,39 53.334,40 59.73,41 36.034,42 34.772,44 9.215}
{0 CHEMBL421473,1 7.81,2 41.8,3 41.8,4 1.008,5 1.131,6 0.673,7 0.651,8 429.53,9 12.7,10 23,11 55,13 24,14 35,16 58,17 23,20 18,21 5,22 1,24 23,25 9,28 7,29 2,32 32,35 3.6,36 0.138,37 8,38 47.5,39 55.436,40 62.229,41 37.04,42 35.794,44 8.556}
{0 CHEMBL427738,1 7.51,2 41.2,3 44.1,4 1.003,5 1.132,6 0.667,7 0.638,8 510.66,9 11.8,10 23,11 68,13 24,14 43,16 73,17 28,20 19,21 9,22 1,24 30,25 10,28 8,29 2,32 38,35 2.9,36 0.11,37 8,38 55.5,39 68.189,40 76.972,41 45.33,42 43.396,44 6.222}
{0 CHEMBL429847,1 7.925,2 42.9,3 42.9,4 1.004,5 1.122,6 0.688,7 0.654,8 554.73,9 8.6,10 22,11 70,13 26,14 44,16 74,17 30,20 22,21 8,22 4,24 30,25 10,26 1,28 6,29 3,31 1,32 40,35 4.3,36 0.149,37 11,38 59,39 70.272,40 78.52,41 48.182,42 45.781,44 10}
{0 CHEMBL430388,1 7.524,2 39.2,3 48.6,4 1,5 1.121,6 0.669,7 0.621,8 556.81,9 2.7,10 17,11 74,13 21,14 40,16 76,17 29,20 18,21 11,22 4,24 36,25 9,26 2,28 2,29 5,31 2,32 38,35 6.8,36 0.171,37 13,38 52.5,39 74.014,40 82.942,41 49.523,42 45.947,44 5}
{0 CHEMBL437377,1 7.384,2 35.8,3 50.7,4 1.002,5 1.127,6 0.653,7 0.603,8 494.74,9 3,10 11,11 67,13 15,14 34,16 68,17 24,20 12,21 12,22 4,24 34,25 9,26 2,28 2,29 5,31 2,32 33,35 7.5,36 0.176,37 12,38 43.5,39 67.131,40 75.527,41 43.762,42 40.42,44 5}
{0 CHEMBL465097,1 8.151,2 43.9,3 42.1,4 1.011,5 1.115,6 0.69,7 0.66,8 464.58,9 3.5,10 22,11 57,13 25,14 36,16 60,17 25,20 20,21 5,22 3,24 24,25 8,26 1,28 2,29 5,31 1,32 33,35 8.8,36 0.133,37 8,38 50,39 57.636,40 63.531,41 39.307,42 37.599,44 6.6}
{0 CHEMBL465929,1 7.425,2 41.4,3 47.1,4 0.999,5 1.121,6 0.67,7 0.629,8 519.72,9 4.3,10 22,11 70,13 25,14 40,16 73,17 29,20 20,21 9,22 3,24 33,25 8,26 1,28 3,29 4,31 1,32 37,35 5.7,36 0.164,37 12,38 54,39 69.945,40 78.481,41 46.904,42 44.012,44 7}
{0 CHEMBL471334,1 7.232,2 44.4,3 46,4 0.996,5 1.119,6 0.671,7 0.636,8 455.6,9 4.8,10 22,11 63,13 24,14 37,16 66,17 28,20 21,21 7,22 2,24 29,25 6,28 3,29 3,32 34,35 4.8,36 0.136,37 9,38 50,39 62.774,40 70.521,41 42.279,42 40.057,44 7.7}
{0 CHEMBL471505,1 7.116,2 43.9,3 47,4 0.995,5 1.12,6 0.667,7 0.63,8 469.63,9 4.5,10 22,11 66,13 24,14 38,16 69,17 29,20 21,21 8,22 2,24 31,25 6,28 3,29 3,32 35,35 4.5,36 0.145,37 10,38 51,39 65.658,40 73.936,41 44.04,42 41.584,44 7.1}
{0 CHEMBL479367,1 7.604,2 40.6,3 46.4,4 1.007,5 1.122,6 0.664,7 0.629,8 524.69,9 2.9,10 18,11 69,13 22,14 39,16 71,17 28,20 20,21 8,22 4,24 32,25 9,26 1,28 2,29 6,31 1,32 37,35 8.7,36 0.169,37 12,38 52,39 69.498,40 77.401,41 45.807,42 43.421,44 5}
{0 CHEMBL479399,1 7.452,2 36.8,3 50,4 1.002,5 1.125,6 0.658,7 0.609,8 506.75,9 2.9,10 11,11 68,13 15,14 36,16 70,17 25,20 12,21 13,22 4,24 34,25 9,26 2,28 2,29 5,31 2,32 34,35 7.4,36 0.143,37 10,38 45.5,39 68.131,40 76.527,41 44.762,42 41.42,44 5}
{0 CHEMBL479626,1 7.548,2 41.8,3 46.3,4 1.001,5 1.12,6 0.674,7 0.634,8 505.69,9 4.5,10 22,11 67,13 25,14 39,16 70,17 28,20 20,21 8,22 3,24 31,25 8,26 1,28 3,29 4,31 1,32 36,35 6,36 0.157,37 11,38 53,39 67.061,40 75.065,41 45.142,42 42.486,44 7.1}
{0 CHEMBL480017,1 7.993,2 43.1,3 43.1,4 1.007,5 1.118,6 0.687,7 0.654,8 463.6,9 5.2,10 22,11 58,13 25,14 36,16 61,17 25,20 20,21 5,22 3,24 25,25 8,26 1,28 3,29 4,31 1,32 33,35 6.9,36 0.131,37 8,38 50,39 58.411,40 64.82,41 39.858,42 37.905,44 6.7}
{0 CHEMBL480018,1 7.83,2 42.6,3 44.3,4 1.005,5 1.119,6 0.682,7 0.646,8 477.63,9 4.9,10 22,11 61,13 25,14 37,16 64,17 26,20 20,21 6,22 3,24 27,25 8,26 1,28 3,29 4,31 1,32 34,35 6.6,36 0.141,37 9,38 51,39 61.294,40 68.235,41 41.62,42 39.432,44 6.9}
{0 CHEMBL480122,1 7.481,2 41.2,3 47.1,4 1.003,5 1.12,6 0.667,7 0.628,8 508.69,9 2.9,10 18,11 68,13 22,14 38,16 70,17 28,20 20,21 8,22 4,24 32,25 8,26 1,28 2,29 5,31 1,32 36,35 7.4,36 0.157,37 11,38 51,39 68.171,40 76.192,41 45.353,42 42.706,44 5}
{0 CHEMBL480340,1 7.645,2 39.4,3 47.9,4 1.002,5 1.12,6 0.673,7 0.626,8 542.78,9 2.8,10 17,11 71,13 21,14 39,16 73,17 28,20 18,21 10,22 4,24 34,25 9,26 2,28 2,29 5,31 2,32 37,35 7,36 0.164,37 12,38 51.5,39 71.131,40 79.527,41 47.762,42 44.42,44 5}
{0 CHEMBL480341,1 8.553,2 37.7,3 44.3,4 1.013,5 1.119,6 0.695,7 0.648,8 521.74,9 4.9,10 16,11 61,13 20,14 36,16 63,17 23,20 15,21 8,22 4,24 27,25 11,26 3,28 3,29 5,31 3,32 34,35 8.2,36 0.175,37 11,38 48,39 61.774,40 68.284,41 42.369,42 39.521,44 5}
{0 CHEMBL480506,1 7.362,2 40.8,3 47.9,4 1.001,5 1.121,6 0.664,7 0.623,8 522.72,9 2.8,10 18,11 71,13 22,14 39,16 73,17 29,20 20,21 9,22 4,24 34,25 8,26 1,28 2,29 5,31 1,32 37,35 7,36 0.164,37 12,38 52,39 71.054,40 79.607,41 47.114,42 44.233,44 5}
{0 CHEMBL480507,1 7.458,2 37.9,3 48.3,4 1.007,5 1.127,6 0.652,7 0.615,8 432.59,9 3.4,10 12,11 58,13 16,14 31,16 59,17 22,20 14,21 8,22 4,24 28,25 8,26 1,28 2,29 5,31 1,32 30,35 8.6,36 0.169,37 10,38 41,39 58.403,40 65.361,41 37.83,42 35.652,44 5}
{0 CHEMBL480906,1 7.776,2 39.7,3 47.1,4 1.004,5 1.119,6 0.676,7 0.631,8 528.75,9 2.9,10 17,11 68,13 21,14 38,16 70,17 27,20 18,21 9,22 4,24 32,25 9,26 2,28 2,29 5,31 2,32 36,35 7.4,36 0.171,37 12,38 50.5,39 68.247,40 76.112,41 46,42 42.893,44 5}
{0 CHEMBL481088,1 7.65,2 36.1,3 49.2,4 1.006,5 1.126,6 0.66,7 0.613,8 466.68,9 3.3,10 11,11 61,13 15,14 32,16 62,17 22,20 12,21 10,22 4,24 30,25 9,26 2,28 2,29 5,31 2,32 31,35 8.2,36 0.161,37 10,38 41.5,39 61.363,40 68.696,41 40.239,42 37.366,44 5}
{0 CHEMBL481089,1 7.511,2 35.9,3 50,4 1.004,5 1.127,6 0.656,7 0.608,8 480.71,9 3.1,10 11,11 64,13 15,14 33,16 65,17 23,20 12,21 11,22 4,24 32,25 9,26 2,28 2,29 5,31 2,32 32,35 7.8,36 0.169,37 11,38 42.5,39 64.247,40 72.112,41 42,42 38.893,44 5}
{0 CHEMBL481106,1 7.708,2 36.4,3 48.5,4 1.009,5 1.126,6 0.658,7 0.615,8 508.72,9 3,10 11,11 66,13 15,14 36,16 68,17 24,20 12,21 12,22 4,24 32,25 10,26 2,28 2,29 6,31 2,32 34,35 9.1,36 0.147,37 10,38 45.5,39 66.574,40 74.321,41 43.455,42 40.608,44 5}
{0 CHEMBL481294,1 6.982,2 37.1,3 51.4,4 0.999,5 1.129,6 0.641,7 0.597,8 488.71,9 2.9,10 12,11 70,13 16,14 35,16 71,17 26,20 14,21 12,22 4,24 36,25 8,26 1,28 2,29 5,31 1,32 34,35 7.1,36 0.169,37 12,38 45,39 69.938,40 79.022,41 44.875,42 41.759,44 5}
{0 CHEMBL481664,1 7.362,2 40.8,3 47.9,4 1.001,5 1.121,6 0.664,7 0.623,8 522.72,9 2.8,10 18,11 71,13 22,14 39,16 73,17 29,20 20,21 9,22 4,24 34,25 8,26 1,28 2,29 5,31 1,32 37,35 7,36 0.164,37 12,38 52,39 71.054,40 79.607,41 47.114,42 44.233,44 5}
{0 CHEMBL486847,1 7.517,2 47.8,3 43.3,4 0.997,5 1.112,6 0.691,7 0.658,8 503.64,9 4.5,10 28,11 67,13 30,14 42,16 71,17 32,20 27,21 5,22 2,24 29,25 6,28 3,29 3,32 38,35 4.5,36 0.127,37 9,38 58,39 66.774,40 74.521,41 46.279,42 44.057,44 6.6}
{0 CHEMBL486848,1 8.031,2 47.8,3 41.8,4 1.001,5 1.111,6 0.704,7 0.67,8 538.08,9 4.5,10 28,11 67,13 30,14 43,16 71,17 32,18 1,20 27,21 5,22 2,24 28,25 7,26 1,28 3,29 3,32 39,34 1,35 4.5,36 0.127,37 9,38 59,39 67.098,40 74.465,41 47.137,42 44.884,43 1.5,44 6.5}
{0 CHEMBL488883,1 8.031,2 47.8,3 41.8,4 1.001,5 1.111,6 0.704,7 0.67,8 538.08,9 4.5,10 28,11 67,13 30,14 43,16 71,17 32,18 1,20 27,21 5,22 2,24 28,25 7,26 1,28 3,29 3,32 39,34 1,35 4.5,36 0.127,37 9,38 59,39 67.098,40 74.465,41 47.137,42 44.884,43 1.5,44 6.2}
{0 CHEMBL511490,1 6.982,2 37.1,3 51.4,4 0.999,5 1.129,6 0.641,7 0.597,8 488.71,9 2.9,10 12,11 70,13 16,14 35,16 71,17 26,20 14,21 12,22 4,24 36,25 8,26 1,28 2,29 5,31 1,32 34,35 7.1,36 0.169,37 12,38 45,39 69.938,40 79.022,41 44.875,42 41.759,44 5}
{0 CHEMBL517230,1 7.682,2 42.2,3 45.3,4 1.003,5 1.12,6 0.678,7 0.64,8 491.66,9 4.7,10 22,11 64,13 25,14 38,16 67,17 27,20 20,21 7,22 3,24 29,25 8,26 1,28 3,29 4,31 1,32 35,35 6.3,36 0.149,37 10,38 52,39 64.178,40 71.65,41 43.381,42 40.959,44 7.1}
{0 CHEMBL517626,1 7.375,2 41.9,3 47.3,4 0.998,5 1.12,6 0.671,7 0.629,8 545.76,9 4.1,10 22,11 74,13 25,14 43,16 78,17 31,20 20,21 11,22 3,24 35,25 8,26 1,28 3,29 4,31 1,32 39,35 5.4,36 0.128,37 10,38 57,39 73.829,40 82.896,41 49.665,42 46.539,44 7.9}
{0 CHEMBL517685,1 7.58,2 36.9,3 49.2,4 1.004,5 1.125,6 0.662,7 0.614,8 492.72,9 3.1,10 11,11 65,13 15,14 35,16 67,17 24,20 12,21 12,22 4,24 32,25 9,26 2,28 2,29 5,31 2,32 33,35 7.7,36 0.149,37 10,38 44.5,39 65.247,40 73.112,41 43,42 39.893,44 5}
{0 CHEMBL518157,1 7.975,2 36.4,3 47.3,4 1.011,5 1.125,6 0.668,7 0.624,8 438.62,9 3.6,10 11,11 55,13 15,14 30,16 56,17 20,20 12,21 8,22 4,24 26,25 9,26 2,28 2,29 5,31 2,32 29,35 9.1,36 0.179,37 10,38 39.5,39 55.596,40 61.866,41 36.716,42 34.313,44 5}
{0 CHEMBL518230,1 7.548,2 41.8,3 46.3,4 1.001,5 1.12,6 0.674,7 0.634,8 505.69,9 4.5,10 22,11 67,13 25,14 39,16 70,17 28,20 20,21 8,22 3,24 31,25 8,26 1,28 3,29 4,31 1,32 36,35 6,36 0.143,37 10,38 53,39 67.061,40 75.065,41 45.142,42 42.486,44 7.2}
{0 CHEMBL518388,1 7.425,2 41.4,3 47.1,4 0.999,5 1.121,6 0.67,7 0.629,8 519.72,9 4.3,10 22,11 70,13 25,14 40,16 73,17 29,20 20,21 9,22 3,24 33,25 8,26 1,28 3,29 4,31 1,32 37,35 5.7,36 0.137,37 10,38 54,39 69.945,40 78.481,41 46.904,42 44.012,44 8.4}
{0 CHEMBL519274,1 7.721,2 37.1,3 48.4,4 1.006,5 1.124,6 0.665,7 0.619,8 478.69,9 3.2,10 11,11 62,13 15,14 34,16 64,17 23,20 12,21 11,22 4,24 30,25 9,26 2,28 2,29 5,31 2,32 32,35 8.1,36 0.172,37 11,38 43.5,39 62.363,40 69.696,41 41.239,42 38.366,44 5}
{0 CHEMBL519564,1 7.01,2 43.5,3 47.8,4 0.993,5 1.121,6 0.664,7 0.625,8 483.66,9 4.3,10 22,11 69,13 24,14 39,16 72,17 30,20 21,21 9,22 2,24 33,25 6,28 3,29 3,32 36,35 4.3,36 0.153,37 11,38 52,39 68.541,40 77.351,41 45.802,42 43.111,44 6.4}
{0 CHEMBL520421,1 7.335,2 36.6,3 50.7,4 1,5 1.126,6 0.655,7 0.605,8 520.78,9 2.8,10 11,11 71,13 15,14 37,16 73,17 26,20 12,21 14,22 4,24 36,25 9,26 2,28 2,29 5,31 2,32 35,35 7,36 0.151,37 11,38 46.5,39 71.014,40 79.942,41 46.523,42 42.947,44 5}
{0 CHEMBL521093,1 7.384,2 35.8,3 50.7,4 1.002,5 1.127,6 0.653,7 0.603,8 494.74,9 3,10 11,11 67,13 15,14 34,16 68,17 24,20 12,21 12,22 4,24 34,25 9,26 2,28 2,29 5,31 2,32 33,35 7.5,36 0.176,37 12,38 43.5,39 67.131,40 75.527,41 43.762,42 40.42,44 5}
{0 CHEMBL565379,1 6.687,2 40.7,3 50.8,4 0.992,5 1.126,6 0.645,7 0.603,8 394.56,9 3.4,10 16,11 59,13 17,14 31,16 61,17 24,20 14,21 10,22 1,24 30,25 5,28 2,29 3,32 29,35 5.1,36 0.148,37 9,38 40,39 58.556,40 66.438,41 38.034,42 35.562,44 5}
{0 CHEMBL565793,1 6.915,2 41.5,3 49.1,4 0.996,5 1.125,6 0.651,7 0.613,8 366.5,9 3.8,10 16,11 53,13 17,14 29,16 55,17 22,20 14,21 8,22 1,24 26,25 5,28 2,29 3,32 27,35 5.7,36 0.164,37 9,38 38,39 52.789,40 59.607,41 34.512,42 32.509,44 5}
{0 CHEMBL566614,1 7.323,2 43.3,3 44.8,4 0.993,5 1.128,6 0.678,7 0.641,8 490.67,9 11.9,10 31,11 67,13 31,14 42,16 72,17 29,20 21,21 8,24 30,25 8,28 8,32 37,36 0.111,37 8,38 57.5,39 66.534,40 75.554,41 45.421,42 42.966,44 7.873}
{0 CHEMBL567054,1 7.398,2 40.8,3 44.9,4 1,5 1.133,6 0.665,7 0.634,8 362.48,9 12.2,10 21,11 49,13 21,14 30,16 52,17 20,20 14,21 6,24 22,25 7,28 6,29 1,32 27,35 2,36 0.135,37 7,38 40.5,39 49.007,40 55.521,41 32.58,42 31.058,44 5.296}
{0 CHEMBL567063,1 6.84,2 43.4,3 49.1,4 0.99,5 1.121,6 0.661,7 0.619,8 362.51,9 3.8,10 16,11 53,13 18,14 29,16 55,17 23,20 16,21 7,22 2,24 26,25 4,28 2,29 2,32 27,35 3.8,36 0.145,37 8,38 39,39 52.461,40 59.398,41 35.057,42 32.794,44 5}
{0 CHEMBL567269,1 6.502,2 40,3 52.3,4 0.99,5 1.127,6 0.639,7 0.594,8 422.62,9 3.1,10 16,11 65,13 17,14 33,16 67,17 26,20 14,21 12,22 1,24 34,25 5,28 2,29 3,32 31,35 4.6,36 0.164,37 11,38 42,39 64.323,40 73.268,41 41.557,42 38.616,44 5}
{0 CHEMBL567689,1 6.628,2 41.8,3 50.9,4 0.988,5 1.124,6 0.651,7 0.606,8 364.53,9 3.6,10 16,11 55,13 17,14 29,16 57,17 23,20 14,21 9,22 1,24 28,25 4,28 2,29 2,32 27,35 3.6,36 0.158,37 9,38 38,39 54.345,40 61.813,41 35.819,42 33.321,44 5}
{0 CHEMBL567897,1 7.069,2 41.2,3 47.1,4 0.991,5 1.132,6 0.664,7 0.625,8 360.51,9 11.8,10 21,11 51,13 21,14 30,16 54,17 21,20 14,21 7,24 24,25 6,28 6,32 27,36 0.13,37 7,38 40.5,39 50.563,40 57.727,41 33.887,42 31.87,44 5.547}
{0 CHEMBL567898,1 7.334,2 42.3,3 45.1,4 0.996,5 1.129,6 0.671,7 0.637,8 520.7,9 11.3,10 31,11 71,13 31,14 44,16 76,17 30,20 21,21 9,24 32,25 9,28 8,29 1,32 39,35 1.4,36 0.132,37 10,38 59.5,39 70.745,40 80.178,41 47.637,42 45.208,44 5.791}
{0 CHEMBL571763,1 7.088,2 43.8,3 47.2,4 0.994,5 1.12,6 0.666,7 0.629,8 630.85,9 4.5,10 32,11 89,13 33,14 52,16 94,17 39,20 27,21 12,22 1,24 42,25 8,28 4,29 4,32 47,35 4.5,36 0.149,37 14,38 69,39 88.505,40 99.72,41 59.307,42 55.954,44 5.596}
{0 CHEMBL572276,1 7.263,2 44.6,3 45.8,4 0.997,5 1.119,6 0.672,7 0.637,8 602.79,9 4.8,10 32,11 83,13 33,14 50,16 88,17 37,20 27,21 10,22 1,24 38,25 8,28 4,29 4,32 45,35 4.8,36 0.136,37 12,38 67,39 82.738,40 92.889,41 55.785,42 52.9,44 5.652}
{0 CHEMBL584704,1 6.859,2 42.5,3 49.3,4 0.994,5 1.122,6 0.654,7 0.614,8 500.69,9 2.7,10 22,11 73,13 23,14 40,16 76,17 31,20 20,21 11,22 1,24 36,25 6,28 2,29 4,32 37,35 5.5,36 0.171,37 13,38 52,39 72.534,40 81.893,41 47.773,42 44.858,44 5}
{0 CHEMBL7550,1 7.584,2 44.4,3 42.6,4 0.996,5 1.126,6 0.688,7 0.655,8 409.54,9 13,10 27,11 54,13 27,14 35,16 58,17 24,20 19,21 5,24 23,25 7,28 7,32 31,36 0.086,37 5,38 48.5,39 53.781,40 60.81,41 37.131,42 35.364,44 9.373}
{0 CHEMBL7632,1 7.255,2 47.2,3 45.3,4 0.992,5 1.113,6 0.685,7 0.647,8 384.51,9 3.8,10 22,11 53,13 23,14 32,16 56,17 25,20 20,21 5,22 1,24 24,25 4,28 2,29 2,32 29,35 3.8,36 0.125,37 7,38 44,39 52.578,40 58.983,41 36.296,42 34.267,44 8.5}
{0 CHEMBL813,1 7.862,2 42.6,3 44.4,4 1.006,5 1.117,6 0.682,7 0.646,8 424.56,9 3.7,10 16,11 54,13 19,14 32,16 56,17 23,20 17,21 6,22 3,24 24,25 7,26 1,28 2,29 4,31 1,32 30,35 7.4,36 0.179,37 10,38 43,39 54.309,40 60.321,41 36.852,42 34.884,44 8.8}
{0 CHEMBL86247,1 7.807,2 45.8,3 40.7,4 0.998,5 1.124,6 0.697,7 0.668,8 460.59,9 13.6,10 32,11 59,13 32,14 40,16 64,17 27,20 22,21 5,24 24,25 8,28 8,32 35,36 0.078,37 5,38 56,39 58.883,40 66.308,41 41.137,42 39.386,44 8.161}
{0 CHEMBL89877,1 7.81,2 41.8,3 41.8,4 1.008,5 1.131,6 0.673,7 0.651,8 429.53,9 12.7,10 23,11 55,13 24,14 35,16 58,17 23,20 18,21 5,22 1,24 23,25 9,28 7,29 2,32 32,35 3.6,36 0.155,37 9,38 47.5,39 55.436,40 62.229,41 37.04,42 35.794,44 7.686}
