{
  "data_features": {
    "feature": [
      {
        "data_type": "nominal",
        "index": "0",
        "is_ignore": "false",
        "is_row_identifier": "true",
        "is_target": "false",
        "name": "molecule_id",
        "nominal_value": [
          "CHEMBL1016",
          "CHEMBL1017",
          "CHEMBL1069",
          "CHEMBL1202852",
          "CHEMBL1237156",
          "CHEMBL1237157",
          "CHEMBL128318",
          "CHEMBL131365",
          "CHEMBL141065",
          "CHEMBL143118",
          "CHEMBL146275",
          "CHEMBL189568",
          "CHEMBL191",
          "CHEMBL2111971",
          "CHEMBL2111972",
          "CHEMBL2111973",
          "CHEMBL217673",
          "CHEMBL239393",
          "CHEMBL239394",
          "CHEMBL239396",
          "CHEMBL241696",
          "CHEMBL241697",
          "CHEMBL245434",
          "CHEMBL245840",
          "CHEMBL246043",
          "CHEMBL246044",
          "CHEMBL246253",
          "CHEMBL246254",
          "CHEMBL246255",
          "CHEMBL246459",
          "CHEMBL246460",
          "CHEMBL246461",
          "CHEMBL246665",
          "CHEMBL246666",
          "CHEMBL246667",
          "CHEMBL246875",
          "CHEMBL246876",
          "CHEMBL246877",
          "CHEMBL247079",
          "CHEMBL247482",
          "CHEMBL255111",
          "CHEMBL255532",
          "CHEMBL257671",
          "CHEMBL257869",
          "CHEMBL257870",
          "CHEMBL258684",
          "CHEMBL258685",
          "CHEMBL258891",
          "CHEMBL259114",
          "CHEMBL259116",
          "CHEMBL259353",
          "CHEMBL259397",
          "CHEMBL259575",
          "CHEMBL260578",
          "CHEMBL261248",
          "CHEMBL261765",
          "CHEMBL262098",
          "CHEMBL264946",
          "CHEMBL265208",
          "CHEMBL265452",
          "CHEMBL265697",
          "CHEMBL265958",
          "CHEMBL271264",
          "CHEMBL288174",
          "CHEMBL289614",
          "CHEMBL294628",
          "CHEMBL315104",
          "CHEMBL315444",
          "CHEMBL342261",
          "CHEMBL344464",
          "CHEMBL358359",
          "CHEMBL392514",
          "CHEMBL394734",
          "CHEMBL394964",
          "CHEMBL395387",
          "CHEMBL396849",
          "CHEMBL396850",
          "CHEMBL397084",
          "CHEMBL408187",
          "CHEMBL408188",
          "CHEMBL408227",
          "CHEMBL408403",
          "CHEMBL409095",
          "CHEMBL409722",
          "CHEMBL409744",
          "CHEMBL410105",
          "CHEMBL410125",
          "CHEMBL410325",
          "CHEMBL410487",
          "CHEMBL416477",
          "CHEMBL421473",
          "CHEMBL427738",
          "CHEMBL429847",
          "CHEMBL430388",
          "CHEMBL437377",
          "CHEMBL465097",
          "CHEMBL465929",
          "CHEMBL471334",
          "CHEMBL471505",
          "CHEMBL479367",
          "CHEMBL479399",
          "CHEMBL479626",
          "CHEMBL480017",
          "CHEMBL480018",
          "CHEMBL480122",
          "CHEMBL480340",
          "CHEMBL480341",
          "CHEMBL480506",
          "CHEMBL480507",
          "CHEMBL480906",
          "CHEMBL481088",
          "CHEMBL481089",
          "CHEMBL481106",
          "CHEMBL481294",
          "CHEMBL481664",
          "CHEMBL486847",
          "CHEMBL486848",
          "CHEMBL488883",
          "CHEMBL511490",
          "CHEMBL517230",
          "CHEMBL517626",
          "CHEMBL517685",
          "CHEMBL518157",
          "CHEMBL518230",
          "CHEMBL518388",
          "CHEMBL519274",
          "CHEMBL519564",
          "CHEMBL520421",
          "CHEMBL521093",
          "CHEMBL565379",
          "CHEMBL565793",
          "CHEMBL566614",
          "CHEMBL567054",
          "CHEMBL567063",
          "CHEMBL567269",
          "CHEMBL567689",
          "CHEMBL567897",
          "CHEMBL567898",
          "CHEMBL571763",
          "CHEMBL572276",
          "CHEMBL584704",
          "CHEMBL7550",
          "CHEMBL7632",
          "CHEMBL813",
          "CHEMBL86247",
          "CHEMBL89877"
        ],
        "number_of_missing_values": "0"
      },
      {
        "data_type": "numeric",
        "index": "1",
        "is_ignore": "false",
        "is_row_identifier": "false",
        "is_target": "false",
        "name": "AMW",
        "number_of_missing_values": "0"
      },
      {
        "data_type": "numeric",
        "index": "2",
        "is_ignore": "false",
        "is_row_identifier": "false",
        "is_target": "false",
        "name": "C.",
        "number_of_missing_values": "0"
      },
      {
        "data_type": "numeric",
        "index": "3",
        "is_ignore": "false",
        "is_row_identifier": "false",
        "is_target": "false",
        "name": "H.",
        "number_of_missing_values": "0"
      },
      {
        "data_type": "numeric",
        "index": "4",
        "is_ignore": "false",
        "is_row_identifier": "false",
        "is_target": "false",
        "name": "Me",
        "number_of_missing_values": "0"
      },
      {
        "data_type": "numeric",
        "index": "5",
        "is_ignore": "false",
        "is_row_identifier": "false",
        "is_target": "false",
        "name": "Mi",
        "number_of_missing_values": "0"
      },
      {
        "data_type": "numeric",
        "index": "6",
        "is_ignore": "false",
        "is_row_identifier": "false",
        "is_target": "false",
        "name": "Mp",
        "number_of_missing_values": "0"
      },
      {
        "data_type": "numeric",
        "index": "7",
        "is_ignore": "false",
        "is_row_identifier": "false",
        "is_target": "false",
        "name": "Mv",
        "number_of_missing_values": "0"
      },
      {
        "data_type": "numeric",
        "index": "8",
        "is_ignore": "false",
        "is_row_identifier": "false",
        "is_target": "false",
        "name": "MW",
        "number_of_missing_values": "0"
      },
      {
        "data_type": "numeric",
        "index": "9",
        "is_ignore": "false",
        "is_row_identifier": "false",
        "is_target": "false",
        "name": "N.",
        "number_of_missing_values": "0"
      },
      {
        "data_type": "numeric",
        "index": "10",
        "is_ignore": "false",
        "is_row_identifier": "false",
        "is_target": "false",
        "name": "nAB",
        "number_of_missing_values": "0"
      },
      {
        "data_type": "numeric",
        "index": "11",
        "is_ignore": "false",
        "is_row_identifier": "false",
        "is_target": "false",
        "name": "nAT",
        "number_of_missing_values": "0"
      },
      {
        "data_type": "numeric",
        "index": "12",
        "is_ignore": "false",
        "is_row_identifier": "false",
        "is_target": "false",
        "name": "nB",
        "number_of_missing_values": "0"
      },
      {
        "data_type": "numeric",
        "index": "13",
        "is_ignore": "false",
        "is_row_identifier": "false",
        "is_target": "false",
        "name": "nBM",
        "number_of_missing_values": "0"
      },
      {
        "data_type": "numeric",
        "index": "14",
        "is_ignore": "false",
        "is_row_identifier": "false",
        "is_target": "false",
        "name": "nBO",
        "number_of_missing_values": "0"
      },
      {
        "data_type": "numeric",
        "index": "15",
        "is_ignore": "false",
        "is_row_identifier": "false",
        "is_target": "false",
        "name": "nBR",
        "number_of_missing_values": "0"
      },
      {
        "data_type": "numeric",
        "index": "16",
        "is_ignore": "false",
        "is_row_identifier": "false",
        "is_target": "false",
        "name": "nBT",
        "number_of_missing_values": "0"
      },
      {
        "data_type": "numeric",
        "index": "17",
        "is_ignore": "false",
        "is_row_identifier": "false",
        "is_target": "false",
        "name": "nC",
        "number_of_missing_values": "0"
      },
      {
        "data_type": "numeric",
        "index": "18",
        "is_ignore": "false",
        "is_row_identifier": "false",
        "is_target": "false",
        "name": "nCL",
        "number_of_missing_values": "0"
      },
      {
        "data_type": "numeric",
        "index": "19",
        "is_ignore": "false",
        "is_row_identifier": "false",
        "is_target": "false",
        "name": "nCsp",
        "number_of_missing_values": "0"
      },
      {
        "data_type": "numeric",
        "index": "20",
        "is_ignore": "false",
        "is_row_identifier": "false",
        "is_target": "false",
        "name": "nCsp2",
        "number_of_missing_values": "0"
      },
      {
        "data_type": "numeric",
        "index": "21",
        "is_ignore": "false",
        "is_row_identifier": "false",
        "is_target": "false",
        "name": "nCsp3",
        "number_of_missing_values": "0"
      },
      {
        "data_type": "numeric",
        "index": "22",
        "is_ignore": "false",
        "is_row_identifier": "false",
        "is_target": "false",
        "name": "nDB",
        "number_of_missing_values": "0"
      },
      {
        "data_type": "numeric",
        "index": "23",
        "is_ignore": "false",
        "is_row_identifier": "false",
        "is_target": "false",
        "name": "nF",
        "number_of_missing_values": "0"
      },
      {
        "data_type": "numeric",
        "index": "24",
        "is_ignore": "false",
        "is_row_identifier": "false",
        "is_target": "false",
        "name": "nH",
        "number_of_missing_values": "0"
      },
      {
        "data_type": "numeric",
        "index": "25",
        "is_ignore": "false",
        "is_row_identifier": "false",
        "is_target": "false",
        "name": "nHet",
        "number_of_missing_values": "0"
      },
      {
        "data_type": "numeric",
        "index": "26",
        "is_ignore": "false",
        "is_row_identifier": "false",
        "is_target": "false",
        "name": "nHM",
        "number_of_missing_values": "0"
      },
      {
        "data_type": "numeric",
        "index": "27",
        "is_ignore": "false",
        "is_row_identifier": "false",
        "is_target": "false",
        "name": "nI",
        "number_of_missing_values": "0"
      },
      {
        "data_type": "numeric",
        "index": "28",
        "is_ignore": "false",
        "is_row_identifier": "false",
        "is_target": "false",
        "name": "nN",
        "number_of_missing_values": "0"
      },
      {
        "data_type": "numeric",
        "index": "29",
        "is_ignore": "false",
        "is_row_identifier": "false",
        "is_target": "false",
        "name": "nO",
        "number_of_missing_values": "0"
      },
      {
        "data_type": "numeric",
        "index": "30",
        "is_ignore": "false",
        "is_row_identifier": "false",
        "is_target": "false",
        "name": "nP",
        "number_of_missing_values": "0"
      },
      {
        "data_type": "numeric",
        "index": "31",
        "is_ignore": "false",
        "is_row_identifier": "false",
        "is_target": "false",
        "name": "nS",
        "number_of_missing_values": "0"
      },
      {
        "data_type": "numeric",
        "index": "32",
        "is_ignore": "false",
        "is_row_identifier": "false",
        "is_target": "false",
        "name": "nSK",
        "number_of_missing_values": "0"
      },
      {
        "data_type": "numeric",
        "index": "33",
        "is_ignore": "false",
        "is_row_identifier": "false",
        "is_target": "false",
        "name": "nTB",
        "number_of_missing_values": "0"
      },
      {
        "data_type": "numeric",
        "index": "34",
        "is_ignore": "false",
        "is_row_identifier": "false",
        "is_target": "false",
        "name": "nX",
        "number_of_missing_values": "0"
      },
      {
        "data_type": "numeric",
        "index": "35",
        "is_ignore": "false",
        "is_row_identifier": "false",
        "is_target": "false",
        "name": "O.",
        "number_of_missing_values": "0"
      },
      {
        "data_type": "numeric",
        "index": "36",
        "is_ignore": "false",
        "is_row_identifier": "false",
        "is_target": "false",
        "name": "RBF",
        "number_of_missing_values": "0"
      },
      {
        "data_type": "numeric",
        "index": "37",
        "is_ignore": "false",
        "is_row_identifier": "false",
        "is_target": "false",
        "name": "RBN",
        "number_of_missing_values": "0"
      },
      {
        "data_type": "numeric",
        "index": "38",
        "is_ignore": "false",
        "is_row_identifier": "false",
        "is_target": "false",
        "name": "SCBO",
        "number_of_missing_values": "0"
      },
      {
        "data_type": "numeric",
        "index": "39",
        "is_ignore": "false",
        "is_row_identifier": "false",
        "is_target": "false",
        "name": "Se",
        "number_of_missing_values": "0"
      },
      {
        "data_type": "numeric",
        "index": "40",
        "is_ignore": "false",
        "is_row_identifier": "false",
        "is_target": "false",
        "name": "Si",
        "number_of_missing_values": "0"
      },
      {
        "data_type": "numeric",
        "index": "41",
        "is_ignore": "false",
        "is_row_identifier": "false",
        "is_target": "false",
        "name": "Sp",
        "number_of_missing_values": "0"
      },
      {
        "data_type": "numeric",
        "index": "42",
        "is_ignore": "false",
        "is_row_identifier": "false",
        "is_target": "false",
        "name": "Sv",
        "number_of_missing_values": "0"
      },
      {
        "data_type": "numeric",
        "index": "43",
        "is_ignore": "false",
        "is_row_identifier": "false",
        "is_target": "false",
        "name": "X.",
        "number_of_missing_values": "0"
      },
      {
        "data_type": "numeric",
        "index": "44",
        "is_ignore": "false",
        "is_row_identifier": "false",
        "is_target": "true",
        "name": "pXC50",
        "number_of_missing_values": "0"
      }
    ]
  }
}