"molecule_id","AMW","C.","H.","Me","Mi","Mp","Mv","MW","N.","nAB","nAT","nB","nBM","nBO","nBR","nBT","nC","nCL","nCsp","nCsp2","nCsp3","nDB","nF","nH","nHet","nHM","nI","nN","nO","nP","nS","nSK","nTB","nX","O.","RBF","RBN","SCBO","Se","Si","Sp","Sv","X.","pXC50"
{1 7.639,2 41.9,3 46.5,4 0.997,5 1.118,6 0.684,7 0.637,8 328.47,9 4.7,10 11,11 43,13 13,14 25,16 45,17 18,20 12,21 6,22 2,24 20,25 5,26 1,28 2,29 2,31 1,32 23,35 4.7,36 0.089,37 4,38 32.5,39 42.887,40 48.072,41 29.421,42 27.401,44 4.131}
{0 CHEMBL2204366,1 7.624,2 43.5,3 45.2,4 0.996,5 1.118,6 0.689,7 0.646,8 472.66,9 6.5,10 22,11 62,13 24,14 37,16 65,17 27,20 20,21 7,22 2,24 28,25 7,26 1,28 4,29 2,31 1,32 34,35 3.2,36 0.123,37 8,38 50,39 61.741,40 69.314,41 42.716,42 40.024,44 5.495}
{0 CHEMBL2204367,1 7.116,2 42.4,3 47,4 0.995,5 1.126,6 0.664,7 0.627,8 469.64,9 7.6,10 22,11 66,13 24,14 38,16 69,17 28,20 20,21 8,22 2,24 31,25 7,28 5,29 2,32 35,35 3,36 0.116,37 8,38 51,39 65.65,40 74.308,41 43.836,42 41.385,44 5.569}
{0 CHEMBL226770,1 7.402,2 41.2,3 45.1,4 1.002,5 1.13,6 0.663,7 0.633,8 377.49,9 9.8,10 18,11 51,13 19,14 30,16 53,17 21,20 17,21 4,22 1,24 23,25 7,28 5,29 2,32 28,35 3.9,36 0.132,37 7,38 40,39 51.116,40 57.647,41 33.79,42 32.278,44 6.886}
{0 CHEMBL226928,1 7.572,2 41.7,3 43.8,4 1.005,5 1.13,6 0.667,7 0.641,8 363.46,9 10.4,10 18,11 48,13 19,14 29,16 50,17 20,20 17,21 3,22 1,24 21,25 7,28 5,29 2,32 27,35 4.2,36 0.14,37 7,38 39,39 48.232,40 54.232,41 32.029,42 30.751,44 5.523}
{0 CHEMBL226930,1 8.077,2 41.2,3 43.1,4 1.009,5 1.129,6 0.679,7 0.649,8 411.93,9 9.8,10 18,11 51,13 19,14 31,16 53,17 21,18 1,20 17,21 4,22 1,24 22,25 8,26 1,28 5,29 2,32 29,34 1,35 3.9,36 0.151,37 8,38 41,39 51.44,40 57.591,41 34.648,42 33.105,43 2,44 7.523}
{0 CHEMBL227748,1 7.402,2 41.2,3 45.1,4 1.002,5 1.13,6 0.663,7 0.633,8 377.49,9 9.8,10 18,11 51,13 19,14 30,16 53,17 21,20 17,21 4,22 1,24 23,25 7,28 5,29 2,32 28,35 3.9,36 0.132,37 7,38 40,39 51.116,40 57.647,41 33.79,42 32.278,44 6.77}
{0 CHEMBL227803,1 7.25,2 40.7,3 46.3,4 1,5 1.131,6 0.658,7 0.626,8 391.52,9 9.3,10 18,11 54,13 19,14 31,16 56,17 22,20 17,21 5,22 1,24 25,25 7,28 5,29 2,32 29,35 3.7,36 0.125,37 7,38 41,39 54,40 61.062,41 35.552,42 33.805,44 5.086}
{0 CHEMBL227804,1 7.765,2 42.2,3 42.2,4 1.008,5 1.129,6 0.673,7 0.649,8 349.43,9 11.1,10 18,11 45,13 19,14 28,16 47,17 19,20 17,21 2,22 1,24 19,25 7,28 5,29 2,32 26,35 4.4,36 0.149,37 7,38 38,39 45.349,40 50.817,41 30.267,42 29.224,44 6.387}
{0 CHEMBL228018,1 8.29,2 41.7,3 41.7,4 1.012,5 1.129,6 0.685,7 0.658,8 397.9,9 10.4,10 18,11 48,13 19,14 30,16 50,17 20,18 1,20 17,21 3,22 1,24 20,25 8,26 1,28 5,29 2,32 28,34 1,35 4.2,36 0.14,37 7,38 40,39 48.556,40 54.176,41 32.887,42 31.579,43 2.1,44 7.347}
{0 CHEMBL228192,1 8.29,2 41.7,3 41.7,4 1.012,5 1.129,6 0.685,7 0.658,8 397.9,9 10.4,10 18,11 48,13 19,14 30,16 50,17 20,18 1,20 17,21 3,22 1,24 20,25 8,26 1,28 5,29 2,32 28,34 1,35 4.2,36 0.16,37 8,38 40,39 48.556,40 54.176,41 32.887,42 31.579,43 2.1,44 7.678}
{0 CHEMBL374380,1 7.572,2 41.7,3 43.8,4 1.005,5 1.13,6 0.667,7 0.641,8 363.46,9 10.4,10 18,11 48,13 19,14 29,16 50,17 20,20 17,21 3,22 1,24 21,25 7,28 5,29 2,32 27,35 4.2,36 0.16,37 8,38 39,39 48.232,40 54.232,41 32.029,42 30.751,44 7.056}
{0 CHEMBL374977,1 7.115,2 40.4,3 47.4,4 0.998,5 1.131,6 0.655,7 0.62,8 405.55,9 8.8,10 18,11 57,13 19,14 32,16 59,17 23,20 17,21 6,22 1,24 27,25 7,28 5,29 2,32 30,35 3.5,36 0.136,37 8,38 42,39 56.883,40 64.478,41 37.313,42 35.331,44 5.959}
{0 CHEMBL376085,1 7.572,2 41.7,3 43.8,4 1.005,5 1.13,6 0.667,7 0.641,8 363.46,9 10.4,10 18,11 48,13 19,14 29,16 50,17 20,20 17,21 3,22 1,24 21,25 7,28 5,29 2,32 27,35 4.2,36 0.14,37 7,38 39,39 48.232,40 54.232,41 32.029,42 30.751,44 6.721}
{0 CHEMBL387668,1 7.947,2 41.7,3 41.7,4 1.016,5 1.137,6 0.666,7 0.649,8 381.45,9 10.4,10 18,11 48,13 19,14 30,16 50,17 20,20 17,21 3,22 1,23 1,24 20,25 8,28 5,29 2,32 28,34 1,35 4.2,36 0.14,37 7,38 40,39 48.745,40 54.572,41 31.966,42 31.134,43 2.1,44 7.194}
{0 CHEMBL388357,1 7.567,2 40.4,3 44.2,4 1.009,5 1.132,6 0.659,7 0.634,8 393.49,9 9.6,10 18,11 52,13 19,14 31,16 54,17 21,20 17,21 4,22 1,24 23,25 8,28 5,29 3,32 29,35 5.8,36 0.148,37 8,38 41,39 52.443,40 58.857,41 34.245,42 32.993,44 6.18}
{0 CHEMBL389452,1 7.25,2 40.7,3 46.3,4 1,5 1.131,6 0.658,7 0.626,8 391.52,9 9.3,10 18,11 54,13 19,14 31,16 56,17 22,20 17,21 5,22 1,24 25,25 7,28 5,29 2,32 29,35 3.7,36 0.143,37 8,38 41,39 54,40 61.062,41 35.552,42 33.805,44 6.42}
{0 CHEMBL389647,1 9.216,2 41.7,3 41.7,4 1.01,5 1.127,6 0.695,7 0.662,8 442.35,9 10.4,10 18,11 48,13 19,14 30,15 1,16 50,17 20,20 17,21 3,22 1,24 20,25 8,26 1,28 5,29 2,32 28,34 1,35 4.2,36 0.14,37 7,38 40,39 48.462,40 54.074,41 33.381,42 31.776,43 2.1,44 7.081}
{0 CHEMBL427436,1 6.97,2 37.3,3 49,4 1,5 1.138,6 0.638,7 0.604,8 355.49,9 9.8,10 12,11 51,13 13,14 28,16 53,17 19,20 11,21 8,22 1,24 25,25 7,28 5,29 2,32 26,35 3.9,36 0.132,37 7,38 35,39 51,40 58.062,41 32.552,42 30.805,44 7}
{0 CHEMBL458325,1 7.491,2 40.7,3 44.4,4 1.004,5 1.132,6 0.663,7 0.635,8 404.52,9 11.1,10 18,11 54,13 19,14 33,16 57,17 22,20 17,21 5,22 1,24 24,25 8,28 6,29 2,32 30,35 3.7,36 0.123,37 7,38 43,39 54.218,40 61.145,41 35.796,42 34.299,44 7.009}
{0 CHEMBL461303,1 7.331,2 41.5,3 45.3,4 0.998,5 1.131,6 0.667,7 0.634,8 388.52,9 11.3,10 18,11 53,13 19,14 32,16 56,17 22,20 17,21 5,22 1,24 24,25 7,28 6,29 1,32 29,35 1.9,36 0.125,37 7,38 42,39 52.891,40 59.936,41 35.341,42 33.584,44 6.187}
{0 CHEMBL461304,1 7.188,2 41.1,3 46.4,4 0.996,5 1.131,6 0.663,7 0.627,8 402.55,9 10.7,10 18,11 56,13 19,14 33,16 59,17 23,20 17,21 6,22 1,24 26,25 7,28 6,29 1,32 30,35 1.8,36 0.119,37 7,38 43,39 55.774,40 63.351,41 37.103,42 35.111,44 6.921}
{0 CHEMBL461720,1 7.572,2 41.7,3 43.8,4 1.005,5 1.13,6 0.667,7 0.641,8 363.46,9 10.4,10 18,11 48,13 19,14 29,16 50,17 20,20 17,21 3,22 1,24 21,25 7,28 5,29 2,32 27,35 4.2,36 0.16,37 8,38 39,39 48.232,40 54.232,41 32.029,42 30.751,44 7.022}
{0 CHEMBL461721,1 7.402,2 41.2,3 45.1,4 1.002,5 1.13,6 0.663,7 0.633,8 377.49,9 9.8,10 18,11 51,13 19,14 30,16 53,17 21,20 17,21 4,22 1,24 23,25 7,28 5,29 2,32 28,35 3.9,36 0.17,37 9,38 40,39 51.116,40 57.647,41 33.79,42 32.278,44 7.092}
{0 CHEMBL469910,1 7.492,2 39.7,3 44.8,4 1.007,5 1.134,6 0.655,7 0.63,8 434.55,9 10.3,10 18,11 58,13 19,14 35,16 61,17 23,20 17,21 6,22 1,24 26,25 9,28 6,29 3,32 32,35 5.2,36 0.131,37 8,38 45,39 58.429,40 65.77,41 38.012,42 36.541,44 8.086}
{0 CHEMBL470949,1 7.199,2 39.7,3 46.6,4 0.998,5 1.135,6 0.657,7 0.623,8 417.57,9 12.1,10 18,11 58,13 19,14 34,16 61,17 23,20 17,21 6,22 1,24 27,25 8,28 7,29 1,32 31,35 1.7,36 0.115,37 7,38 44,39 57.876,40 65.85,41 38.108,42 36.133,44 8.208}
{0 CHEMBL470963,1 7.824,2 40.7,3 42.6,4 1.014,5 1.139,6 0.662,7 0.642,8 422.51,9 11.1,10 18,11 54,13 19,14 34,16 57,17 22,20 17,21 5,22 1,23 1,24 23,25 9,28 6,29 2,32 31,34 1,35 3.7,36 0.123,37 7,38 44,39 54.731,40 61.485,41 35.733,42 34.682,43 1.9,44 8.854}
{0 CHEMBL470964,1 7.824,2 40.7,3 42.6,4 1.014,5 1.139,6 0.662,7 0.642,8 422.51,9 11.1,10 18,11 54,13 19,14 34,16 57,17 22,20 17,21 5,22 1,23 1,24 23,25 9,28 6,29 2,32 31,34 1,35 3.7,36 0.123,37 7,38 44,39 54.731,40 61.485,41 35.733,42 34.682,43 1.9,44 6.187}
{0 CHEMBL471113,1 7.337,2 40,3 45.5,4 1,5 1.135,6 0.661,7 0.629,8 403.54,9 12.7,10 18,11 55,13 19,14 33,16 58,17 22,20 17,21 5,22 1,24 25,25 8,28 7,29 1,32 30,35 1.8,36 0.121,37 7,38 43,39 54.992,40 62.434,41 36.347,42 34.606,44 8.155}
{0 CHEMBL471114,1 7.491,2 40.7,3 44.4,4 1.004,5 1.132,6 0.663,7 0.635,8 404.52,9 11.1,10 18,11 54,13 19,14 33,16 57,17 22,20 17,21 5,22 1,24 24,25 8,28 6,29 2,32 30,35 3.7,36 0.123,37 7,38 43,39 54.218,40 61.145,41 35.796,42 34.299,44 8.187}
{0 CHEMBL471130,1 7.646,2 40,3 43.6,4 1.01,5 1.134,6 0.659,7 0.637,8 420.52,9 10.9,10 18,11 55,13 19,14 34,16 58,17 22,20 17,21 5,22 1,24 24,25 9,28 6,29 3,32 31,35 5.5,36 0.121,37 7,38 44,39 55.545,40 62.355,41 36.25,42 35.014,44 7.658}
{0 CHEMBL471131,1 8.129,2 40.7,3 42.6,4 1.01,5 1.131,6 0.679,7 0.65,8 438.96,9 11.1,10 18,11 54,13 19,14 34,16 57,17 22,18 1,20 17,21 5,22 1,24 23,25 9,26 1,28 6,29 2,32 31,34 1,35 3.7,36 0.123,37 7,38 44,39 54.542,40 61.089,41 36.654,42 35.127,43 1.9,44 8.102}
{0 CHEMBL471559,1 8.129,2 40.7,3 42.6,4 1.01,5 1.131,6 0.679,7 0.65,8 438.96,9 11.1,10 18,11 54,13 19,14 34,16 57,17 22,18 1,20 17,21 5,22 1,24 23,25 9,26 1,28 6,29 2,32 31,34 1,35 3.7,36 0.123,37 7,38 44,39 54.542,40 61.089,41 36.654,42 35.127,43 1.9,44 7.444}
{0 CHEMBL471560,1 8.29,2 40.4,3 40.4,4 1.029,5 1.151,6 0.656,7 0.649,8 472.52,9 10.5,10 18,11 57,13 19,14 37,16 60,17 23,20 17,21 6,22 1,23 3,24 23,25 11,28 6,29 2,32 34,34 3,35 3.5,36 0.117,37 7,38 47,39 58.64,40 65.58,41 37.37,42 36.976,43 5.3,44 6.886}
{0 CHEMBL471743,1 7.492,2 39.7,3 44.8,4 1.007,5 1.134,6 0.655,7 0.63,8 434.55,9 10.3,10 18,11 58,13 19,14 35,16 61,17 23,20 17,21 6,22 1,24 26,25 9,28 6,29 3,32 32,35 5.2,36 0.131,37 8,38 45,39 58.429,40 65.77,41 38.012,42 36.541,44 7.602}
{0 CHEMBL486643,1 7.769,2 39.7,3 44.8,4 1.003,5 1.129,6 0.676,7 0.638,8 450.62,9 10.3,10 18,11 58,13 19,14 35,16 61,17 23,20 17,21 6,22 1,24 26,25 9,26 1,28 6,29 2,31 1,32 32,35 3.4,36 0.131,37 8,38 45,39 58.178,40 65.481,41 39.205,42 37.013,44 7.638}
{0 CHEMBL487450,1 8.157,2 40.7,3 40.7,4 1.023,5 1.145,6 0.661,7 0.649,8 440.5,9 11.1,10 18,11 54,13 19,14 35,16 57,17 22,20 17,21 5,22 1,23 2,24 22,25 10,28 6,29 2,32 32,34 2,35 3.7,36 0.123,37 7,38 45,39 55.243,40 61.825,41 35.671,42 35.066,43 3.7,44 8.26}
{0 CHEMBL487451,1 8.491,2 40.7,3 38.9,4 1.033,5 1.151,6 0.659,7 0.656,8 458.49,9 11.1,10 18,11 54,13 19,14 36,16 57,17 22,20 17,21 5,22 1,23 3,24 21,25 11,28 6,29 2,32 33,34 3,35 3.7,36 0.123,37 7,38 46,39 55.756,40 62.165,41 35.608,42 35.449,43 5.6,44 9.155}
{0 CHEMBL487460,1 7.646,2 40,3 43.6,4 1.01,5 1.134,6 0.659,7 0.637,8 420.52,9 10.9,10 18,11 55,13 19,14 34,16 58,17 22,20 17,21 5,22 1,24 24,25 9,28 6,29 3,32 31,35 5.5,36 0.121,37 7,38 44,39 55.545,40 62.355,41 36.25,42 35.014,44 7.721}
{0 CHEMBL487634,1 7.492,2 39.3,3 44.6,4 1.006,5 1.136,6 0.657,7 0.631,8 419.54,9 12.5,10 18,11 56,13 19,14 34,16 59,17 22,20 17,21 5,22 1,24 25,25 9,28 7,29 2,32 31,35 3.6,36 0.119,37 7,38 44,39 56.32,40 63.644,41 36.801,42 35.321,44 6.509}
{0 CHEMBL488307,1 8.491,2 40.7,3 38.9,4 1.033,5 1.151,6 0.659,7 0.656,8 458.49,9 11.1,10 18,11 54,13 19,14 36,16 57,17 22,20 17,21 5,22 1,23 3,24 21,25 11,28 6,29 2,32 33,34 3,35 3.7,36 0.123,37 7,38 46,39 55.756,40 62.165,41 35.608,42 35.449,43 5.6,44 7.056}
{0 CHEMBL488649,1 8.157,2 40.7,3 40.7,4 1.023,5 1.145,6 0.661,7 0.649,8 440.5,9 11.1,10 18,11 54,13 19,14 35,16 57,17 22,20 17,21 5,22 1,23 2,24 22,25 10,28 6,29 2,32 32,34 2,35 3.7,36 0.123,37 7,38 45,39 55.243,40 61.825,41 35.671,42 35.066,43 3.7,44 6.509}
{0 CHEMBL488814,1 8.157,2 40.7,3 40.7,4 1.023,5 1.145,6 0.661,7 0.649,8 440.5,9 11.1,10 18,11 54,13 19,14 35,16 57,17 22,20 17,21 5,22 1,23 2,24 22,25 10,28 6,29 2,32 32,34 2,35 3.7,36 0.123,37 7,38 45,39 55.243,40 61.825,41 35.671,42 35.066,43 3.7,44 8.796}
{0 CHEMBL512519,1 8.29,2 40.4,3 40.4,4 1.029,5 1.151,6 0.656,7 0.649,8 472.52,9 10.5,10 18,11 57,13 19,14 37,16 60,17 23,20 17,21 6,22 1,23 3,24 23,25 11,28 6,29 2,32 34,34 3,35 3.5,36 0.117,37 7,38 47,39 58.64,40 65.58,41 37.37,42 36.976,43 5.3,44 7.602}
{0 CHEMBL512533,1 7.343,2 40.4,3 45.6,4 1.002,5 1.133,6 0.659,7 0.629,8 418.55,9 10.5,10 18,11 57,13 19,14 34,16 60,17 23,20 17,21 6,22 1,24 26,25 8,28 6,29 2,32 31,35 3.5,36 0.117,37 7,38 44,39 57.101,40 64.561,41 37.557,42 35.826,44 7.959}
{0 CHEMBL512874,1 7.824,2 40.7,3 42.6,4 1.014,5 1.139,6 0.662,7 0.642,8 422.51,9 11.1,10 18,11 54,13 19,14 34,16 57,17 22,20 17,21 5,22 1,23 1,24 23,25 9,28 6,29 2,32 31,34 1,35 3.7,36 0.123,37 7,38 44,39 54.731,40 61.485,41 35.733,42 34.682,43 1.9,44 8.745}
{0 CHEMBL512894,1 8.044,2 38.3,3 43.3,4 1.014,5 1.132,6 0.669,7 0.641,8 482.62,9 10,10 18,11 60,13 21,14 37,16 63,17 23,20 17,21 6,22 3,24 26,25 11,26 1,28 6,29 4,31 1,32 34,35 6.7,36 0.127,37 8,38 49,39 60.832,40 67.899,41 40.114,42 38.443,44 5.699}
{0 CHEMBL513401,1 7.061,2 40.7,3 47.5,4 0.994,5 1.132,6 0.659,7 0.621,8 416.58,9 10.2,10 18,11 59,13 19,14 34,16 62,17 24,20 17,21 7,22 1,24 28,25 7,28 6,29 1,32 31,35 1.7,36 0.113,37 7,38 44,39 58.658,40 66.766,41 38.864,42 36.638,44 7.77}
{0 CHEMBL517122,1 7.343,2 40.4,3 45.6,4 1.002,5 1.133,6 0.659,7 0.629,8 418.55,9 10.5,10 18,11 57,13 19,14 34,16 60,17 23,20 17,21 6,22 1,24 26,25 8,28 6,29 2,32 31,35 3.5,36 0.117,37 7,38 44,39 57.101,40 64.561,41 37.557,42 35.826,44 7.796}
{0 CHEMBL518350,1 9.007,2 41.7,3 39.6,4 1.018,5 1.127,6 0.703,7 0.675,8 432.34,9 10.4,10 18,11 48,13 19,14 31,16 50,17 20,18 2,20 17,21 3,22 1,24 19,25 9,26 2,28 5,29 2,32 29,34 2,35 4.2,36 0.16,37 8,38 41,39 48.88,40 54.12,41 33.745,42 32.406,43 4.2,44 7.215}
{0 CHEMBL519249,1 8.491,2 40.7,3 38.9,4 1.033,5 1.151,6 0.659,7 0.656,8 458.49,9 11.1,10 18,11 54,13 19,14 36,16 57,17 22,20 17,21 5,22 1,23 3,24 21,25 11,28 6,29 2,32 33,34 3,35 3.7,36 0.123,37 7,38 46,39 55.756,40 62.165,41 35.608,42 35.449,43 5.6,44 8.745}
{0 CHEMBL519410,1 8.157,2 40.7,3 40.7,4 1.023,5 1.145,6 0.661,7 0.649,8 440.5,9 11.1,10 18,11 54,13 19,14 35,16 57,17 22,20 17,21 5,22 1,23 2,24 22,25 10,28 6,29 2,32 32,34 2,35 3.7,36 0.123,37 7,38 45,39 55.243,40 61.825,41 35.671,42 35.066,43 3.7,44 8.658}
{0 CHEMBL520234,1 8.027,2 39.3,3 41.1,4 1.019,5 1.137,6 0.66,7 0.647,8 449.52,9 12.5,10 18,11 56,13 21,14 36,16 59,17 22,20 17,21 5,22 3,24 23,25 11,28 7,29 4,32 33,35 7.1,36 0.136,37 8,38 48,39 57.091,40 63.647,41 36.949,42 36.223,44 7.42}
{0 CHEMBL520539,1 7.567,2 39.3,3 44.3,4 1.009,5 1.136,6 0.656,7 0.632,8 461.58,9 11.5,10 18,11 61,13 20,14 37,16 64,17 24,20 18,21 6,22 2,24 27,25 10,28 7,29 3,32 34,35 4.9,36 0.125,37 8,38 48,39 61.531,40 69.268,41 40.017,42 38.562,44 5.284}
{0 CHEMBL529443,1 8.157,2 40.7,3 40.7,4 1.023,5 1.145,6 0.661,7 0.649,8 440.5,9 11.1,10 18,11 54,13 19,14 35,16 57,17 22,20 17,21 5,22 1,23 2,24 22,25 10,28 6,29 2,32 32,34 2,35 3.7,36 0.123,37 7,38 45,39 55.243,40 61.825,41 35.671,42 35.066,43 3.7,44 8.678}
{0 CHEMBL593171,1 8.491,2 40.7,3 38.9,4 1.033,5 1.151,6 0.659,7 0.656,8 458.49,9 11.1,10 18,11 54,13 19,14 36,16 57,17 22,20 17,21 5,22 1,23 3,24 21,25 11,28 6,29 2,32 33,34 3,35 3.7,36 0.123,37 7,38 46,39 55.756,40 62.165,41 35.608,42 35.449,43 5.6,44 9.155}
{0 CHEMBL593392,1 7.414,2 44.2,3 44.2,4 0.996,5 1.124,6 0.68,7 0.645,8 385.51,9 9.6,10 22,11 52,13 22,14 33,16 56,17 23,20 18,21 5,24 23,25 6,28 5,29 1,32 29,35 1.9,36 0.089,37 5,38 44,39 51.789,40 58.438,41 35.336,42 33.563,44 6.398}
{0 CHEMBL594344,1 7.934,2 43.4,3 41.5,4 1.011,5 1.14,6 0.675,7 0.654,8 420.51,9 11.3,10 22,11 53,13 22,14 35,16 57,17 23,20 18,21 5,23 2,24 22,25 8,28 6,32 31,34 2,36 0.088,37 5,38 46,39 53.589,40 60.406,41 35.762,42 34.636,43 3.8,44 7.921}
{0 CHEMBL594821,1 7.6,2 41,3 44.3,4 1.008,5 1.143,6 0.66,7 0.635,8 463.59,9 11.5,10 22,11 61,13 22,14 38,16 65,17 25,20 18,21 7,23 2,24 27,25 9,28 7,32 34,34 2,36 0.108,37 7,38 49,39 61.458,40 69.735,41 40.29,42 38.711,43 3.3,44 7.469}
{0 CHEMBL595058,1 7.959,2 41.7,3 41.7,4 1.015,5 1.142,6 0.666,7 0.648,8 477.57,9 11.7,10 22,11 60,13 23,14 39,16 64,17 25,20 19,21 6,22 1,23 2,24 25,25 10,28 7,29 1,32 35,34 2,35 1.7,36 0.109,37 7,38 51,39 60.901,40 68.529,41 39.983,42 38.899,43 3.3,44 8.721}
{0 CHEMBL595488,1 8.111,2 42.4,3 40.7,4 1.019,5 1.14,6 0.668,7 0.654,8 478.55,9 10.2,10 22,11 59,13 23,14 39,16 63,17 25,20 19,21 6,22 1,23 2,24 24,25 10,28 6,29 2,32 35,34 2,35 3.4,36 0.111,37 7,38 51,39 60.127,40 67.24,41 39.432,42 38.593,43 3.4,44 7.585}
{0 CHEMBL596223,1 8.106,2 44.2,3 40.4,4 1.016,5 1.137,6 0.677,7 0.66,8 421.49,9 9.6,10 22,11 52,13 22,14 35,16 56,17 23,20 18,21 5,23 2,24 21,25 8,28 5,29 1,32 31,34 2,35 1.9,36 0.089,37 5,38 46,39 52.814,40 59.117,41 35.211,42 34.33,43 3.8,44 6.921}
{0 CHEMBL596410,1 7.76,2 44.2,3 42.3,4 1.006,5 1.13,6 0.678,7 0.653,8 403.5,9 9.6,10 22,11 52,13 22,14 34,16 56,17 23,20 18,21 5,23 1,24 22,25 7,28 5,29 1,32 30,34 1,35 1.9,36 0.089,37 5,38 45,39 52.301,40 58.777,41 35.273,42 33.946,43 1.9,44 6.658}
{0 CHEMBL596420,1 7.76,2 42.9,3 42.9,4 1.008,5 1.14,6 0.67,7 0.646,8 434.54,9 10.7,10 22,11 56,13 22,14 36,16 60,17 24,20 18,21 6,23 2,24 24,25 8,28 6,32 32,34 2,36 0.083,37 5,38 47,39 56.472,40 63.821,41 37.523,42 36.163,43 3.6,44 8.495}
{0 CHEMBL596421,1 7.891,2 40.7,3 42.4,4 1.015,5 1.145,6 0.661,7 0.642,8 465.56,9 11.9,10 22,11 59,13 22,14 38,16 63,17 24,20 17,21 7,23 2,24 25,25 10,28 7,29 1,32 34,34 2,35 1.7,36 0.111,37 7,38 49,39 59.901,40 67.529,41 38.983,42 37.899,43 3.4,44 8.252}
{0 CHEMBL603203,1 7.76,2 44.2,3 42.3,4 1.006,5 1.13,6 0.678,7 0.653,8 403.5,9 9.6,10 22,11 52,13 22,14 34,16 56,17 23,20 18,21 5,23 1,24 22,25 7,28 5,29 1,32 30,34 1,35 1.9,36 0.089,37 5,38 45,39 52.301,40 58.777,41 35.273,42 33.946,43 1.9,44 7.432}
{0 CHEMBL605087,1 7.176,2 42.6,3 46.3,4 0.994,5 1.127,6 0.668,7 0.631,8 387.53,9 9.3,10 18,11 54,13 18,14 33,16 58,17 23,20 16,21 7,24 25,25 6,28 5,29 1,32 29,35 1.9,36 0.086,37 5,38 42,39 53.672,40 60.853,41 36.097,42 34.09,44 5.081}
{0 CHEMBL606152,1 7.76,2 44.2,3 42.3,4 1.006,5 1.13,6 0.678,7 0.653,8 403.5,9 9.6,10 22,11 52,13 22,14 34,16 56,17 23,20 18,21 5,23 1,24 22,25 7,28 5,29 1,32 30,34 1,35 1.9,36 0.089,37 5,38 45,39 52.301,40 58.777,41 35.273,42 33.946,43 1.9,44 5.387}
{0 CHEMBL606350,1 7.803,2 41.3,3 42.9,4 1.012,5 1.142,6 0.663,7 0.642,8 491.6,9 11.1,10 22,11 63,13 23,14 40,16 67,17 26,20 19,21 7,22 1,23 2,24 27,25 10,28 7,29 1,32 36,34 2,35 1.6,36 0.104,37 7,38 52,39 63.785,40 71.944,41 41.745,42 40.426,43 3.2,44 8.328}
