"molecule_id","nBT","C.","Si","Se","Sp","Sv","Mi","N.","nSK","MW","nH","nAT","nBO","SCBO","nCsp2","nC","nN","pXC50"
{1 59,2 41.8,3 61.69,4 54.531,5 37.5,6 34.782,7 1.122,8 7.3,9 29,10 406.6,11 26,12 55,13 33,14 41,15 13,16 23,17 4,18 6.119}
{0 CHEMBL103529,1 59,2 41.8,3 61.979,4 54.781,5 36.307,6 34.31,7 1.127,8 7.3,9 29,10 390.53,11 26,12 55,13 33,14 41,15 13,16 23,17 4,18 5}
{0 CHEMBL103785,1 64,2 40,3 67.893,4 59.767,5 39.074,6 36.858,7 1.132,8 8.3,9 31,10 419.58,11 29,12 60,13 35,14 43,15 13,16 24,17 5,18 6.097}
{0 CHEMBL109068,1 37,2 36.1,3 40.943,4 35.483,5 22.319,6 20.499,7 1.137,8 5.6,9 16,10 220.35,11 20,12 36,13 17,14 20,15 1,16 13,17 2,18 5.2}
{0 CHEMBL109120,1 29,2 34.5,3 33.112,4 28.716,5 17.796,6 16.445,7 1.142,8 6.9,9 13,10 180.28,11 16,12 29,13 13,14 16,15 1,16 10,17 2,18 4.1}
{0 CHEMBL109593,1 37,2 36.1,3 40.943,4 35.483,5 22.319,6 20.499,7 1.137,8 5.6,9 16,10 220.35,11 20,12 36,13 17,14 20,15 1,16 13,17 2,18 4.15}
{0 CHEMBL109597,1 37,2 36.1,3 40.943,4 35.483,5 22.319,6 20.499,7 1.137,8 5.6,9 16,10 220.35,11 20,12 36,13 17,14 20,15 1,16 13,17 2,18 5.6}
{0 CHEMBL109647,1 32,2 34.4,3 36.528,4 31.6,5 19.557,6 17.972,7 1.141,8 6.3,9 14,10 194.31,11 18,12 32,13 14,14 17,15 1,16 11,17 2,18 4.7}
{0 CHEMBL109727,1 34,2 36.4,3 37.528,4 32.6,5 20.557,6 18.972,7 1.137,8 6.1,9 15,10 206.32,11 18,12 33,13 16,14 19,15 1,16 12,17 2,18 5.4}
{0 CHEMBL109866,1 26,2 32,3 28.697,4 24.833,5 15.034,6 13.918,7 1.148,8 8,9 11,10 154.24,11 14,12 25,13 12,14 13,15 1,16 8,17 2,18 3.1}
{0 CHEMBL109985,1 29,2 34.5,3 33.112,4 28.716,5 17.796,6 16.445,7 1.142,8 6.9,9 13,10 180.28,11 16,12 29,13 13,14 16,15 1,16 10,17 2,18 4.4}
{0 CHEMBL110339,1 56,2 43.4,3 59.315,4 52.243,5 34.813,6 32.299,7 1.119,8 1.9,9 26,10 349.51,11 27,12 53,13 29,14 36,15 13,16 23,17 1,18 8.032}
{0 CHEMBL110808,1 53,2 44,3 55.9,4 49.36,5 33.052,6 30.773,7 1.118,8 2,9 25,10 335.48,11 25,12 50,13 28,14 35,15 13,16 22,17 1,18 7.951}
{0 CHEMBL11081,1 32,2 34.4,3 36.528,4 31.6,5 19.557,6 17.972,7 1.141,8 6.3,9 14,10 194.31,11 18,12 32,13 14,14 17,15 1,16 11,17 2,18 5.347}
{0 CHEMBL110845,1 21,2 28.6,3 24.282,4 20.949,5 12.273,6 11.392,7 1.156,8 9.5,9 9,10 128.2,11 12,12 21,13 9,14 10,15 1,16 6,17 2,18 2.5}
{0 CHEMBL111120,1 26,2 34.6,3 29.697,4 25.833,5 16.034,6 14.918,7 1.142,8 7.7,9 12,10 166.25,11 14,12 26,13 12,14 15,15 1,16 9,17 2,18 4.7}
{0 CHEMBL111123,1 34,2 36.4,3 37.528,4 32.6,5 20.557,6 18.972,7 1.137,8 6.1,9 15,10 206.32,11 18,12 33,13 16,14 19,15 1,16 12,17 2,18 4.7}
{0 CHEMBL111229,1 32,2 34.4,3 36.528,4 31.6,5 19.557,6 17.972,7 1.141,8 6.3,9 14,10 194.31,11 18,12 32,13 14,14 17,15 1,16 11,17 2,18 5}
{0 CHEMBL111369,1 29,2 34.5,3 33.112,4 28.716,5 17.796,6 16.445,7 1.142,8 6.9,9 13,10 180.28,11 16,12 29,13 13,14 16,15 1,16 10,17 2,18 3.9}
{0 CHEMBL111529,1 31,2 33.3,3 34.239,4 29.825,5 18.006,6 16.665,7 1.141,8 3.3,9 13,10 183.28,11 17,12 30,13 14,14 15,15 1,16 10,17 1,18 5.175}
{0 CHEMBL111615,1 24,2 29.2,3 27.697,4 23.833,5 14.034,6 12.918,7 1.154,8 8.3,9 10,10 142.23,11 14,12 24,13 10,14 11,15 1,16 7,17 2,18 4.6}
{0 CHEMBL111679,1 29,2 32.1,3 32.112,4 27.716,5 16.796,6 15.445,7 1.147,8 7.1,9 12,10 168.27,11 16,12 28,13 13,14 14,15 1,16 9,17 2,18 4}
{0 CHEMBL112244,1 106,2 34.6,3 118.702,4 102.341,5 63.745,6 58.276,7 1.141,8 6.7,9 45,10 622.02,11 59,12 104,13 47,14 55,15 13,16 36,17 7,18 6.405}
{0 CHEMBL116172,1 124,2 36.4,3 137.572,4 119.203,5 75.245,6 69.098,7 1.137,8 5.8,9 54,10 742.18,11 67,12 121,13 57,14 68,15 19,16 44,17 7,18 6.1}
{0 CHEMBL1162964,1 69,2 41.5,3 73.059,4 63.996,5 42.103,6 38.901,7 1.124,8 3.1,9 31,10 418.63,11 34,12 65,13 35,14 42,15 13,16 27,17 2,18 6.11}
{0 CHEMBL1169543,1 57,2 43.4,3 59.398,4 52.461,5 35.057,6 32.794,7 1.121,8 3.8,9 27,10 362.51,11 26,12 53,13 31,14 38,15 13,16 23,17 2,18 9.086}
{0 CHEMBL1201069,1 46,2 39.5,3 48.488,4 43.247,5 27.438,6 26.149,7 1.128,8 2.3,9 22,10 303.39,11 21,12 43,13 25,14 29,15 7,16 17,17 1,18 9.187}
{0 CHEMBL1201994,1 173,2 39.8,3 187.602,4 164.675,5 106.956,6 99.994,7 1.13,8 6,9 82,10 1113.6,11 84,12 166,13 89,14 111,15 38,16 66,17 10,18 6.6}
{0 CHEMBL1201995,1 137,2 37.9,3 149.861,4 130.952,5 83.956,6 78.35,7 1.135,8 7.6,9 64,10 873.28,11 68,12 132,13 69,14 85,15 26,16 50,17 10,18 5.17}
{0 CHEMBL1201997,1 155,2 38.9,3 168.732,4 147.813,5 95.456,6 89.172,7 1.132,8 6.7,9 73,10 993.44,11 76,12 149,13 79,14 98,15 32,16 58,17 10,18 5.6}
{0 CHEMBL1201998,1 199,2 41.5,3 212.18,4 188.173,5 124.376,6 118.499,7 1.129,8 8.5,9 102,10 1375.8,11 86,12 188,13 113,14 145,15 52,16 78,17 16,18 6.81}
{0 CHEMBL1202000,1 168,2 40,3 181.021,4 159.562,5 104.166,6 98.425,7 1.131,8 8.1,9 83,10 1124.54,11 77,12 160,13 91,14 115,15 39,16 64,17 13,18 6.4}
{0 CHEMBL1202001,1 137,2 37.9,3 149.861,4 130.952,5 83.956,6 78.35,7 1.135,8 7.6,9 64,10 873.28,11 68,12 132,13 69,14 85,15 26,16 50,17 10,18 5.59}
{0 CHEMBL1202002,1 199,2 41.5,3 212.18,4 188.173,5 124.376,6 118.499,7 1.129,8 8.5,9 102,10 1375.8,11 86,12 188,13 113,14 145,15 52,16 78,17 16,18 5.6}
{0 CHEMBL1202003,1 171,2 41.1,3 183.771,4 161.908,5 106.433,6 99.941,7 1.127,8 6.1,9 83,10 1121.57,11 80,12 163,13 91,14 115,15 42,16 67,17 10,18 6.96}
{0 CHEMBL1202004,1 139,2 38.8,3 151.695,4 132.515,5 85.467,6 79.361,7 1.132,8 6,9 64,10 871.3,11 70,12 134,13 69,14 85,15 28,16 52,17 8,18 6.94}
{0 CHEMBL1202048,1 64,2 32.8,3 73.182,4 63.309,5 38.324,6 35.164,7 1.143,8 4.7,9 27,10 379.61,11 37,12 64,13 27,14 31,15 2,16 21,17 3,18 5.495}
{0 CHEMBL1202052,1 67,2 32.8,3 76.597,4 66.192,5 40.086,6 36.691,7 1.143,8 4.5,9 28,10 393.64,11 39,12 67,13 28,14 32,15 2,16 22,17 3,18 5.721}
{0 CHEMBL1202131,1 49,2 32.7,3 56.102,4 48.12,5 29.37,6 26.627,7 1.145,8 6.1,9 20,10 279.48,11 29,12 49,13 20,14 23,15 1,16 16,17 3,18 5.509}
{0 CHEMBL1202134,1 52,2 32.7,3 59.517,4 51.003,5 31.131,6 28.154,7 1.145,8 5.8,9 21,10 293.51,11 31,12 52,13 21,14 24,15 1,16 17,17 3,18 6.155}
{0 CHEMBL1231,1 58,2 38.6,3 64.355,4 56.338,5 35.79,6 33.068,7 1.129,8 1.8,9 26,10 357.54,11 31,12 57,13 27,14 33,15 7,16 22,17 1,18 8.276}
{0 CHEMBL123573,1 24,2 30.4,3 26.407,4 22.673,5 13.409,6 12.16,7 1.148,8 4.3,9 9,10 128.22,11 14,12 23,13 10,14 10,16 7,17 1,18 5.204}
{0 CHEMBL12587,1 32,2 28.1,3 36.862,4 31.651,5 18.148,6 16.456,7 1.152,8 3.1,9 12,10 174.3,11 20,12 32,13 12,14 12,16 9,17 1,18 6.886}
{0 CHEMBL131865,1 112,2 34.5,3 125.533,4 108.108,5 67.268,6 61.33,7 1.141,8 6.4,9 47,10 650.08,11 63,12 110,13 49,14 57,15 13,16 38,17 7,18 8.52}
{0 CHEMBL132968,1 50,2 46.8,3 52.279,4 46.92,5 31.983,6 30.434,7 1.112,8 2.1,9 26,10 347.44,11 21,12 47,13 29,14 38.5,15 17,16 22,17 1,18 5.7}
{0 CHEMBL132978,1 57,2 40,3 61.939,4 54.454,5 35.029,6 32.541,7 1.126,8 1.8,9 26,10 355.52,11 29,12 55,13 28,14 34.5,15 11,16 22,17 1,18 7.25}
{0 CHEMBL133038,1 68,2 38.5,3 73.477,4 64.65,5 41.012,6 38.331,7 1.13,8 3.1,9 31,10 426.61,11 34,12 65,13 34,14 40.5,15 11,16 25,17 2,18 5.4}
{0 CHEMBL134404,1 66,2 39.7,3 70.979,4 62.549,5 40.006,6 37.309,7 1.127,8 1.6,9 30,10 411.59,11 33,12 63,13 33,14 39.5,15 11,16 25,17 1,18 6.25}
{0 CHEMBL134405,1 63,2 39.3,3 68.77,4 60.221,5 38.552,6 35.595,7 1.127,8 1.6,9 28,10 383.58,11 33,12 61,13 30,14 36.5,15 11,16 24,17 1,18 6.4}
{0 CHEMBL1346,1 66,2 45.2,3 69.228,4 61.229,5 41.58,6 38.848,7 1.117,8 3.2,9 32,10 426.6,11 30,12 62,13 36,14 46,15 19,16 28,17 2,18 8.602}
{0 CHEMBL134645,1 62,2 40,3 67.564,4 59.665,5 38.245,6 35.783,7 1.126,8 1.7,9 29,10 397.56,11 31,12 60,13 31,14 38.5,15 13,16 24,17 1,18 7.65}
{0 CHEMBL134692,1 113,2 35.1,3 126.536,4 109.879,5 68.416,6 63.233,7 1.14,8 6.3,9 50,10 692.07,11 61,12 111,13 52,14 62,15 15,16 39,17 7,18 7.15}
{0 CHEMBL135118,1 65,2 38.7,3 70.062,4 61.767,5 39.25,6 36.804,7 1.13,8 3.2,9 30,10 412.58,11 32,12 62,13 33,14 39.5,15 11,16 24,17 2,18 5.5}
{0 CHEMBL135233,1 71,2 39.7,3 76.6,4 66.989,5 43.074,6 39.648,7 1.126,8 1.5,9 31,10 423.65,11 37,12 68,13 34,14 40.5,15 11,16 27,17 1,18 5}
{0 CHEMBL135347,1 61,2 39,3 66.564,4 58.665,5 37.245,6 34.783,7 1.128,8 1.7,9 28,10 385.55,11 31,12 59,13 30,14 36.5,15 11,16 23,17 1,18 7.55}
{0 CHEMBL135549,1 52,2 44,3 55.903,4 50.131,5 33.199,6 31.675,7 1.118,8 2,9 27,10 365.46,11 23,12 50,13 29,14 38.5,15 17,16 22,17 1,18 6.6}
{0 CHEMBL135593,1 72,2 39.1,3 77.81,4 68.316,5 43.529,6 40.363,7 1.128,8 1.4,9 32,10 439.65,11 37,12 69,13 35,14 41.5,15 11,16 27,17 1,18 7.35}
{0 CHEMBL135619,1 67,2 39.1,3 72.189,4 63.876,5 40.461,6 38.024,7 1.128,8 1.6,9 31,10 427.59,11 33,12 64,13 34,14 40.5,15 11,16 25,17 1,18 6.8}
{0 CHEMBL135731,1 59,2 44.6,3 62.524,4 55.571,5 37.267,6 35.014,7 1.117,8 1.8,9 29,10 389.53,11 27,12 56,13 32,14 41.5,15 17,16 25,17 1,18 6.1}
{0 CHEMBL135743,1 63,2 39.3,3 68.77,4 60.221,5 38.552,6 35.595,7 1.127,8 1.6,9 28,10 383.58,11 33,12 61,13 30,14 36.5,15 11,16 24,17 1,18 6.7}
{0 CHEMBL135856,1 63,2 40,3 67.564,4 59.665,5 38.245,6 35.783,7 1.126,8 1.7,9 29,10 397.56,11 31,12 60,13 32,14 38.5,15 11,16 24,17 1,18 5.6}
{0 CHEMBL1382,1 56,2 40,3 61.936,4 53.683,5 34.881,6 31.638,7 1.126,8 1.8,9 24,10 325.54,11 31,12 55,13 25,14 31,15 12,16 22,17 1,18 8.506}
{0 CHEMBL14,1 24,2 24,3 29.114,4 25.102,5 13.869,6 12.897,7 1.165,8 8,9 10,10 147.23,11 15,12 25,13 9,14 10,15 1,16 6,17 2,18 6.319}
{0 CHEMBL14376,1 61,2 41.4,3 65.572,4 58.512,5 37.665,6 36.134,7 1.131,8 3.4,9 31,10 426.53,11 27,12 58,13 34,14 43,15 14,16 24,17 2,18 6}
{0 CHEMBL1609153,1 49,2 35.4,3 54.69,4 48.007,5 29.756,6 28.003,7 1.139,8 6.3,9 23,10 319.45,11 25,12 48,13 24,14 29,15 8,16 17,17 3,18 4.523}
{0 CHEMBL1624037,1 52,2 35.3,3 58.106,4 50.891,5 31.517,6 29.53,7 1.139,8 5.9,9 24,10 333.48,11 27,12 51,13 25,14 30,15 8,16 18,17 3,18 4.523}
{0 CHEMBL163901,1 159,2 39,3 173.854,4 150.944,5 97.058,6 88.544,7 1.129,8 2.6,9 68,10 927.5,11 86,12 154,13 73,14 87,15 26,16 60,17 4,18 5.67}
{0 CHEMBL165220,1 161,2 38.5,3 176.273,4 153.599,5 97.967,6 89.973,7 1.13,8 2.6,9 70,10 959.5,11 86,12 156,13 75,14 89,15 26,16 60,17 4,18 6.52}
{0 CHEMBL17045,1 65,2 38.7,3 70.308,4 61.65,5 39.836,6 37.385,7 1.134,8 8.1,9 31,10 421.6,11 31,12 62,13 34,14 42,15 13,16 24,17 5,18 5.222}
{0 CHEMBL1734,1 57,2 43.4,3 59.398,4 52.461,5 35.057,6 32.794,7 1.121,8 3.8,9 27,10 362.51,11 26,12 53,13 31,14 38,15 13,16 23,17 2,18 8}
{0 CHEMBL1744087,1 54,2 37.3,3 57.817,4 51.116,5 31.966,6 30.224,7 1.134,8 3.9,9 25,10 346.47,11 26,12 51,13 28,14 32,15 8,16 19,17 2,18 6}
{0 CHEMBL190459,1 60,2 40.4,3 64.149,4 56.781,5 36.483,6 34.256,7 1.125,8 1.8,9 28,10 383.53,11 29,12 57,13 31,14 37,15 7,16 23,17 1,18 6.016}
{0 CHEMBL190815,1 51,2 43.8,3 53.69,4 47.032,5 31.597,6 29.058,7 1.119,8 2.1,9 23,10 307.47,11 25,12 48,13 26,14 32,15 12,16 21,17 1,18 7.301}
{0 CHEMBL1916224,1 60,2 36.2,3 65.936,4 57.658,5 36.04,6 33.584,7 1.137,8 5.2,9 27,10 373.55,11 31,12 58,13 29,14 34,15 8,16 21,17 3,18 4.523}
{0 CHEMBL1916225,1 60,2 36.2,3 66.276,4 58.17,5 35.978,6 33.967,7 1.143,8 5.2,9 28,10 391.54,11 30,12 58,13 30,14 35,15 8,16 21,17 3,18 5}
{0 CHEMBL1916226,1 57,2 36.4,3 62.521,4 54.774,5 34.279,6 32.057,7 1.137,8 5.5,9 26,10 359.52,11 29,12 55,13 28,14 33,15 8,16 20,17 3,18 4.523}
{0 CHEMBL1916227,1 57,2 36.4,3 62.86,4 55.287,5 34.216,6 32.44,7 1.143,8 5.5,9 27,10 377.51,11 28,12 55,13 29,14 34,15 8,16 20,17 3,18 5}
{0 CHEMBL1916228,1 61,2 35.6,3 67.145,4 58.985,5 36.495,6 34.299,7 1.138,8 5.1,9 28,10 389.55,11 31,12 59,13 30,14 35,15 8,16 21,17 3,18 5}
{0 CHEMBL1916229,1 57,2 36.4,3 63.2,4 55.8,5 34.154,6 32.824,7 1.149,8 5.5,9 28,10 395.5,11 27,12 55,13 30,14 35,15 8,16 20,17 3,18 5}
{0 CHEMBL1916230,1 60,2 36.2,3 65.936,4 57.658,5 36.04,6 33.584,7 1.137,8 5.2,9 27,10 373.55,11 31,12 58,13 29,14 34,15 8,16 21,17 3,18 5}
{0 CHEMBL1916231,1 63,2 32.8,3 69.766,4 60.425,5 36.563,6 33.637,7 1.144,8 4.9,9 26,10 365.58,11 35,12 61,13 28,14 30,15 2,16 20,17 3,18 5}
{0 CHEMBL1916232,1 54,2 34.6,3 59.026,4 51.967,5 33.165,6 30.717,7 1.135,8 5.8,9 25,10 365.55,11 27,12 52,13 27,14 31.5,15 6,16 18,17 3,18 5}
{0 CHEMBL1916233,1 61,2 35.6,3 67.145,4 58.985,5 36.495,6 34.299,7 1.138,8 5.1,9 28,10 389.55,11 31,12 59,13 30,14 35,15 8,16 21,17 3,18 5}
{0 CHEMBL1916234,1 57,2 36.4,3 62.465,4 55.098,5 35.137,6 32.885,7 1.136,8 5.5,9 27,10 393.96,11 28,12 55,13 29,14 34,15 8,16 20,17 3,18 5}
{0 CHEMBL1916235,1 60,2 32.8,3 66.351,4 57.541,5 34.802,6 32.111,7 1.144,8 5.2,9 25,10 351.55,11 33,12 58,13 27,14 29,15 2,16 19,17 3,18 5}
{0 CHEMBL192061,1 54,2 43.1,3 57.105,4 49.916,5 33.358,6 30.585,7 1.12,8 2,9 24,10 321.5,11 27,12 51,13 27,14 33,15 12,16 22,17 1,18 7.352}
{0 CHEMBL192065,1 53,2 46,3 55.694,4 49.803,5 33.745,6 31.961,7 1.114,8 2,9 27,10 361.47,11 23,12 50,13 30,14 39,15 13,16 23,17 1,18 7.854}
{0 CHEMBL192083,1 71,2 44.8,3 74.766,4 65.45,5 44.404,6 40.692,7 1.116,8 1.5,9 32,10 425.66,11 35,12 67,13 36,14 45,15 18,16 30,17 1,18 5}
{0 CHEMBL192337,1 53,2 46,3 56.373,4 50.829,5 33.62,6 32.727,7 1.127,8 2,9 29,10 397.45,11 21,12 50,13 32,14 41,15 13,16 23,17 1,18 7.409}
{0 CHEMBL192485,1 56,2 41.5,3 59.524,4 52.571,5 34.267,6 32.014,7 1.123,8 1.9,9 26,10 353.5,11 27,12 53,13 29,14 35,15 7,16 22,17 1,18 6.736}
{0 CHEMBL192537,1 59,2 41.1,3 62.939,4 55.454,5 36.029,6 33.541,7 1.124,8 1.8,9 27,10 367.53,11 29,12 56,13 30,14 36,15 7,16 23,17 1,18 7.456}
{0 CHEMBL192885,1 54,2 43.1,3 57.105,4 49.916,5 33.358,6 30.585,7 1.12,8 2,9 24,10 321.5,11 27,12 51,13 27,14 33,15 12,16 22,17 1,18 6.928}
{0 CHEMBL194216,1 159,2 39.5,3 171.442,4 149.831,5 96.444,6 88.92,7 1.128,8 2.6,9 70,10 955.46,11 82,12 152,13 77,14 91,15 26,16 60,17 4,18 6.01}
{0 CHEMBL194628,1 52,2 42.9,3 54.983,4 48.578,5 32.296,6 30.267,7 1.122,8 4.1,9 25,10 336.47,11 24,12 49,13 28,14 35,15 13,16 21,17 2,18 8.699}
{0 CHEMBL194870,1 54,2 45.1,3 57.662,4 51.603,5 34.171,6 33.034,7 1.131,8 3.9,9 29,10 396.47,11 22,12 51,13 32,14 41,15 13,16 23,17 2,18 6.437}
{0 CHEMBL195169,1 54,2 45.1,3 56.983,4 50.578,5 34.296,6 32.267,7 1.117,8 3.9,9 27,10 360.49,11 24,12 51,13 30,14 39,15 13,16 23,17 2,18 6.536}
{0 CHEMBL196481,1 57,2 43.4,3 59.398,4 52.461,5 35.057,6 32.794,7 1.121,8 3.8,9 27,10 362.51,11 26,12 53,13 31,14 38,15 13,16 23,17 2,18 7.585}
{0 CHEMBL197588,1 58,2 42.6,3 60.607,4 53.789,5 35.512,6 33.509,7 1.122,8 3.7,9 28,10 378.51,11 26,12 54,13 32,14 39,15 13,16 23,17 2,18 6.357}
{0 CHEMBL197717,1 57,2 43.4,3 59.398,4 52.461,5 35.057,6 32.794,7 1.121,8 3.8,9 27,10 362.51,11 26,12 53,13 31,14 38,15 13,16 23,17 2,18 6}
{0 CHEMBL198065,1 60,2 42.9,3 62.813,4 55.345,5 36.819,6 34.321,7 1.122,8 3.6,9 28,10 376.54,11 28,12 56,13 32,14 39,15 13,16 24,17 2,18 6.796}
{0 CHEMBL198669,1 54,2 44,3 55.983,4 49.578,5 33.296,6 31.267,7 1.12,8 4,9 26,10 348.48,11 24,12 50,13 30,14 37,15 13,16 22,17 2,18 7.553}
{0 CHEMBL2057417,1 40,2 42.1,3 42.558,4 38.436,5 27.551,6 25.976,7 1.12,8 10.5,9 23,10 346.87,11 15,12 38,13 25,14 34,15 13,16 16,17 4,18 4.523}
{0 CHEMBL2111621,1 59,2 41.8,3 61.979,4 54.781,5 36.307,6 34.31,7 1.127,8 7.3,9 29,10 390.53,11 26,12 55,13 33,14 41,15 13,16 23,17 4,18 5.456}
{0 CHEMBL2112217,1 46,2 39.5,3 48.9,4 43.567,5 28.512,6 27.719,7 1.137,8 14,9 25,10 338.41,11 18,12 43,13 28,14 36,15 12,16 17,17 6,18 5.883}
{0 CHEMBL2112418,1 59,2 41.8,3 61.979,4 54.781,5 36.307,6 34.31,7 1.127,8 7.3,9 29,10 390.53,11 26,12 55,13 33,14 41,15 13,16 23,17 4,18 5}
{0 CHEMBL2112432,1 62,2 42.1,3 64.268,4 56.556,5 37.858,6 35.617,7 1.128,8 8.8,9 30,10 401.56,11 27,12 57,13 35,14 44,15 13,16 24,17 5,18 5}
{0 CHEMBL2112942,1 47,2 40,3 50.414,4 44.872,5 31.404,6 28.277,7 1.12,8 2.2,9 23,10 427.31,11 22,12 45,13 25,14 30,15 9,16 18,17 1,18 9.569}
{0 CHEMBL2113669,1 45,2 39.5,3 48.484,4 42.476,5 27.29,6 25.246,7 1.128,8 2.3,9 20,10 273.41,11 23,12 43,13 22,14 26,15 7,16 17,17 1,18 4.524}
{0 CHEMBL2114058,1 28,2 33.3,3 30.824,4 26.942,5 16.244,6 15.139,7 1.142,8 3.7,9 12,10 169.25,11 15,12 27,13 13,14 14,15 1,16 9,17 1,18 4.558}
{0 CHEMBL2114059,1 39,2 40.5,3 41.654,4 36.709,5 23.767,6 22.192,7 1.126,8 2.7,9 18,10 245.35,11 19,12 37,13 20,14 24,15 7,16 15,17 1,18 4.726}
{0 CHEMBL2114060,1 53,2 44,3 55.9,4 49.36,5 33.052,6 30.773,7 1.118,8 2,9 25,10 335.48,11 25,12 50,13 28,14 35,15 13,16 22,17 1,18 9.282}
{0 CHEMBL2114061,1 53,2 44,3 55.9,4 49.36,5 33.052,6 30.773,7 1.118,8 2,9 25,10 335.48,11 25,12 50,13 28,14 35,15 13,16 22,17 1,18 8.395}
{0 CHEMBL2115122,1 28,2 33.3,3 30.824,4 26.942,5 16.244,6 15.139,7 1.142,8 3.7,9 12,10 169.25,11 15,12 27,13 13,14 14,15 1,16 9,17 1,18 4.921}
{0 CHEMBL2115123,1 39,2 40.5,3 41.654,4 36.709,5 23.767,6 22.192,7 1.126,8 2.7,9 18,10 245.35,11 19,12 37,13 20,14 24,15 7,16 15,17 1,18 4.322}
{0 CHEMBL2115124,1 53,2 44,3 55.9,4 49.36,5 33.052,6 30.773,7 1.118,8 2,9 25,10 335.48,11 25,12 50,13 28,14 35,15 13,16 22,17 1,18 9.273}
{0 CHEMBL2115125,1 53,2 44,3 55.9,4 49.36,5 33.052,6 30.773,7 1.118,8 2,9 25,10 335.48,11 25,12 50,13 28,14 35,15 13,16 22,17 1,18 8.079}
{0 CHEMBL215180,1 94,2 41.6,3 101.154,4 89.927,5 57.881,6 55.631,7 1.137,8 4.5,9 48,10 662.82,11 41,12 89,13 53,14 65,15 21,16 37,17 4,18 9.65}
{0 CHEMBL21823,1 59,2 37.5,3 63.356,4 55.723,5 34.864,6 32.519,7 1.131,8 1.8,9 26,10 360.52,11 30,12 56,13 29,14 33,15 7,16 21,17 1,18 6.658}
{0 CHEMBL222424,1 64,2 45,3 67.781,4 60.145,5 40.245,6 38.394,7 1.13,8 5,9 33,10 447.57,11 27,12 60,13 37,14 47,15 19,16 27,17 3,18 7.77}
{0 CHEMBL2313377,1 35,2 39.4,3 37.06,4 33.334,5 23.546,6 21.954,7 1.123,8 9.1,9 19,10 295.82,11 14,12 33,13 21,14 27,15 8,16 13,17 3,18 4.523}
{0 CHEMBL2315675,1 66,2 40.3,3 70.355,4 61.618,5 40.074,6 37.559,7 1.135,8 6.5,9 31,10 422.6,11 31,12 62,13 35,14 42,15 13,16 25,17 4,18 5}
{0 CHEMBL2315676,1 71,2 40.9,3 74.431,4 64.989,5 42.898,6 39.702,7 1.128,8 6.1,9 32,10 430.65,11 34,12 66,13 37,14 44,15 13,16 27,17 4,18 5}
{0 CHEMBL2315680,1 59,2 35.1,3 66.038,4 58.414,5 35.097,6 34.228,7 1.159,8 7,9 30,10 428.51,11 27,12 57,13 32,14 37,15 7,16 20,17 4,18 5}
{0 CHEMBL2321893,1 45,2 39.5,3 48.432,4 43.571,5 28.296,6 26.976,7 1.126,8 2.3,9 23,10 337.83,11 20,12 43,13 25,14 30,15 8,16 17,17 1,18 4.081}
{0 CHEMBL2323441,1 45,2 39.5,3 48.432,4 43.571,5 28.296,6 26.976,7 1.126,8 2.3,9 23,10 337.83,11 20,12 43,13 25,14 30,15 8,16 17,17 1,18 5.854}
{0 CHEMBL2323442,1 47,2 37.8,3 50.99,4 46.12,5 28.591,6 28.073,7 1.133,8 4.4,9 25,10 348.39,11 20,12 45,13 27,14 34,15 8,16 17,17 2,18 5.432}
{0 CHEMBL2323443,1 47,2 37.8,3 50.99,4 46.12,5 28.591,6 28.073,7 1.133,8 4.4,9 25,10 348.39,11 20,12 45,13 27,14 34,15 8,16 17,17 2,18 4.18}
{0 CHEMBL2323444,1 48,2 39.1,3 51.903,4 46.131,5 29.199,6 27.675,7 1.128,8 2.2,9 23,10 317.42,11 23,12 46,13 25,14 30,15 8,16 18,17 1,18 6.036}
{0 CHEMBL2323445,1 48,2 39.1,3 51.903,4 46.131,5 29.199,6 27.675,7 1.128,8 2.2,9 23,10 317.42,11 23,12 46,13 25,14 30,15 8,16 18,17 1,18 4.022}
{0 CHEMBL2323446,1 45,2 39.5,3 48.488,4 43.247,5 27.438,6 26.149,7 1.128,8 2.3,9 22,10 303.39,11 21,12 43,13 24,14 29,15 8,16 17,17 1,18 5.569}
{0 CHEMBL2323447,1 45,2 39.5,3 48.488,4 43.247,5 27.438,6 26.149,7 1.128,8 2.3,9 22,10 303.39,11 21,12 43,13 24,14 29,15 8,16 17,17 1,18 4.149}
{0 CHEMBL248614,1 69,2 41.5,3 73.059,4 63.996,5 42.103,6 38.901,7 1.124,8 3.1,9 31,10 418.63,11 34,12 65,13 35,14 42,15 13,16 27,17 2,18 8.167}
{0 CHEMBL248616,1 49,2 43.5,3 51.567,4 45.694,5 30.534,6 28.74,7 1.121,8 4.3,9 24,10 322.44,11 22,12 46,13 27,14 34,15 13,16 20,17 2,18 6}
{0 CHEMBL248809,1 66,2 41.9,3 69.643,4 61.112,5 40.341,6 37.374,7 1.123,8 3.2,9 30,10 404.6,11 32,12 62,13 34,14 41,15 13,16 26,17 2,18 7.6}
{0 CHEMBL248811,1 72,2 41.2,3 76.474,4 66.879,5 43.864,6 40.428,7 1.125,8 2.9,9 32,10 432.66,11 36,12 68,13 36,14 43,15 13,16 28,17 2,18 8.745}
{0 CHEMBL249005,1 60,2 41.1,3 62.733,4 55.421,5 37.466,6 34.508,7 1.12,8 3.6,9 28,10 396.6,11 28,12 56,13 32,14 38.5,15 11,16 23,17 2,18 6.281}
{0 CHEMBL249006,1 69,2 41.5,3 73.059,4 63.996,5 42.103,6 38.901,7 1.124,8 3.1,9 31,10 418.63,11 34,12 65,13 35,14 42,15 13,16 27,17 2,18 7.23}
{0 CHEMBL249007,1 66,2 41.9,3 69.587,4 61.436,5 41.199,6 38.202,7 1.122,8 3.2,9 31,10 439.04,11 31,12 62,13 35,14 42,15 13,16 26,17 2,18 7.504}
{0 CHEMBL249204,1 72,2 41.2,3 76.477,4 67.65,5 44.012,6 41.331,7 1.125,8 2.9,9 34,10 462.64,11 34,12 68,13 38,14 46,15 14,16 28,17 2,18 7.361}
{0 CHEMBL249205,1 70,2 41.5,3 73.062,4 64.767,5 42.25,6 39.804,7 1.124,8 3.1,9 33,10 448.61,11 32,12 65,13 38,14 45,15 13,16 27,17 2,18 7.699}
{0 CHEMBL249206,1 70,2 44.6,3 72.643,4 64.112,5 43.341,6 40.374,7 1.118,8 3.1,9 33,10 440.63,11 32,12 65,13 38,14 47.5,15 17,16 29,17 2,18 7.377}
{0 CHEMBL249830,1 66,2 41.9,3 69.643,4 61.112,5 40.341,6 37.374,7 1.123,8 3.2,9 30,10 404.6,11 32,12 62,13 34,14 41,15 13,16 26,17 2,18 8.032}
{0 CHEMBL250030,1 65,2 38.7,3 70.059,4 60.996,5 39.103,6 35.901,7 1.13,8 3.2,9 28,10 382.6,11 34,12 62,13 31,14 36,15 9,16 24,17 2,18 7.481}
{0 CHEMBL250031,1 65,2 38.7,3 70.059,4 60.996,5 39.103,6 35.901,7 1.13,8 3.2,9 28,10 382.6,11 34,12 62,13 31,14 36,15 9,16 24,17 2,18 7.149}
{0 CHEMBL250203,1 63,2 42.4,3 66.228,4 58.229,5 38.58,6 35.848,7 1.123,8 3.4,9 29,10 390.57,11 30,12 59,13 33,14 40,15 13,16 25,17 2,18 7.018}
{0 CHEMBL250834,1 70,2 41.5,3 73.062,4 64.767,5 42.25,6 39.804,7 1.124,8 3.1,9 33,10 448.61,11 32,12 65,13 38,14 45,15 13,16 27,17 2,18 7.91}
{0 CHEMBL253978,1 51,2 39.6,3 54.069,4 48.091,5 32.432,6 30.444,7 1.126,8 8.3,9 26,10 370.52,11 22,12 48,13 29,14 36.5,15 12,16 19,17 4,18 8.161}
{0 CHEMBL255169,1 54,2 40.4,3 58.631,4 51.56,5 34.466,6 31.928,7 1.128,8 5.8,9 26,10 371.95,11 26,12 52,13 28,14 35,15 13,16 21,17 3,18 4.155}
{0 CHEMBL255523,1 57,2 36.4,3 62.461,4 54.327,5 34.989,6 31.982,7 1.136,8 5.5,9 25,10 363.98,11 30,12 55,13 27,14 31,15 7,16 20,17 3,18 5.509}
{0 CHEMBL265256,1 168,2 40,3 181.021,4 159.562,5 104.166,6 98.425,7 1.131,8 8.1,9 83,10 1124.54,11 77,12 160,13 91,14 115,15 39,16 64,17 13,18 6.19}
{0 CHEMBL265521,1 37,2 36.1,3 40.943,4 35.483,5 22.319,6 20.499,7 1.137,8 5.6,9 16,10 220.35,11 20,12 36,13 17,14 20,15 1,16 13,17 2,18 5.5}
{0 CHEMBL271704,1 56,2 41.5,3 59.631,4 52.56,5 35.466,6 32.928,7 1.125,8 5.7,9 27,10 383.96,11 26,12 53,13 30,14 37,15 13,16 22,17 3,18 4.62}
{0 CHEMBL27673,1 105,2 34.6,3 118.453,4 101.686,5 63.012,6 56.792,7 1.139,8 3.8,9 42,10 583.02,11 62,12 104,13 43,14 49,15 12,16 36,17 4,18 5.96}
{0 CHEMBL292857,1 57,2 43.4,3 59.317,4 52.629,5 34.887,6 32.751,7 1.119,8 1.9,9 27,10 364.5,11 26,12 53,13 31,14 38,15 13,16 23,17 1,18 7.64}
{0 CHEMBL292911,1 32,2 28.1,3 36.862,4 31.651,5 18.148,6 16.456,7 1.152,8 3.1,9 12,10 174.3,11 20,12 32,13 12,14 12,16 9,17 1,18 4.666}
{0 CHEMBL293927,1 50,2 38.3,3 53.111,4 47.072,5 29.58,6 27.939,7 1.13,8 2.1,9 23,10 318.43,11 24,12 47,13 26,14 30,15 7,16 18,17 1,18 9.357}
{0 CHEMBL294273,1 31,2 33.3,3 34.239,4 29.825,5 18.006,6 16.665,7 1.141,8 3.3,9 13,10 183.28,11 17,12 30,13 14,14 15,15 1,16 10,17 1,18 4.824}
{0 CHEMBL294470,1 30,2 30,3 34.446,4 29.767,5 17.387,6 15.929,7 1.148,8 3.3,9 12,10 172.28,11 18,12 30,13 12,14 13,15 1,16 9,17 1,18 5.02}
{0 CHEMBL294919,1 68,2 38.5,3 73.723,4 64.534,5 41.597,6 38.912,7 1.134,8 7.7,9 32,10 435.63,11 33,12 65,13 35,14 43,15 13,16 25,17 5,18 5.699}
{0 CHEMBL295214,1 65,2 38.7,3 70.308,4 61.65,5 39.836,6 37.385,7 1.134,8 8.1,9 31,10 421.6,11 31,12 62,13 34,14 42,15 13,16 24,17 5,18 6.523}
{0 CHEMBL296317,1 68,2 38.5,3 73.723,4 64.534,5 41.597,6 38.912,7 1.134,8 7.7,9 32,10 435.63,11 33,12 65,13 35,14 43,15 13,16 25,17 5,18 6.222}
{0 CHEMBL296365,1 59,2 39.3,3 63.478,4 55.883,5 36.313,6 34.331,7 1.134,8 8.9,9 29,10 393.54,11 27,12 56,13 32,14 40,15 13,16 22,17 5,18 5.523}
{0 CHEMBL296405,1 68,2 38.5,3 73.723,4 64.534,5 41.597,6 38.912,7 1.134,8 7.7,9 32,10 435.63,11 33,12 65,13 35,14 43,15 13,16 25,17 5,18 6}
{0 CHEMBL296988,1 59,2 39.3,3 63.478,4 55.883,5 36.313,6 34.331,7 1.134,8 8.9,9 29,10 393.54,11 27,12 56,13 32,14 40,15 13,16 22,17 5,18 6}
{0 CHEMBL297224,1 68,2 38.5,3 73.723,4 64.534,5 41.597,6 38.912,7 1.134,8 7.7,9 32,10 435.63,11 33,12 65,13 35,14 43,15 13,16 25,17 5,18 6}
{0 CHEMBL297818,1 65,2 38.7,3 70.252,4 61.974,5 40.694,6 38.212,7 1.133,8 8.1,9 32,10 456.04,11 30,12 62,13 35,14 43,15 13,16 24,17 5,18 5.824}
{0 CHEMBL298078,1 65,2 38.7,3 70.308,4 61.65,5 39.836,6 37.385,7 1.134,8 8.1,9 31,10 421.6,11 31,12 62,13 34,14 42,15 13,16 24,17 5,18 5.398}
{0 CHEMBL299142,1 71,2 38.2,3 77.138,4 67.418,5 43.358,6 40.439,7 1.134,8 7.4,9 33,10 449.66,11 35,12 68,13 36,14 44,15 13,16 26,17 5,18 6.699}
{0 CHEMBL299344,1 65,2 38.7,3 70.15,4 61.88,5 41.188,6 38.41,7 1.131,8 8.1,9 32,10 500.49,11 30,12 62,13 35,14 43,15 13,16 24,17 5,18 5.398}
{0 CHEMBL300660,1 68,2 38.5,3 73.723,4 64.534,5 41.597,6 38.912,7 1.134,8 7.7,9 32,10 435.63,11 33,12 65,13 35,14 43,15 13,16 25,17 5,18 6.699}
{0 CHEMBL302557,1 54,2 39.2,3 57.567,4 51.192,5 34.438,6 32.465,7 1.129,8 9.8,9 28,10 397.55,11 23,12 51,13 31,14 39,15 13,16 20,17 5,18 5.441}
{0 CHEMBL302604,1 68,2 36.9,3 74.099,4 65.298,5 41.54,6 39.616,7 1.14,8 10.8,9 34,10 465.62,11 31,12 65,13 37,14 46,15 14,16 24,17 7,18 4.939}
{0 CHEMBL302995,1 53,2 38,3 56.571,4 50.963,5 33.585,6 32.368,7 1.131,8 10,9 29,10 415.52,11 21,12 50,13 32,14 42,15 13,16 19,17 5,18 4}
{0 CHEMBL303678,1 52,2 40.8,3 55.441,4 49.56,5 32.483,6 31.466,7 1.131,8 10.2,9 28,10 379.46,11 21,12 49,13 31,14 40,15 14,16 20,17 5,18 4}
{0 CHEMBL303684,1 82,2 36.7,3 89.886,4 78.941,5 49.796,6 46.943,7 1.138,8 7.6,9 39,10 536.75,11 40,12 79,13 42,14 51,15 14,16 29,17 6,18 7.337}
{0 CHEMBL304112,1 75,2 42.9,3 78.81,4 70.523,5 46.989,6 45.309,7 1.126,8 8.6,9 40,10 538.66,11 30,12 70,13 45,14 58,15 21,16 30,17 6,18 6.921}
{0 CHEMBL304391,1 68,2 42.2,3 72.185,4 64.312,5 42.773,6 41.068,7 1.128,8 9.4,9 36,10 484.61,11 28,12 64,13 40,14 52,15 20,16 27,17 6,18 5.396}
{0 CHEMBL304551,1 28,2 33.3,3 30.824,4 26.942,5 16.244,6 15.139,7 1.142,8 3.7,9 12,10 169.25,11 15,12 27,13 13,14 14,15 1,16 9,17 1,18 4.553}
{0 CHEMBL304599,1 55,2 36.5,3 59.069,4 53.065,5 34.591,6 33.389,7 1.136,8 11.5,9 30,10 430.54,11 22,12 52,13 33,14 43,15 13,16 19,17 6,18 4.523}
{0 CHEMBL305187,1 53,2 41.2,3 57.315,4 50.243,5 32.813,6 30.299,7 1.124,8 2,9 24,10 325.49,11 27,12 51,13 26,14 32,15 12,16 21,17 1,18 6}
{0 CHEMBL305403,1 73,2 40.6,3 78.099,4 69.298,5 45.54,6 43.616,7 1.132,8 10.1,9 38,10 513.66,11 31,12 69,13 42,14 54,15 20,16 28,17 7,18 5.438}
{0 CHEMBL306182,1 52,2 42.9,3 54.901,4 48.745,5 32.125,6 30.224,7 1.12,8 2,9 25,10 338.46,11 24,12 49,13 28,14 35,15 13,16 21,17 1,18 8.53}
{0 CHEMBL307984,1 78,2 34.7,3 85.477,4 76.123,5 48.074,6 46.001,7 1.14,8 9.3,9 40,10 573.75,11 35,12 75,13 43,14 54,15 14,16 26,17 7,18 4.523}
{0 CHEMBL310852,1 35,2 34.3,3 39.943,4 34.483,5 21.319,6 19.499,7 1.141,8 5.7,9 15,10 208.34,11 20,12 35,13 15,14 18,15 1,16 12,17 2,18 6.237}
{0 CHEMBL318316,1 63,2 40.7,3 66.314,4 58.741,5 39.716,6 37.024,7 1.124,8 6.8,9 31,10 436.63,11 28,12 59,13 35,14 43,15 13,16 24,17 4,18 6.119}
{0 CHEMBL318812,1 54,2 43.1,3 57.109,4 50.687,5 33.506,6 31.487,7 1.12,8 2,9 26,10 351.48,11 25,12 51,13 29,14 36,15 13,16 22,17 1,18 8.951}
{0 CHEMBL320121,1 32,2 34.4,3 36.528,4 31.6,5 19.557,6 17.972,7 1.141,8 6.3,9 14,10 194.31,11 18,12 32,13 14,14 17,15 1,16 11,17 2,18 4.3}
{0 CHEMBL320611,1 56,2 43.4,3 59.315,4 52.243,5 34.813,6 32.299,7 1.119,8 1.9,9 26,10 349.51,11 27,12 53,13 29,14 36,15 13,16 23,17 1,18 7.971}
{0 CHEMBL321041,1 31,2 36.7,3 34.112,4 29.716,5 18.796,6 17.445,7 1.137,8 6.7,9 14,10 192.29,11 16,12 30,13 15,14 18,15 1,16 11,17 2,18 3.3}
{0 CHEMBL321842,1 32,2 34.4,3 36.528,4 31.6,5 19.557,6 17.972,7 1.141,8 6.3,9 14,10 194.31,11 18,12 32,13 14,14 17,15 1,16 11,17 2,18 4.8}
{0 CHEMBL322293,1 32,2 34.4,3 36.528,4 31.6,5 19.557,6 17.972,7 1.141,8 6.3,9 14,10 194.31,11 18,12 32,13 14,14 17,15 1,16 11,17 2,18 4.4}
{0 CHEMBL322342,1 34,2 36.4,3 37.528,4 32.6,5 20.557,6 18.972,7 1.137,8 6.1,9 15,10 206.32,11 18,12 33,13 16,14 19,15 1,16 12,17 2,18 5}
{0 CHEMBL322378,1 62,2 42.4,3 66.228,4 58.229,5 38.58,6 35.848,7 1.123,8 3.4,9 29,10 390.57,11 30,12 59,13 32,14 40,15 14,16 25,17 2,18 5.886}
{0 CHEMBL322555,1 37,2 36.1,3 40.943,4 35.483,5 22.319,6 20.499,7 1.137,8 5.6,9 16,10 220.35,11 20,12 36,13 17,14 20,15 1,16 13,17 2,18 5}
{0 CHEMBL322582,1 67,2 46,3 70.145,4 62.01,5 42.336,6 39.353,7 1.113,8 1.6,9 32,10 425.61,11 31,12 63,13 36,14 46,15 19,16 29,17 1,18 7.903}
{0 CHEMBL325322,1 31,2 33.3,3 34.239,4 29.825,5 18.006,6 16.665,7 1.141,8 3.3,9 13,10 183.28,11 17,12 30,13 14,14 15,15 1,16 10,17 1,18 4.851}
{0 CHEMBL326453,1 45,2 39.5,3 48.484,4 42.476,5 27.29,6 25.246,7 1.128,8 2.3,9 20,10 273.41,11 23,12 43,13 22,14 26,15 7,16 17,17 1,18 5.471}
{0 CHEMBL326640,1 53,2 44,3 55.9,4 49.36,5 33.052,6 30.773,7 1.118,8 2,9 25,10 335.48,11 25,12 50,13 28,14 35,15 13,16 22,17 1,18 8.367}
{0 CHEMBL332242,1 49,2 44.4,3 50.441,4 44.585,5 30.324,6 28.52,7 1.121,8 6.7,9 24,10 319.44,11 21,12 45,13 28,14 36.5,15 12,16 20,17 3,18 5}
{0 CHEMBL335115,1 104,2 35.3,3 116.291,4 101.228,5 63.131,6 58.652,7 1.14,8 6.9,9 47,10 649.98,11 55,12 102,13 49,14 59,15 15,16 36,17 7,18 6.8}
{0 CHEMBL335302,1 63,2 39.3,3 68.77,4 60.221,5 38.552,6 35.595,7 1.127,8 1.6,9 28,10 383.58,11 33,12 61,13 30,14 36.5,15 11,16 24,17 1,18 6.35}
{0 CHEMBL335389,1 69,2 38.8,3 75.6,4 65.989,5 42.074,6 38.648,7 1.128,8 1.5,9 30,10 411.64,11 37,12 67,13 32,14 38.5,15 11,16 26,17 1,18 5}
{0 CHEMBL335941,1 55,2 39.6,3 59.734,4 52.898,5 33.722,6 31.729,7 1.127,8 1.9,9 26,10 357.49,11 27,12 53,13 28,14 34.5,15 11,16 21,17 1,18 7.8}
{0 CHEMBL337023,1 64,2 38.7,3 69.979,4 61.549,5 39.006,6 36.309,7 1.129,8 1.6,9 29,10 399.58,11 33,12 62,13 31,14 37.5,15 11,16 24,17 1,18 7.5}
{0 CHEMBL337150,1 51,2 45.8,3 53.488,4 48.247,5 32.438,6 31.149,7 1.114,8 2.1,9 27,10 363.44,11 21,12 48,13 30,14 39.5,15 17,16 22,17 1,18 6.6}
{0 CHEMBL337227,1 65,2 40.3,3 69.77,4 61.221,5 39.552,6 36.595,7 1.125,8 1.6,9 29,10 395.59,11 33,12 62,13 32,14 38.5,15 11,16 25,17 1,18 5.3}
{0 CHEMBL337870,1 64,2 35.5,3 70.394,4 61.432,5 37.767,6 34.836,7 1.135,8 1.6,9 27,10 377.58,11 35,12 62,13 29,14 32.5,15 5,16 22,17 1,18 7.15}
{0 CHEMBL339189,1 68,2 43.1,3 72.77,4 64.221,5 42.552,6 39.595,7 1.12,8 1.5,9 32,10 431.62,11 33,12 65,13 35,14 44.5,15 17,16 28,17 1,18 5}
{0 CHEMBL344474,1 58,2 39.3,3 63.149,4 55.781,5 35.483,6 33.256,7 1.128,8 1.8,9 27,10 371.52,11 29,12 56,13 29,14 35.5,15 11,16 22,17 1,18 8.15}
{0 CHEMBL363865,1 65,2 45.9,3 67.936,4 59.683,5 40.881,6 37.638,7 1.114,8 1.6,9 30,10 397.6,11 31,12 61,13 34,14 43,15 18,16 28,17 1,18 6}
{0 CHEMBL370757,1 68,2 45.3,3 71.351,4 62.567,5 42.643,6 39.165,7 1.115,8 1.6,9 31,10 411.63,11 33,12 64,13 35,14 44,15 18,16 29,17 1,18 6}
{0 CHEMBL371293,1 54,2 42,3 55.903,4 49.654,5 33.944,6 31.454,7 1.118,8 4,9 26,10 368.54,11 24,12 50,13 30,14 36.5,15 11,16 21,17 2,18 7.745}
{0 CHEMBL372462,1 57,2 42.6,3 60.521,4 52.8,5 35.12,6 32.111,7 1.121,8 1.9,9 25,10 335.53,11 29,12 54,13 28,14 34,15 12,16 23,17 1,18 6}
{0 CHEMBL372983,1 63,2 39,3 66.643,4 58.112,5 37.341,6 34.374,7 1.13,8 3.4,9 27,10 368.57,11 32,12 59,13 31,14 35,15 7,16 23,17 2,18 7.201}
{0 CHEMBL376897,1 50,2 38.3,3 53.111,4 47.072,5 29.58,6 27.939,7 1.13,8 2.1,9 23,10 318.43,11 24,12 47,13 26,14 30,15 7,16 18,17 1,18 9.3}
{0 CHEMBL38085,1 49,2 43.5,3 51.195,4 45.225,5 31.483,6 28.718,7 1.113,8 2.2,9 23,10 325.51,11 23,12 46,13 26,14 33,15 12,16 20,17 1,18 5}
{0 CHEMBL38465,1 33,2 45.2,3 34.491,4 30.8,5 22.472,6 20.885,7 1.113,8 9.7,9 18,10 255.37,11 13,12 31,13 20,14 28,15 12,16 14,17 3,18 6}
{0 CHEMBL38634,1 48,2 44.4,3 50.275,4 44.149,5 29.836,6 27.531,7 1.117,8 2.2,9 22,10 293.44,11 23,12 45,13 25,14 31,15 12,16 20,17 1,18 5}
{0 CHEMBL38904,1 50,2 42.6,3 52.404,4 46.552,5 31.938,6 29.433,7 1.115,8 2.1,9 24,10 341.51,11 23,12 47,13 27,14 35,15 12,16 20,17 1,18 5}
{0 CHEMBL39900,1 48,2 44.4,3 49.986,4 43.898,5 31.029,6 28.003,7 1.111,8 2.2,9 22,10 309.51,11 23,12 45,13 25,14 31,15 12,16 20,17 1,18 5}
{0 CHEMBL400167,1 65,2 38.7,3 70.059,4 60.996,5 39.103,6 35.901,7 1.13,8 3.2,9 28,10 382.6,11 34,12 62,13 31,14 36,15 9,16 24,17 2,18 7.907}
{0 CHEMBL400953,1 66,2 41.9,3 69.643,4 61.112,5 40.341,6 37.374,7 1.123,8 3.2,9 30,10 404.6,11 32,12 62,13 34,14 41,15 13,16 26,17 2,18 7.499}
{0 CHEMBL401154,1 72,2 41.2,3 76.474,4 66.879,5 43.864,6 40.428,7 1.125,8 2.9,9 32,10 432.66,11 36,12 68,13 36,14 43,15 13,16 28,17 2,18 7.361}
{0 CHEMBL40554,1 37,2 37.8,3 41.889,4 37.193,5 24.25,6 22.778,7 1.132,8 5.4,9 19,10 281.79,11 18,12 37,13 19,14 25,15 7,16 14,17 2,18 5.6}
{0 CHEMBL407678,1 166,2 40.5,3 178.609,4 158.45,5 103.552,6 98.801,7 1.13,8 8.2,9 85,10 1152.5,11 73,12 158,13 93,14 119,15 41,16 64,17 13,18 5.24}
{0 CHEMBL407975,1 54,2 39.2,3 57.857,4 51.443,5 33.245,6 31.993,7 1.134,8 9.8,9 28,10 381.48,11 23,12 51,13 31,14 39,15 13,16 20,17 5,18 5.022}
{0 CHEMBL410928,1 64,2 40,3 67.893,4 59.767,5 39.074,6 36.858,7 1.132,8 8.3,9 31,10 419.58,11 29,12 60,13 35,14 43,15 13,16 24,17 5,18 5.824}
{0 CHEMBL41830,1 49,2 45.7,3 51.275,4 45.149,5 30.836,6 28.531,7 1.115,8 2.2,9 23,10 305.45,11 23,12 46,13 26,14 33,15 13,16 21,17 1,18 5}
{0 CHEMBL420739,1 62,2 43.1,3 65.065,4 58.294,5 40.443,6 38.486,7 1.122,8 10.3,9 34,10 472.62,11 24,12 58,13 38,14 50,15 20,16 25,17 6,18 4}
{0 CHEMBL422053,1 83,2 36.3,3 91.178,4 80.487,5 50.495,6 48.153,7 1.14,8 8.8,9 41,10 565.75,11 39,12 80,13 44,14 54,15 15,16 29,17 7,18 5.387}
{0 CHEMBL422407,1 70,2 37.3,3 76.308,4 67.625,5 42.995,6 41.331,7 1.139,8 10.4,9 36,10 493.63,11 31,12 67,13 39,14 49,15 15,16 25,17 7,18 4}
{0 CHEMBL423722,1 51,2 44.9,3 54.694,4 48.803,5 32.745,6 30.961,7 1.116,8 2,9 26,10 349.46,11 23,12 49,13 28,14 37.5,15 17,16 22,17 1,18 6.5}
{0 CHEMBL424832,1 60,2 40.4,3 64.228,4 56.229,5 36.58,6 33.848,7 1.127,8 3.5,9 27,10 366.55,11 30,12 57,13 30,14 36,15 7,16 23,17 2,18 5.584}
{0 CHEMBL432886,1 65,2 39.3,3 69.102,4 61.094,5 39.529,6 37.573,7 1.133,8 8.2,9 32,10 435.58,11 29,12 61,13 36,14 44,15 13,16 24,17 5,18 5.398}
{0 CHEMBL43383,1 74,2 38,3 80.554,4 70.301,5 45.12,6 41.965,7 1.135,8 7,9 34,10 463.69,11 37,12 71,13 37,14 45,15 13,16 27,17 5,18 6.7}
{0 CHEMBL437781,1 69,2 41.5,3 73.059,4 63.996,5 42.103,6 38.901,7 1.124,8 3.1,9 31,10 418.63,11 34,12 65,13 35,14 42,15 13,16 27,17 2,18 8.229}
{0 CHEMBL439867,1 57,2 43.4,3 59.398,4 52.461,5 35.057,6 32.794,7 1.121,8 3.8,9 27,10 362.51,11 26,12 53,13 31,14 38,15 13,16 23,17 2,18 8.268}
{0 CHEMBL442014,1 137,2 37.9,3 149.861,4 130.952,5 83.956,6 78.35,7 1.135,8 7.6,9 64,10 873.28,11 68,12 132,13 69,14 85,15 26,16 50,17 10,18 6.76}
{0 CHEMBL44773,1 73,2 39.1,3 78.138,4 68.418,5 44.358,6 41.439,7 1.132,8 7.2,9 34,10 461.67,11 35,12 69,13 38,14 46,15 13,16 27,17 5,18 6.824}
{0 CHEMBL44838,1 68,2 38.5,3 73.723,4 64.534,5 41.597,6 38.912,7 1.134,8 7.7,9 32,10 435.63,11 33,12 65,13 35,14 43,15 13,16 25,17 5,18 4.824}
{0 CHEMBL45983,1 67,2 39.7,3 71.308,4 62.65,5 40.836,6 38.385,7 1.132,8 7.9,9 32,10 433.61,11 31,12 63,13 36,14 44,15 13,16 25,17 5,18 5.824}
{0 CHEMBL46,1 44,2 43.9,3 46.026,4 40.702,5 27.563,6 25.993,7 1.123,8 7.3,9 22,10 293.4,11 19,12 41,13 25,14 33.5,15 12,16 18,17 3,18 5}
{0 CHEMBL46315,1 76,2 38.9,3 81.554,4 71.301,5 46.12,6 42.965,7 1.133,8 6.9,9 35,10 475.7,11 37,12 72,13 39,14 47,15 13,16 28,17 5,18 7.155}
{0 CHEMBL46390,1 71,2 38.2,3 77.138,4 67.418,5 43.358,6 40.439,7 1.134,8 7.4,9 33,10 449.66,11 35,12 68,13 36,14 44,15 13,16 26,17 5,18 5.222}
{0 CHEMBL47575,1 62,2 39,3 66.893,4 58.767,5 38.074,6 35.858,7 1.134,8 8.5,9 30,10 407.57,11 29,12 59,13 33,14 41,15 13,16 23,17 5,18 5}
{0 CHEMBL48980,1 62,2 39,3 66.893,4 58.767,5 38.074,6 35.858,7 1.134,8 8.5,9 30,10 407.57,11 29,12 59,13 33,14 41,15 13,16 23,17 5,18 5.699}
{0 CHEMBL49525,1 62,2 39,3 66.893,4 58.767,5 38.074,6 35.858,7 1.134,8 8.5,9 30,10 407.57,11 29,12 59,13 33,14 41,15 13,16 23,17 5,18 5.824}
{0 CHEMBL49721,1 65,2 38.7,3 70.252,4 61.974,5 40.694,6 38.212,7 1.133,8 8.1,9 32,10 456.04,11 30,12 62,13 35,14 43,15 13,16 24,17 5,18 5.398}
{0 CHEMBL50176,1 71,2 38.2,3 77.138,4 67.418,5 43.358,6 40.439,7 1.134,8 7.4,9 33,10 449.66,11 35,12 68,13 36,14 44,15 13,16 26,17 5,18 5.699}
{0 CHEMBL517712,1 46,2 38.6,3 49.694,4 43.803,5 27.745,6 25.961,7 1.129,8 2.3,9 21,10 289.41,11 23,12 44,13 23,14 27,15 7,16 17,17 1,18 9.149}
{0 CHEMBL522460,1 66,2 40.3,3 70.015,4 61.105,5 40.137,6 37.176,7 1.129,8 6.5,9 30,10 404.61,11 32,12 62,13 34,14 41,15 13,16 25,17 4,18 5.261}
{0 CHEMBL540608,1 111,2 34.5,3 125.283,4 107.453,5 66.535,6 59.846,7 1.139,8 3.6,9 44,10 611.08,11 66,12 110,13 45,14 51,15 12,16 38,17 4,18 5.73}
{0 CHEMBL542756,1 114,2 34.5,3 128.698,4 110.337,5 68.297,6 61.373,7 1.139,8 3.5,9 45,10 625.11,11 68,12 113,13 46,14 52,15 12,16 39,17 4,18 5.64}
{0 CHEMBL542982,1 102,2 34.7,3 115.038,4 98.803,5 61.251,6 55.266,7 1.139,8 4,9 41,10 568.99,11 60,12 101,13 42,14 48,15 12,16 35,17 4,18 5.37}
{0 CHEMBL544759,1 49,2 39.1,3 51.986,4 46.349,5 29.443,6 28.17,7 1.13,8 4.3,9 24,10 330.42,11 22,12 46,13 27,14 32,15 8,16 18,17 2,18 8.456}
{0 CHEMBL544993,1 46,2 39.5,3 48.571,4 43.465,5 27.682,6 26.643,7 1.13,8 4.7,9 23,10 316.39,11 20,12 43,13 26,14 31,15 8,16 17,17 2,18 8.301}
{0 CHEMBL553023,1 120,2 34.5,3 135.529,4 116.104,5 71.819,6 64.426,7 1.139,8 3.4,9 47,10 653.17,11 72,12 119,13 48,14 54,15 12,16 41,17 4,18 5.91}
{0 CHEMBL553066,1 46,2 38.6,3 49.777,4 44.022,5 27.989,6 26.455,7 1.131,8 4.5,9 22,10 302.41,11 22,12 44,13 24,14 29,15 8,16 17,17 2,18 8.854}
{0 CHEMBL553562,1 48,2 37.8,3 51.069,4 45.567,5 28.688,6 27.665,7 1.135,8 6.7,9 24,10 331.41,11 21,12 45,13 27,14 32,15 8,16 17,17 3,18 8.347}
{0 CHEMBL553783,1 49,2 38.3,3 53.192,4 46.905,5 29.75,6 27.982,7 1.132,8 4.3,9 23,10 316.44,11 24,12 47,13 25,14 30,15 8,16 18,17 2,18 8.509}
{0 CHEMBL553894,1 48,2 37,3 52.275,4 46.123,5 28.995,6 27.477,7 1.136,8 6.5,9 23,10 317.43,11 23,12 46,13 25,14 30,15 8,16 17,17 3,18 8.602}
{0 CHEMBL554889,1 123,2 34.4,3 138.944,4 118.988,5 73.581,6 65.953,7 1.139,8 3.3,9 48,10 667.2,11 74,12 122,13 49,14 55,15 12,16 42,17 4,18 5.85}
{0 CHEMBL557224,1 96,2 34.7,3 108.207,4 93.035,5 57.728,6 52.212,7 1.139,8 4.2,9 39,10 540.93,11 56,12 95,13 40,14 46,15 12,16 33,17 4,18 5.42}
{0 CHEMBL557429,1 99,2 34.7,3 111.622,4 95.919,5 59.49,6 53.739,7 1.139,8 4.1,9 40,10 554.96,11 58,12 98,13 41,14 47,15 12,16 34,17 4,18 5.29}
{0 CHEMBL558226,1 45,2 38.1,3 47.595,4 42.236,5 27.637,6 26.063,7 1.133,8 7.1,9 22,10 321.84,11 20,12 42,13 25,14 29,15 7,16 16,17 3,18 5}
{0 CHEMBL558910,1 51,2 43.8,3 53.694,4 47.803,5 31.745,6 29.961,7 1.119,8 2.1,9 25,10 337.45,11 23,12 48,13 28,14 35,15 13,16 21,17 1,18 9.796}
{0 CHEMBL56734,1 30,2 30,3 34.446,4 29.767,5 17.387,6 15.929,7 1.148,8 3.3,9 12,10 172.28,11 18,12 30,13 12,14 13,15 1,16 9,17 1,18 6.161}
{0 CHEMBL59085,1 30,2 30,3 34.446,4 29.767,5 17.387,6 15.929,7 1.148,8 3.3,9 12,10 172.28,11 18,12 30,13 12,14 13,15 1,16 9,17 1,18 4.674}
{0 CHEMBL59587,1 30,2 30,3 34.446,4 29.767,5 17.387,6 15.929,7 1.148,8 3.3,9 12,10 172.28,11 18,12 30,13 12,14 13,15 1,16 9,17 1,18 5.532}
{0 CHEMBL606901,1 57,2 43.4,3 59.398,4 52.461,5 35.057,6 32.794,7 1.121,8 3.8,9 27,10 362.51,11 26,12 53,13 31,14 38,15 13,16 23,17 2,18 6.31}
{0 CHEMBL606902,1 57,2 43.4,3 59.398,4 52.461,5 35.057,6 32.794,7 1.121,8 3.8,9 27,10 362.51,11 26,12 53,13 31,14 38,15 13,16 23,17 2,18 5.886}
{0 CHEMBL606903,1 54,2 42,3 55.903,4 49.654,5 33.944,6 31.454,7 1.118,8 4,9 26,10 368.54,11 24,12 50,13 30,14 36.5,15 11,16 21,17 2,18 8.456}
{0 CHEMBL606904,1 54,2 42,3 55.903,4 49.654,5 33.944,6 31.454,7 1.118,8 4,9 26,10 368.54,11 24,12 50,13 30,14 36.5,15 11,16 21,17 2,18 7.678}
{0 CHEMBL606962,1 58,2 42.6,3 60.607,4 53.789,5 35.512,6 33.509,7 1.122,8 3.7,9 28,10 378.51,11 26,12 54,13 32,14 39,15 13,16 23,17 2,18 6.824}
{0 CHEMBL606963,1 58,2 42.6,3 60.607,4 53.789,5 35.512,6 33.509,7 1.122,8 3.7,9 28,10 378.51,11 26,12 54,13 32,14 39,15 13,16 23,17 2,18 7.456}
{0 CHEMBL607175,1 45,2 39.5,3 48.484,4 42.476,5 27.29,6 25.246,7 1.128,8 2.3,9 20,10 273.41,11 23,12 43,13 22,14 26,15 7,16 17,17 1,18 4.827}
{0 CHEMBL63452,1 50,2 37.5,3 54.317,4 47.629,5 29.887,6 27.751,7 1.132,8 2.1,9 22,10 304.45,11 26,12 48,13 24,14 28,15 7,16 18,17 1,18 8.585}
{0 CHEMBL64000,1 28,2 33.3,3 30.824,4 26.942,5 16.244,6 15.139,7 1.142,8 3.7,9 12,10 169.25,11 15,12 27,13 13,14 14,15 1,16 9,17 1,18 6.167}
{0 CHEMBL64788,1 28,2 33.3,3 30.824,4 26.942,5 16.244,6 15.139,7 1.142,8 3.7,9 12,10 169.25,11 15,12 27,13 13,14 14,15 1,16 9,17 1,18 4.745}
{0 CHEMBL66177,1 73,2 37.1,3 79.723,4 70.509,5 44.756,6 42.857,7 1.139,8 10,9 37,10 507.66,11 33,12 70,13 40,14 50,15 15,16 26,17 7,18 4.967}
{0 CHEMBL67381,1 61,2 43.9,3 64.062,4 57,5 38.551,6 36.805,7 1.124,8 8.8,9 32,10 427.55,11 25,12 57,13 36,14 47,15 19,16 25,17 5,18 6.62}
{0 CHEMBL67532,1 53,2 40,3 56.591,4 50.44,5 33.648,6 32.105,7 1.132,8 10,9 28,10 399.92,11 22,12 50,13 31,14 39,15 13,16 20,17 5,18 7.108}
{0 CHEMBL67700,1 39,2 40.5,3 41.654,4 36.709,5 23.767,6 22.192,7 1.126,8 2.7,9 18,10 245.35,11 19,12 37,13 20,14 24,15 7,16 15,17 1,18 4.57}
{0 CHEMBL68695,1 68,2 35.4,3 74.022,4 66.145,5 42.335,6 40.706,7 1.139,8 10.8,9 36,10 515.66,11 29,12 65,13 39,14 50,15 14,16 23,17 7,18 4.523}
{0 CHEMBL68709,1 60,2 44.6,3 62.857,4 56.443,5 38.245,6 36.993,7 1.122,8 8.9,9 33,10 441.53,11 23,12 56,13 37,14 49,15 20,16 25,17 5,18 4}
{0 CHEMBL68771,1 55,2 38.5,3 59.145,4 52.218,5 33.796,6 32.299,7 1.137,8 11.5,9 28,10 380.5,11 24,12 52,13 31,14 39,15 13,16 20,17 6,18 5.706}
{0 CHEMBL68827,1 63,2 35,3 68.398,4 60.934,5 39.12,6 37.464,7 1.14,8 11.7,9 33,10 473.62,11 27,12 60,13 36,14 46,15 13,16 21,17 7,18 4.523}
{0 CHEMBL69287,1 65,2 37.1,3 70.684,4 62.414,5 39.779,6 38.089,7 1.14,8 11.3,9 33,10 451.59,11 29,12 62,13 36,14 45,15 14,16 23,17 7,18 5.177}
{0 CHEMBL69423,1 54,2 39.2,3 57.857,4 51.443,5 33.245,6 31.993,7 1.134,8 9.8,9 28,10 381.48,11 23,12 51,13 31,14 39,15 13,16 20,17 5,18 5.357}
{0 CHEMBL69458,1 94,2 38.9,3 102.009,4 90.254,5 58.018,6 55.206,7 1.133,8 7.8,9 47,10 641.85,11 43,12 90,13 51,14 64,15 21,16 35,17 7,18 5.46}
{0 CHEMBL70003,1 60,2 38.6,3 64.77,4 57.429,5 37.012,6 35.541,7 1.136,8 10.5,9 31,10 422.54,11 26,12 57,13 34,14 43,15 14,16 22,17 6,18 6.013}
{0 CHEMBL70082,1 75,2 36.1,3 81.487,4 71.407,5 47.631,6 43.565,7 1.132,8 6.9,9 35,10 495.77,11 37,12 72,13 38,14 46,15 13,16 26,17 5,18 4.523}
{0 CHEMBL70133,1 80,2 36.4,3 87.763,4 77.603,5 48.733,6 46.626,7 1.14,8 9.1,9 40,10 551.72,11 37,12 77,13 43,14 53,15 15,16 28,17 7,18 5.208}
{0 CHEMBL7303,1 24,2 33.3,3 27.408,4 24.058,5 14.483,6 13.612,7 1.142,8 4.2,9 11,10 155.22,11 13,12 24,13 11,14 13,15 3,16 8,17 1,18 5.244}
{0 CHEMBL7634,1 34,2 36.4,3 37.528,4 32.6,5 20.557,6 18.972,7 1.137,8 6.1,9 15,10 206.32,11 18,12 33,13 16,14 19,15 1,16 12,17 2,18 6.4}
{0 CHEMBL76897,1 52,2 42,3 56.107,4 49.301,5 32.432,6 30.036,7 1.122,8 2,9 24,10 324.48,11 26,12 50,13 26,14 33,15 13,16 21,17 1,18 8.94}
{0 CHEMBL978,1 28,2 27.6,3 33.446,4 28.767,5 16.387,6 14.929,7 1.153,8 3.4,9 11,10 160.27,11 18,12 29,13 10,14 11,15 1,16 8,17 1,18 6.921}
{0 CHEMBL9967,1 50,2 40.4,3 53.232,4 47.232,5 31.029,6 29.751,7 1.133,8 10.6,9 26,10 351.45,11 21,12 47,13 29,14 37,15 13,16 19,17 5,18 6.76}
