"molecule_id","H.","nH","pXC50"
{1 46.9,2 15,3 8.398}
{0 CHEMBL113759,1 46.4,2 26,3 7.959}
{0 CHEMBL1159916,1 49.2,2 29,3 6.721}
{0 CHEMBL1159917,1 50.8,2 33,3 5}
{0 CHEMBL1159919,1 50.8,2 33,3 7.367}
{0 CHEMBL1159920,1 47,2 31,3 6.721}
{0 CHEMBL1159921,1 50.8,2 33,3 7.097}
{0 CHEMBL1159922,1 50.8,2 33,3 5.658}
{0 CHEMBL1159923,1 45,2 27,3 5.959}
{0 CHEMBL1159924,1 46,2 29,3 7.155}
{0 CHEMBL1159925,1 47,2 31,3 8.658}
{0 CHEMBL1159926,1 48.2,2 27,3 6.733}
{0 CHEMBL1159927,1 46,2 29,3 8.538}
{0 CHEMBL1159928,1 50,2 31,3 6.959}
{0 CHEMBL1159930,1 47,2 31,3 8.638}
{0 CHEMBL1159931,1 50.8,2 33,3 6.854}
{0 CHEMBL1159932,1 52.7,2 29,3 7.81}
{0 CHEMBL1159933,1 48.2,2 27,3 8.854}
{0 CHEMBL1159934,1 46.1,2 35,3 6.824}
{0 CHEMBL1159935,1 49.3,2 37,3 6.538}
{0 CHEMBL1159936,1 47.8,2 33,3 8.481}
{0 CHEMBL1159937,1 46.1,2 35,3 6.801}
{0 CHEMBL1159938,1 46.3,2 31,3 6.252}
{0 CHEMBL1159939,1 47.8,2 22,3 8.31}
{0 CHEMBL1159940,1 48.2,2 27,3 8.921}
{0 CHEMBL1159941,1 47,2 31,3 7.292}
{0 CHEMBL1159942,1 46,2 29,3 8.699}
{0 CHEMBL1159944,1 50.8,2 33,3 6.102}
{0 CHEMBL1159945,1 50.8,2 33,3 5.398}
{0 CHEMBL1159947,1 48.2,2 27,3 6.836}
{0 CHEMBL1159949,1 47,2 31,3 6.721}
{0 CHEMBL1159950,1 46.3,2 31,3 7.488}
{0 CHEMBL1159952,1 45,2 27,3 9.027}
{0 CHEMBL1159953,1 45.3,2 29,3 7.928}
{0 CHEMBL1159954,1 46,2 29,3 6.983}
{0 CHEMBL1159955,1 47,2 31,3 6.796}
{0 CHEMBL1159956,1 47.8,2 33,3 6.638}
{0 CHEMBL1159959,1 47.8,2 33,3 6.268}
{0 CHEMBL1159961,1 49.2,2 31,3 6.745}
{0 CHEMBL1160560,1 50,2 27,3 6.301}
{0 CHEMBL146746,1 48.3,2 29,3 6.66}
{0 CHEMBL147285,1 43.1,2 25,3 7.469}
{0 CHEMBL148777,1 47.4,2 27,3 7.77}
{0 CHEMBL151631,1 48.3,2 29,3 6.284}
{0 CHEMBL1560,1 51.7,2 15,3 6}
{0 CHEMBL161885,1 46.2,2 24,3 7.699}
{0 CHEMBL163635,1 45.3,2 24,3 7.959}
{0 CHEMBL163682,1 46.4,2 26,3 6.406}
{0 CHEMBL164625,1 47.3,2 26,3 7.796}
{0 CHEMBL165617,1 46.4,2 26,3 7.892}
{0 CHEMBL16779,1 44.4,2 16,3 8.854}
{0 CHEMBL17107,1 42.4,2 14,3 7.921}
{0 CHEMBL171850,1 50,2 29,3 7.585}
{0 CHEMBL172787,1 50,2 29,3 7.276}
{0 CHEMBL172978,1 50,2 34,3 6.42}
{0 CHEMBL173287,1 52.3,2 23,3 7.432}
{0 CHEMBL173919,1 53.2,2 25,3 7.398}
{0 CHEMBL174066,1 50,2 34,3 7.301}
{0 CHEMBL174237,1 53.2,2 25,3 7.699}
{0 CHEMBL175110,1 46.8,2 29,3 6.745}
{0 CHEMBL176960,1 49.2,2 32,3 6.495}
{0 CHEMBL1794004,1 59,2 59,3 8.26}
{0 CHEMBL1794011,1 49.2,2 32,3 7.495}
{0 CHEMBL1794012,1 51.7,2 30,3 8.276}
{0 CHEMBL1794014,1 55.7,2 34,3 6.757}
{0 CHEMBL19070,1 47.5,2 28,3 8.347}
{0 CHEMBL1907790,1 42.4,2 14,3 5.475}
{0 CHEMBL1907791,1 44.4,2 16,3 8.602}
{0 CHEMBL1907792,1 44.4,2 16,3 5.217}
{0 CHEMBL1907793,1 46.2,2 18,3 5.762}
{0 CHEMBL1907967,1 44.4,2 16,3 9.301}
{0 CHEMBL1907968,1 42.4,2 14,3 5.602}
{0 CHEMBL19165,1 48.4,2 30,3 8.456}
{0 CHEMBL19494,1 48.4,2 30,3 8.658}
{0 CHEMBL19573,1 50,2 26,3 7.337}
{0 CHEMBL19621,1 45.2,2 19,3 7.638}
{0 CHEMBL19647,1 50,2 26,3 7.62}
{0 CHEMBL19755,1 48.4,2 30,3 8.523}
{0 CHEMBL19816,1 45.5,2 30,3 7.699}
{0 CHEMBL19820,1 51.2,2 22,3 7.658}
{0 CHEMBL19846,1 46.9,2 15,3 8.398}
{0 CHEMBL19935,1 50,2 26,3 6.886}
{0 CHEMBL19936,1 50.9,2 28,3 7.62}
{0 CHEMBL19951,1 50,2 28,3 8.276}
{0 CHEMBL20010,1 47.8,2 22,3 8.886}
{0 CHEMBL20053,1 43.9,2 29,3 7.301}
{0 CHEMBL20067,1 47.5,2 28,3 8.444}
{0 CHEMBL20123,1 46.2,2 24,3 8.638}
{0 CHEMBL20182,1 54.9,2 28,3 6.721}
{0 CHEMBL20193,1 46.2,2 18,3 7.854}
{0 CHEMBL20322,1 44.1,2 30,3 6.921}
{0 CHEMBL20326,1 47.8,2 22,3 8.42}
{0 CHEMBL20341,1 51.7,2 30,3 8.854}
{0 CHEMBL20419,1 49.3,2 34,3 8.387}
{0 CHEMBL20574,1 49,2 24,3 6.745}
{0 CHEMBL20966,1 45.5,2 30,3 7.398}
{0 CHEMBL21025,1 48.4,2 30,3 8.553}
{0 CHEMBL2110258,1 53.2,2 25,3 7.456}
{0 CHEMBL2110347,1 53.2,2 25,3 8.444}
{0 CHEMBL2114220,1 45.6,2 26,3 8.292}
{0 CHEMBL2114222,1 46.4,2 26,3 7.602}
{0 CHEMBL2114403,1 45.3,2 24,3 7.569}
{0 CHEMBL2114407,1 44.9,2 22,3 8.538}
{0 CHEMBL2114408,1 46.2,2 24,3 8.523}
{0 CHEMBL2115220,1 45.6,2 26,3 8.569}
{0 CHEMBL2115345,1 45.3,2 24,3 8}
{0 CHEMBL2115347,1 44.9,2 22,3 8.523}
{0 CHEMBL2115348,1 46.2,2 24,3 8.119}
{0 CHEMBL225085,1 52.6,2 30,3 9.097}
{0 CHEMBL262267,1 44.4,2 24,3 8.398}
{0 CHEMBL277238,1 44.4,2 28,3 8.538}
{0 CHEMBL277707,1 47.5,2 28,3 7.347}
{0 CHEMBL279966,1 48.4,2 30,3 8}
{0 CHEMBL280203,1 45.7,2 32,3 7}
{0 CHEMBL282469,1 49,2 24,3 8.022}
{0 CHEMBL282664,1 45.5,2 30,3 7.301}
{0 CHEMBL283315,1 51.7,2 30,3 6.745}
{0 CHEMBL283741,1 46.4,2 26,3 7.523}
{0 CHEMBL285204,1 46.2,2 24,3 8.62}
{0 CHEMBL285447,1 45.3,2 24,3 8.678}
{0 CHEMBL285490,1 45.3,2 24,3 9.155}
{0 CHEMBL285617,1 48.9,2 22,3 7.732}
{0 CHEMBL285619,1 43.1,2 28,3 8.658}
{0 CHEMBL285960,1 45.2,2 28,3 8.319}
{0 CHEMBL287261,1 42.3,2 22,3 7.658}
{0 CHEMBL287358,1 52.1,2 25,3 8.398}
{0 CHEMBL287801,1 46.4,2 26,3 7.367}
{0 CHEMBL288302,1 42.9,2 24,3 7.456}
{0 CHEMBL288584,1 46.2,2 24,3 8.523}
{0 CHEMBL288814,1 46.2,2 24,3 8.301}
{0 CHEMBL288911,1 45.2,2 28,3 7.523}
{0 CHEMBL289223,1 44.8,2 26,3 7.292}
{0 CHEMBL289518,1 45.2,2 28,3 8.301}
{0 CHEMBL290337,1 46.2,2 24,3 8.745}
{0 CHEMBL290366,1 46.2,2 24,3 6.824}
{0 CHEMBL290492,1 46.4,2 26,3 8.347}
{0 CHEMBL290610,1 46.4,2 26,3 8.523}
{0 CHEMBL292534,1 45.9,2 28,3 7.108}
{0 CHEMBL293685,1 43.4,2 23,3 7.886}
{0 CHEMBL293794,1 49,2 25,3 6.721}
{0 CHEMBL295104,1 47.2,2 25,3 8.301}
{0 CHEMBL298827,1 46.9,2 15,3 8.721}
{0 CHEMBL299588,1 44.4,2 16,3 6.26}
{0 CHEMBL301646,1 43.4,2 23,3 8.745}
{0 CHEMBL301703,1 46.8,2 29,3 6.824}
{0 CHEMBL302383,1 48.3,2 28,3 5.638}
{0 CHEMBL302837,1 43.4,2 23,3 8.301}
{0 CHEMBL303159,1 46.9,2 23,3 10.339}
{0 CHEMBL303302,1 45.6,2 26,3 7.959}
{0 CHEMBL303892,1 48,2 24,3 8.427}
{0 CHEMBL304209,1 43.4,2 23,3 8.027}
{0 CHEMBL304218,1 46.7,2 28,3 8.097}
{0 CHEMBL304629,1 45.6,2 26,3 8.569}
{0 CHEMBL304939,1 47.2,2 17,3 7.699}
{0 CHEMBL305089,1 45.6,2 26,3 8.301}
{0 CHEMBL305388,1 45.6,2 26,3 7.824}
{0 CHEMBL308333,1 56.5,2 35,3 5.086}
{0 CHEMBL309293,1 46.8,2 29,3 6.538}
{0 CHEMBL309766,1 46.8,2 29,3 6.745}
{0 CHEMBL310150,1 46.6,2 27,3 6.523}
{0 CHEMBL310199,1 48.1,2 25,3 7.699}
{0 CHEMBL310200,1 47.2,2 25,3 7.77}
{0 CHEMBL310602,1 50,2 21,3 8.187}
{0 CHEMBL311869,1 51.1,2 23,3 8.155}
{0 CHEMBL312714,1 52.1,2 25,3 7.31}
{0 CHEMBL313036,1 49.1,2 26,3 6.523}
{0 CHEMBL313198,1 46.4,2 26,3 8}
{0 CHEMBL313284,1 56.8,2 25,3 4}
{0 CHEMBL313627,1 43.6,2 24,3 8.456}
{0 CHEMBL313764,1 45.9,2 28,3 8.602}
{0 CHEMBL314063,1 46,2 23,3 7.208}
{0 CHEMBL314215,1 50,2 26,3 7.301}
{0 CHEMBL314418,1 48.7,2 19,3 8.824}
{0 CHEMBL314770,1 42.6,2 23,3 8.276}
{0 CHEMBL315037,1 46.4,2 26,3 7.903}
{0 CHEMBL315255,1 53.3,2 24,3 5.699}
{0 CHEMBL315601,1 45.6,2 26,3 8.824}
{0 CHEMBL315695,1 42.1,2 24,3 7.208}
{0 CHEMBL316172,1 47.7,2 21,3 8.046}
{0 CHEMBL316180,1 48.2,2 27,3 8.854}
{0 CHEMBL327454,1 42.6,2 23,3 8.921}
{0 CHEMBL329125,1 44.4,2 24,3 9}
{0 CHEMBL329823,1 43.6,2 24,3 8.796}
{0 CHEMBL34668,1 40,2 16,3 5.638}
{0 CHEMBL347763,1 43.5,2 27,3 6.284}
{0 CHEMBL348205,1 49.1,2 27,3 8.398}
{0 CHEMBL34876,1 42.9,2 24,3 6.87}
{0 CHEMBL350633,1 46.4,2 26,3 7.678}
{0 CHEMBL35643,1 45.3,2 24,3 8.745}
{0 CHEMBL356858,1 49.1,2 28,3 8.268}
{0 CHEMBL35749,1 46.4,2 26,3 8.523}
{0 CHEMBL358903,1 48.2,2 27,3 7.658}
{0 CHEMBL36094,1 47.6,2 20,3 8.735}
{0 CHEMBL366937,1 48.6,2 17,3 7.301}
{0 CHEMBL367174,1 49.2,2 32,3 7.301}
{0 CHEMBL36841,1 48.9,2 22,3 7.288}
{0 CHEMBL37276,1 46.4,2 26,3 8.097}
{0 CHEMBL37418,1 44.9,2 22,3 8.602}
{0 CHEMBL37596,1 44.1,2 26,3 6.854}
{0 CHEMBL37711,1 45.2,2 28,3 7.456}
{0 CHEMBL37841,1 45.2,2 28,3 8.824}
{0 CHEMBL378763,1 52.1,2 25,3 7.991}
{0 CHEMBL37921,1 47.6,2 20,3 8.638}
{0 CHEMBL38075,1 46.2,2 24,3 8.658}
{0 CHEMBL38235,1 44.8,2 26,3 8.268}
{0 CHEMBL38249,1 46.2,2 24,3 8.602}
{0 CHEMBL410980,1 49,2 24,3 7.699}
{0 CHEMBL41228,1 51.2,2 22,3 7.398}
{0 CHEMBL417878,1 47.6,2 20,3 7.561}
{0 CHEMBL418738,1 49.1,2 26,3 7.201}
{0 CHEMBL419127,1 44.6,2 25,3 7.585}
{0 CHEMBL419305,1 47.8,2 22,3 4.77}
{0 CHEMBL419499,1 45.3,2 24,3 8.796}
{0 CHEMBL419839,1 49.1,2 26,3 6.523}
{0 CHEMBL421702,1 49.1,2 27,3 6.267}
{0 CHEMBL422417,1 46.4,2 26,3 8.071}
{0 CHEMBL427760,1 46.4,2 26,3 8.638}
{0 CHEMBL43370,1 48.9,2 46,3 7.046}
{0 CHEMBL439768,1 47.2,2 25,3 8.699}
{0 CHEMBL440104,1 46.2,2 18,3 8.62}
{0 CHEMBL47289,1 47.2,2 25,3 7.745}
{0 CHEMBL479579,1 47.9,2 34,3 8.461}
{0 CHEMBL53141,1 55,2 22,3 6.602}
{0 CHEMBL53621,1 55.7,2 34,3 6.444}
{0 CHEMBL53678,1 55,2 33,3 6.42}
{0 CHEMBL54457,1 49.1,2 27,3 6.495}
{0 CHEMBL54477,1 49,2 25,3 6.538}
{0 CHEMBL54601,1 49,2 25,3 7.357}
{0 CHEMBL54796,1 51.6,2 32,3 6.456}
{0 CHEMBL54823,1 51.6,2 33,3 6.585}
{0 CHEMBL54942,1 47.9,2 23,3 6.886}
{0 CHEMBL55056,1 46.2,2 18,3 8.796}
{0 CHEMBL55103,1 54.1,2 20,3 6.658}
{0 CHEMBL55286,1 53.2,2 25,3 7.854}
{0 CHEMBL55520,1 50.8,2 31,3 6.495}
{0 CHEMBL55583,1 50.8,2 31,3 6.658}
{0 CHEMBL55613,1 53.7,2 29,3 6.456}
{0 CHEMBL55721,1 50.8,2 31,3 6.569}
{0 CHEMBL57623,1 44.9,2 22,3 8.432}
{0 CHEMBL59674,1 42.6,2 23,3 7.959}
{0 CHEMBL59762,1 45.6,2 26,3 7.523}
{0 CHEMBL59856,1 45.6,2 26,3 7.796}
{0 CHEMBL60363,1 47.5,2 29,3 7.824}
{0 CHEMBL60439,1 45.6,2 26,3 8.886}
{0 CHEMBL61016,1 45.6,2 26,3 8.222}
{0 CHEMBL61640,1 44.4,2 28,3 7.854}
{0 CHEMBL61713,1 43.4,2 23,3 8.42}
{0 CHEMBL63317,1 46.8,2 22,3 8.611}
{0 CHEMBL65903,1 48.9,2 23,3 6.011}
{0 CHEMBL66284,1 50,2 16,3 8.699}
{0 CHEMBL66967,1 45.7,2 21,3 9.398}
{0 CHEMBL67000,1 48.3,2 14,3 8.31}
{0 CHEMBL67348,1 48.7,2 19,3 6.448}
{0 CHEMBL68128,1 46.9,2 23,3 7.523}
{0 CHEMBL69793,1 51.4,2 18,3 6.569}
{0 CHEMBL79134,1 50,2 21,3 8.398}
{0 CHEMBL79276,1 51.2,2 22,3 7.119}
{0 CHEMBL79333,1 48.7,2 19,3 7.337}
{0 CHEMBL79520,1 50.8,2 30,3 6.523}
{0 CHEMBL79582,1 55.3,2 21,3 8.602}
{0 CHEMBL79592,1 51.1,2 23,3 7.222}
{0 CHEMBL79626,1 50,2 30,3 6.523}
{0 CHEMBL79627,1 44.9,2 22,3 6.833}
{0 CHEMBL79650,1 51.1,2 23,3 7.509}
{0 CHEMBL79718,1 46.6,2 27,3 8.699}
{0 CHEMBL79804,1 48.1,2 25,3 6.959}
{0 CHEMBL79860,1 53.8,2 21,3 8.456}
{0 CHEMBL80037,1 51.1,2 23,3 6.523}
{0 CHEMBL80038,1 50,2 21,3 8.456}
{0 CHEMBL80055,1 49.1,2 27,3 6.432}
{0 CHEMBL81194,1 44.9,2 22,3 8.523}
{0 CHEMBL81240,1 48.1,2 25,3 7.959}
{0 CHEMBL81413,1 51.2,2 22,3 7.027}
{0 CHEMBL81645,1 52.1,2 25,3 6.636}
{0 CHEMBL81658,1 46.9,2 23,3 7.495}
{0 CHEMBL82141,1 50,2 21,3 8.187}
{0 CHEMBL82369,1 51.1,2 23,3 8.301}
{0 CHEMBL82542,1 46.6,2 27,3 7.409}
{0 CHEMBL83044,1 44.9,2 31,3 6.562}
{0 CHEMBL83704,1 48.1,2 25,3 6.876}
{0 CHEMBL84018,1 46.9,2 23,3 7.721}
{0 CHEMBL84207,1 48.2,2 27,3 7.244}
{0 CHEMBL84304,1 46.9,2 23,3 7.854}
{0 CHEMBL84349,1 55.3,2 21,3 6.523}
{0 CHEMBL84526,1 51.8,2 29,3 6.523}
{0 CHEMBL84546,1 50,2 21,3 8.62}
{0 CHEMBL85320,1 46.2,2 18,3 8.434}
{0 CHEMBL85430,1 47.8,2 22,3 4.215}
{0 CHEMBL85512,1 46.5,2 20,3 4.444}
{0 CHEMBL86201,1 48.6,2 17,3 8.102}
{0 CHEMBL86211,1 47.6,2 20,3 5.469}
{0 CHEMBL86290,1 48.2,2 27,3 7.921}
{0 CHEMBL86291,1 47.2,2 25,3 8.699}
{0 CHEMBL86475,1 46.4,2 26,3 8.276}
{0 CHEMBL86778,1 44.4,2 24,3 8.62}
{0 CHEMBL86803,1 45.6,2 26,3 8.26}
{0 CHEMBL86884,1 43.6,2 24,3 8.197}
{0 CHEMBL87005,1 45.3,2 24,3 8.495}
{0 CHEMBL88278,1 44.8,2 26,3 8.658}
{0 CHEMBL89388,1 46.4,2 26,3 7.77}
{0 CHEMBL89573,1 43.6,2 24,3 8.367}
{0 CHEMBL89695,1 44.8,2 26,3 8.469}
{0 CHEMBL89840,1 45.5,2 25,3 8.745}
{0 CHEMBL90000,1 44.4,2 24,3 8.469}
