{
  "data_features": {
    "feature": [
      {
        "data_type": "nominal",
        "index": "0",
        "is_ignore": "false",
        "is_row_identifier": "true",
        "is_target": "false",
        "name": "molecule_id",
        "nominal_value": [
          "CHEMBL10453",
          "CHEMBL10494",
          "CHEMBL105383",
          "CHEMBL105434",
          "CHEMBL1095777",
          "CHEMBL1201274",
          "CHEMBL1215",
          "CHEMBL1258223",
          "CHEMBL1258452",
          "CHEMBL1258671",
          "CHEMBL126347",
          "CHEMBL129190",
          "CHEMBL13",
          "CHEMBL1369414",
          "CHEMBL140908",
          "CHEMBL141184",
          "CHEMBL142474",
          "CHEMBL142496",
          "CHEMBL142635",
          "CHEMBL142912",
          "CHEMBL142948",
          "CHEMBL142995",
          "CHEMBL143397",
          "CHEMBL143463",
          "CHEMBL143608",
          "CHEMBL143679",
          "CHEMBL1437",
          "CHEMBL143733",
          "CHEMBL143865",
          "CHEMBL143944",
          "CHEMBL1682210",
          "CHEMBL1682211",
          "CHEMBL1682212",
          "CHEMBL1682213",
          "CHEMBL1682215",
          "CHEMBL1682216",
          "CHEMBL1682217",
          "CHEMBL1682218",
          "CHEMBL1682219",
          "CHEMBL1682220",
          "CHEMBL1682221",
          "CHEMBL1691",
          "CHEMBL1800934",
          "CHEMBL1800961",
          "CHEMBL1800962",
          "CHEMBL1824263",
          "CHEMBL207802",
          "CHEMBL208185",
          "CHEMBL210309",
          "CHEMBL228417",
          "CHEMBL228992",
          "CHEMBL228996",
          "CHEMBL228998",
          "CHEMBL229388",
          "CHEMBL229390",
          "CHEMBL229391",
          "CHEMBL229400",
          "CHEMBL229401",
          "CHEMBL229442",
          "CHEMBL229443",
          "CHEMBL229476",
          "CHEMBL229477",
          "CHEMBL229614",
          "CHEMBL229615",
          "CHEMBL229616",
          "CHEMBL229620",
          "CHEMBL266290",
          "CHEMBL266619",
          "CHEMBL267220",
          "CHEMBL267375",
          "CHEMBL268258",
          "CHEMBL268881",
          "CHEMBL27",
          "CHEMBL280822",
          "CHEMBL281232",
          "CHEMBL284782",
          "CHEMBL287587",
          "CHEMBL290153",
          "CHEMBL291115",
          "CHEMBL295072",
          "CHEMBL300552",
          "CHEMBL302451",
          "CHEMBL30816",
          "CHEMBL314459",
          "CHEMBL315468",
          "CHEMBL322842",
          "CHEMBL32590",
          "CHEMBL338564",
          "CHEMBL340189",
          "CHEMBL341614",
          "CHEMBL342061",
          "CHEMBL378501",
          "CHEMBL38033",
          "CHEMBL38114",
          "CHEMBL38486",
          "CHEMBL387825",
          "CHEMBL388177",
          "CHEMBL388570",
          "CHEMBL389390",
          "CHEMBL389519",
          "CHEMBL389629",
          "CHEMBL389734",
          "CHEMBL389902",
          "CHEMBL39682",
          "CHEMBL39706",
          "CHEMBL39873",
          "CHEMBL39987",
          "CHEMBL40217",
          "CHEMBL40268",
          "CHEMBL40317",
          "CHEMBL40796",
          "CHEMBL41818",
          "CHEMBL419680",
          "CHEMBL42",
          "CHEMBL42084",
          "CHEMBL42117",
          "CHEMBL42280",
          "CHEMBL42359",
          "CHEMBL42370",
          "CHEMBL425658",
          "CHEMBL434",
          "CHEMBL435802",
          "CHEMBL43711",
          "CHEMBL43850",
          "CHEMBL45063",
          "CHEMBL477465",
          "CHEMBL477466",
          "CHEMBL477672",
          "CHEMBL479",
          "CHEMBL479644",
          "CHEMBL481414",
          "CHEMBL481415",
          "CHEMBL481799",
          "CHEMBL482396",
          "CHEMBL482397",
          "CHEMBL499",
          "CHEMBL517532",
          "CHEMBL520600",
          "CHEMBL54",
          "CHEMBL542536",
          "CHEMBL542776",
          "CHEMBL542777",
          "CHEMBL543011",
          "CHEMBL543484",
          "CHEMBL543717",
          "CHEMBL543955",
          "CHEMBL543957",
          "CHEMBL544190",
          "CHEMBL544661",
          "CHEMBL552898",
          "CHEMBL59",
          "CHEMBL62032",
          "CHEMBL6712",
          "CHEMBL6749",
          "CHEMBL679",
          "CHEMBL6898",
          "CHEMBL6902",
          "CHEMBL6913",
          "CHEMBL6939",
          "CHEMBL7043",
          "CHEMBL7160",
          "CHEMBL7185",
          "CHEMBL7209",
          "CHEMBL723",
          "CHEMBL7250",
          "CHEMBL7278",
          "CHEMBL7681",
          "CHEMBL82899",
          "CHEMBL83080",
          "CHEMBL85",
          "CHEMBL86931",
          "CHEMBL99361"
        ],
        "number_of_missing_values": "0"
      },
      {
        "data_type": "numeric",
        "index": "1",
        "is_ignore": "false",
        "is_row_identifier": "false",
        "is_target": "false",
        "name": "AMW",
        "number_of_missing_values": "0"
      },
      {
        "data_type": "numeric",
        "index": "2",
        "is_ignore": "false",
        "is_row_identifier": "false",
        "is_target": "false",
        "name": "C.",
        "number_of_missing_values": "0"
      },
      {
        "data_type": "numeric",
        "index": "3",
        "is_ignore": "false",
        "is_row_identifier": "false",
        "is_target": "false",
        "name": "H.",
        "number_of_missing_values": "0"
      },
      {
        "data_type": "numeric",
        "index": "4",
        "is_ignore": "false",
        "is_row_identifier": "false",
        "is_target": "false",
        "name": "Me",
        "number_of_missing_values": "0"
      },
      {
        "data_type": "numeric",
        "index": "5",
        "is_ignore": "false",
        "is_row_identifier": "false",
        "is_target": "false",
        "name": "Mi",
        "number_of_missing_values": "0"
      },
      {
        "data_type": "numeric",
        "index": "6",
        "is_ignore": "false",
        "is_row_identifier": "false",
        "is_target": "false",
        "name": "Mp",
        "number_of_missing_values": "0"
      },
      {
        "data_type": "numeric",
        "index": "7",
        "is_ignore": "false",
        "is_row_identifier": "false",
        "is_target": "false",
        "name": "Mv",
        "number_of_missing_values": "0"
      },
      {
        "data_type": "numeric",
        "index": "8",
        "is_ignore": "false",
        "is_row_identifier": "false",
        "is_target": "false",
        "name": "MW",
        "number_of_missing_values": "0"
      },
      {
        "data_type": "numeric",
        "index": "9",
        "is_ignore": "false",
        "is_row_identifier": "false",
        "is_target": "false",
        "name": "N.",
        "number_of_missing_values": "0"
      },
      {
        "data_type": "numeric",
        "index": "10",
        "is_ignore": "false",
        "is_row_identifier": "false",
        "is_target": "false",
        "name": "nAB",
        "number_of_missing_values": "0"
      },
      {
        "data_type": "numeric",
        "index": "11",
        "is_ignore": "false",
        "is_row_identifier": "false",
        "is_target": "false",
        "name": "nAT",
        "number_of_missing_values": "0"
      },
      {
        "data_type": "numeric",
        "index": "12",
        "is_ignore": "false",
        "is_row_identifier": "false",
        "is_target": "false",
        "name": "nB",
        "number_of_missing_values": "0"
      },
      {
        "data_type": "numeric",
        "index": "13",
        "is_ignore": "false",
        "is_row_identifier": "false",
        "is_target": "false",
        "name": "nBM",
        "number_of_missing_values": "0"
      },
      {
        "data_type": "numeric",
        "index": "14",
        "is_ignore": "false",
        "is_row_identifier": "false",
        "is_target": "false",
        "name": "nBO",
        "number_of_missing_values": "0"
      },
      {
        "data_type": "numeric",
        "index": "15",
        "is_ignore": "false",
        "is_row_identifier": "false",
        "is_target": "false",
        "name": "nBR",
        "number_of_missing_values": "0"
      },
      {
        "data_type": "numeric",
        "index": "16",
        "is_ignore": "false",
        "is_row_identifier": "false",
        "is_target": "false",
        "name": "nBT",
        "number_of_missing_values": "0"
      },
      {
        "data_type": "numeric",
        "index": "17",
        "is_ignore": "false",
        "is_row_identifier": "false",
        "is_target": "false",
        "name": "nC",
        "number_of_missing_values": "0"
      },
      {
        "data_type": "numeric",
        "index": "18",
        "is_ignore": "false",
        "is_row_identifier": "false",
        "is_target": "false",
        "name": "nCL",
        "number_of_missing_values": "0"
      },
      {
        "data_type": "numeric",
        "index": "19",
        "is_ignore": "false",
        "is_row_identifier": "false",
        "is_target": "false",
        "name": "nCsp",
        "number_of_missing_values": "0"
      },
      {
        "data_type": "numeric",
        "index": "20",
        "is_ignore": "false",
        "is_row_identifier": "false",
        "is_target": "false",
        "name": "nCsp2",
        "number_of_missing_values": "0"
      },
      {
        "data_type": "numeric",
        "index": "21",
        "is_ignore": "false",
        "is_row_identifier": "false",
        "is_target": "false",
        "name": "nCsp3",
        "number_of_missing_values": "0"
      },
      {
        "data_type": "numeric",
        "index": "22",
        "is_ignore": "false",
        "is_row_identifier": "false",
        "is_target": "false",
        "name": "nDB",
        "number_of_missing_values": "0"
      },
      {
        "data_type": "numeric",
        "index": "23",
        "is_ignore": "false",
        "is_row_identifier": "false",
        "is_target": "false",
        "name": "nF",
        "number_of_missing_values": "0"
      },
      {
        "data_type": "numeric",
        "index": "24",
        "is_ignore": "false",
        "is_row_identifier": "false",
        "is_target": "false",
        "name": "nH",
        "number_of_missing_values": "0"
      },
      {
        "data_type": "numeric",
        "index": "25",
        "is_ignore": "false",
        "is_row_identifier": "false",
        "is_target": "false",
        "name": "nHet",
        "number_of_missing_values": "0"
      },
      {
        "data_type": "numeric",
        "index": "26",
        "is_ignore": "false",
        "is_row_identifier": "false",
        "is_target": "false",
        "name": "nHM",
        "number_of_missing_values": "0"
      },
      {
        "data_type": "numeric",
        "index": "27",
        "is_ignore": "false",
        "is_row_identifier": "false",
        "is_target": "false",
        "name": "nI",
        "number_of_missing_values": "0"
      },
      {
        "data_type": "numeric",
        "index": "28",
        "is_ignore": "false",
        "is_row_identifier": "false",
        "is_target": "false",
        "name": "nN",
        "number_of_missing_values": "0"
      },
      {
        "data_type": "numeric",
        "index": "29",
        "is_ignore": "false",
        "is_row_identifier": "false",
        "is_target": "false",
        "name": "nO",
        "number_of_missing_values": "0"
      },
      {
        "data_type": "numeric",
        "index": "30",
        "is_ignore": "false",
        "is_row_identifier": "false",
        "is_target": "false",
        "name": "nP",
        "number_of_missing_values": "0"
      },
      {
        "data_type": "numeric",
        "index": "31",
        "is_ignore": "false",
        "is_row_identifier": "false",
        "is_target": "false",
        "name": "nS",
        "number_of_missing_values": "0"
      },
      {
        "data_type": "numeric",
        "index": "32",
        "is_ignore": "false",
        "is_row_identifier": "false",
        "is_target": "false",
        "name": "nSK",
        "number_of_missing_values": "0"
      },
      {
        "data_type": "numeric",
        "index": "33",
        "is_ignore": "false",
        "is_row_identifier": "false",
        "is_target": "false",
        "name": "nTB",
        "number_of_missing_values": "0"
      },
      {
        "data_type": "numeric",
        "index": "34",
        "is_ignore": "false",
        "is_row_identifier": "false",
        "is_target": "false",
        "name": "nX",
        "number_of_missing_values": "0"
      },
      {
        "data_type": "numeric",
        "index": "35",
        "is_ignore": "false",
        "is_row_identifier": "false",
        "is_target": "false",
        "name": "O.",
        "number_of_missing_values": "0"
      },
      {
        "data_type": "numeric",
        "index": "36",
        "is_ignore": "false",
        "is_row_identifier": "false",
        "is_target": "false",
        "name": "RBF",
        "number_of_missing_values": "0"
      },
      {
        "data_type": "numeric",
        "index": "37",
        "is_ignore": "false",
        "is_row_identifier": "false",
        "is_target": "false",
        "name": "RBN",
        "number_of_missing_values": "0"
      },
      {
        "data_type": "numeric",
        "index": "38",
        "is_ignore": "false",
        "is_row_identifier": "false",
        "is_target": "false",
        "name": "SCBO",
        "number_of_missing_values": "0"
      },
      {
        "data_type": "numeric",
        "index": "39",
        "is_ignore": "false",
        "is_row_identifier": "false",
        "is_target": "false",
        "name": "Se",
        "number_of_missing_values": "0"
      },
      {
        "data_type": "numeric",
        "index": "40",
        "is_ignore": "false",
        "is_row_identifier": "false",
        "is_target": "false",
        "name": "Si",
        "number_of_missing_values": "0"
      },
      {
        "data_type": "numeric",
        "index": "41",
        "is_ignore": "false",
        "is_row_identifier": "false",
        "is_target": "false",
        "name": "Sp",
        "number_of_missing_values": "0"
      },
      {
        "data_type": "numeric",
        "index": "42",
        "is_ignore": "false",
        "is_row_identifier": "false",
        "is_target": "false",
        "name": "Sv",
        "number_of_missing_values": "0"
      },
      {
        "data_type": "numeric",
        "index": "43",
        "is_ignore": "false",
        "is_row_identifier": "false",
        "is_target": "false",
        "name": "X.",
        "number_of_missing_values": "0"
      },
      {
        "data_type": "numeric",
        "index": "44",
        "is_ignore": "false",
        "is_row_identifier": "false",
        "is_target": "true",
        "name": "pXC50",
        "number_of_missing_values": "0"
      }
    ]
  }
}