{
  "data_set_description": {
    "collection_date": "November 2013",
    "creator": "Dr Jeremy Besnard, Dr Ivan Olier, Dr Noureddin Sadawi, Dr Larisa Soldatova, Dr Crina Grosan, Prof Ross King, Dr Richard Bickerton, Prof Andrew Hopkins and Dr Willem van Hoorn",
    "default_target_attribute": "pXC50",
    "description": "This dataset contains QSAR data (from ChEMBL version 17) showing activity values (unit is pseudo-pCI50) of several compounds on drug target ChEMBL_ID: CHEMBL5412 (TID: 100860), and it has 61 rows and 43 features (not including molecule IDs and class feature: molecule_id and pXC50). The features represent Basic Molecular Descriptors which were generated from SMILES strings.  Missing value imputation was applied to this dataset (By choosing the Median).",
    "description_version": "1",
    "file_id": "3486491",
    "format": "ARFF",
    "id": "32653",
    "licence": "Public",
    "md5_checksum": "045aa3be78bc5d33551756593c2cfea5",
    "minio_url": "https://data.openml.org/datasets/0003/32653/dataset_32653.pq",
    "name": "QSAR-DATASET-FOR-DRUG-TARGET-CHEMBL5412",
    "original_data_url": "https://www.ebi.ac.uk/chembl/target/inspect/CHEMBL5412",
    "parquet_url": "https://data.openml.org/datasets/0003/32653/dataset_32653.pq",
    "processing_date": "2018-10-04 02:59:45",
    "row_id_attribute": "molecule_id",
    "status": "deactivated",
    "tag": [
      "MetaQSAR",
      "study_13"
    ],
    "upload_date": "2016-07-15T10:46:27",
    "url": "https://api.openml.org/data/v1/download/3486491/QSAR-DATASET-FOR-DRUG-TARGET-CHEMBL5412.arff",
    "version": "10",
    "visibility": "public"
  }
}