"molecule_id","FCFP4_1024b1","FCFP4_1024b10","FCFP4_1024b100","FCFP4_1024b1000","FCFP4_1024b1001","FCFP4_1024b1002","FCFP4_1024b1003","FCFP4_1024b1004","FCFP4_1024b1005","FCFP4_1024b1006","FCFP4_1024b1007","FCFP4_1024b1008","FCFP4_1024b1009","FCFP4_1024b101","FCFP4_1024b1010","FCFP4_1024b1011","FCFP4_1024b1012","FCFP4_1024b1013","FCFP4_1024b1014","FCFP4_1024b1015","FCFP4_1024b1016","FCFP4_1024b1017","FCFP4_1024b1018","FCFP4_1024b1019","FCFP4_1024b102","FCFP4_1024b1020","FCFP4_1024b1021","FCFP4_1024b1022","FCFP4_1024b1023","FCFP4_1024b1024","FCFP4_1024b103","FCFP4_1024b104","FCFP4_1024b105","FCFP4_1024b106","FCFP4_1024b107","FCFP4_1024b108","FCFP4_1024b109","FCFP4_1024b11","FCFP4_1024b110","FCFP4_1024b111","FCFP4_1024b112","FCFP4_1024b113","FCFP4_1024b114","FCFP4_1024b115","FCFP4_1024b116","FCFP4_1024b117","FCFP4_1024b118","FCFP4_1024b119","FCFP4_1024b12","FCFP4_1024b120","FCFP4_1024b121","pXC50"
{1 1,2 1,35 1,38 1,52 6.959}
{0 CHEMBL459440,1 1,35 1,38 1,52 6.62}
{0 CHEMBL459441,1 1,35 1,38 1,52 6.018}
{0 CHEMBL459855,1 1,35 1,38 1,52 6.721}
{0 CHEMBL459856,1 1,35 1,38 1,52 7.337}
{0 CHEMBL459857,1 1,6 1,26 1,35 1,52 4.959}
{0 CHEMBL460677,1 1,10 1,26 1,35 1,52 6.114}
{0 CHEMBL460678,1 1,26 1,35 1,52 4.9}
{0 CHEMBL460882,1 1,20 1,26 1,35 1,52 7.62}
{0 CHEMBL469462,1 1,35 1,38 1,52 7.347}
{0 CHEMBL469463,1 1,35 1,38 1,52 7.509}
{0 CHEMBL469464,1 1,35 1,38 1,52 7.161}
{0 CHEMBL469479,1 1,26 1,35 1,52 6.699}
{0 CHEMBL469480,1 1,26 1,35 1,52 7.495}
{0 CHEMBL469872,1 1,35 1,52 5}
{0 CHEMBL470083,1 1,35 1,38 1,52 7.398}
{0 CHEMBL470084,1 1,26 1,35 1,52 7.585}
{0 CHEMBL470085,1 1,26 1,52 6.42}
{0 CHEMBL470086,1 1,26 1,52 6.745}
{0 CHEMBL471380,1 1,6 1,26 1,52 7.155}
{0 CHEMBL471564,1 1,26 1,52 7.62}
{0 CHEMBL472307,1 1,26 1,28 1,35 1,52 4.955}
{0 CHEMBL472308,1 1,26 1,35 1,52 5.424}
{0 CHEMBL479924,1 1,26 1,49 1,52 7.538}
{0 CHEMBL506107,1 1,3 1,35 1,38 1,52 5.211}
{0 CHEMBL511327,1 1,35 1,52 5}
{0 CHEMBL511960,1 1,35 1,52 6.013}
{0 CHEMBL512353,1 1,16 1,26 1,27 1,52 7.268}
{0 CHEMBL513205,1 1,35 1,38 1,52 7.357}
{0 CHEMBL518324,1 1,35 1,38 1,52 7.886}
{0 CHEMBL518792,1 1,26 1,34 1,35 1,52 6.051}
{0 CHEMBL565307,1 1,26 1,35 1,52 7.721}
{0 CHEMBL565330,1 1,20 1,24 1,26 1,35 1,52 7}
{0 CHEMBL567037,1 1,26 1,35 1,52 6.921}
{0 CHEMBL567038,1 1,26 1,52 7.301}
{0 CHEMBL567046,1 1,20 1,26 1,35 1,52 8.155}
{0 CHEMBL567254,1 1,26 1,35 1,52 7.357}
{0 CHEMBL567452,1 1,26 1,35 1,52 7.26}
{0 CHEMBL567453,1 1,20 1,26 1,35 1,49 1,52 6.921}
{0 CHEMBL568848,1 1,26 1,52 6.495}
{0 CHEMBL569291,1 1,20 1,26 1,35 1,52 7.854}
{0 CHEMBL569480,1 1,20 1,26 1,35 1,52 6.824}
{0 CHEMBL569490,1 1,20 1,26 1,35 1,49 1,52 6.796}
{0 CHEMBL569515,1 1,26 1,35 1,52 6.602}
{0 CHEMBL569516,1 1,20 1,35 1,52 4.807}
{0 CHEMBL569517,1 1,26 1,35 1,52 7.62}
{0 CHEMBL572143,1 1,20 1,26 1,35 1,52 7.222}
{0 CHEMBL572349,1 1,26 1,35 1,52 6.824}
{0 CHEMBL576031,1 1,20 1,26 1,35 1,52 6.301}
{0 CHEMBL577080,1 1,6 1,20 1,26 1,35 1,52 7.42}
{0 CHEMBL584068,1 1,26 1,35 1,52 6.481}
{0 CHEMBL584286,1 1,35 1,52 6.721}
{0 CHEMBL584707,1 1,35 1,36 1,52 6.215}
{0 CHEMBL585141,1 1,26 1,35 1,52 6.921}
