{
  "data_features": {
    "feature": [
      {
        "data_type": "nominal",
        "index": "0",
        "is_ignore": "false",
        "is_row_identifier": "true",
        "is_target": "false",
        "name": "molecule_id",
        "nominal_value": [
          "CHEMBL199517",
          "CHEMBL200962",
          "CHEMBL201369",
          "CHEMBL201439",
          "CHEMBL202633",
          "CHEMBL202753",
          "CHEMBL202813",
          "CHEMBL202864",
          "CHEMBL203002",
          "CHEMBL203491",
          "CHEMBL203557",
          "CHEMBL203851",
          "CHEMBL203935",
          "CHEMBL203979",
          "CHEMBL204042",
          "CHEMBL204230",
          "CHEMBL204271",
          "CHEMBL204320",
          "CHEMBL204346",
          "CHEMBL204544",
          "CHEMBL204749",
          "CHEMBL204762",
          "CHEMBL204899",
          "CHEMBL204904",
          "CHEMBL204911",
          "CHEMBL205011",
          "CHEMBL205110",
          "CHEMBL205729",
          "CHEMBL206156",
          "CHEMBL206553",
          "CHEMBL206622",
          "CHEMBL31",
          "CHEMBL32",
          "CHEMBL378604",
          "CHEMBL378608",
          "CHEMBL379022",
          "CHEMBL380505",
          "CHEMBL380520",
          "CHEMBL380533",
          "CHEMBL380649",
          "CHEMBL380696",
          "CHEMBL381257",
          "CHEMBL381395",
          "CHEMBL381833",
          "CHEMBL382028",
          "CHEMBL382172",
          "CHEMBL382247",
          "CHEMBL382560",
          "CHEMBL382817",
          "CHEMBL383001",
          "CHEMBL383328",
          "CHEMBL383497",
          "CHEMBL425233",
          "CHEMBL425234",
          "CHEMBL430",
          "CHEMBL437129",
          "CHEMBL438444",
          "CHEMBL442792",
          "CHEMBL8",
          "CHEMBL9"
        ],
        "number_of_missing_values": "0"
      },
      {
        "data_type": "numeric",
        "index": "1",
        "is_ignore": "false",
        "is_row_identifier": "false",
        "is_target": "false",
        "name": "AMW",
        "number_of_missing_values": "0"
      },
      {
        "data_type": "numeric",
        "index": "2",
        "is_ignore": "false",
        "is_row_identifier": "false",
        "is_target": "false",
        "name": "C.",
        "number_of_missing_values": "0"
      },
      {
        "data_type": "numeric",
        "index": "3",
        "is_ignore": "false",
        "is_row_identifier": "false",
        "is_target": "false",
        "name": "H.",
        "number_of_missing_values": "0"
      },
      {
        "data_type": "numeric",
        "index": "4",
        "is_ignore": "false",
        "is_row_identifier": "false",
        "is_target": "false",
        "name": "Me",
        "number_of_missing_values": "0"
      },
      {
        "data_type": "numeric",
        "index": "5",
        "is_ignore": "false",
        "is_row_identifier": "false",
        "is_target": "false",
        "name": "Mi",
        "number_of_missing_values": "0"
      },
      {
        "data_type": "numeric",
        "index": "6",
        "is_ignore": "false",
        "is_row_identifier": "false",
        "is_target": "false",
        "name": "Mp",
        "number_of_missing_values": "0"
      },
      {
        "data_type": "numeric",
        "index": "7",
        "is_ignore": "false",
        "is_row_identifier": "false",
        "is_target": "true",
        "name": "pXC50",
        "number_of_missing_values": "0"
      }
    ]
  }
}