"molecule_id","nS","nCsp2","nO","nH","nDB","nBM","Sp","nCsp3","nHM","SCBO","Sv","nC","nSK","MW","nAT","pXC50"
{2 17,4 30,6 21,7 40.921,8 10,10 46.5,11 37.934,12 27,13 31,14 410.61,15 61,16 5}
{0 CHEMBL103769,1 1,2 15,4 25,5 1,6 18,7 41.125,8 7,9 4,10 43.5,11 37.79,12 22,13 32,14 556.4,15 57,16 6.207}
{0 CHEMBL1076622,2 14,3 2,4 40,5 1,6 17,7 51.273,8 18,10 54,11 48.291,12 32,13 40,14 550.76,15 80,16 5.26}
{0 CHEMBL1076623,1 1,2 13,3 1,4 37,5 1,6 17,7 49.949,8 17,9 1,10 53,11 46.731,12 30,13 39,14 553.79,15 76,16 5.45}
{0 CHEMBL1076624,2 12,3 2,4 40,5 1,6 13,7 49.273,8 18,10 49,11 46.291,12 30,13 38,14 526.74,15 78,16 5.34}
{0 CHEMBL1076625,2 12,3 2,4 40,5 1,6 13,7 49.273,8 18,10 49,11 46.291,12 30,13 38,14 526.74,15 78,16 4.42}
{0 CHEMBL1077721,2 12,3 3,4 26,6 16,7 34.762,8 9,10 39,11 33.025,12 21,13 28,14 382.51,15 54,16 5}
{0 CHEMBL1077722,2 12,3 3,4 26,6 16,7 34.762,8 9,10 39,11 33.025,12 21,13 28,14 382.51,15 54,16 5}
{0 CHEMBL1077723,2 12,3 3,4 26,6 16,7 34.762,8 9,10 39,11 33.025,12 21,13 28,14 382.51,15 54,16 5}
{0 CHEMBL1077724,2 13,3 2,4 28,6 16,7 36.069,8 9,10 39,11 33.837,12 22,13 28,14 380.54,15 56,16 5}
{0 CHEMBL1077742,2 13,3 3,4 25,6 16,7 33.756,8 8,10 38,11 32.003,12 21,13 27,14 367.49,15 52,16 5}
{0 CHEMBL1077877,2 13,3 3,4 26,6 16,7 35.455,8 9,10 40,11 33.914,12 22,13 29,14 399.51,15 55,16 5}
{0 CHEMBL1077887,2 13,3 2,4 24,6 16,7 34.875,8 9,10 41,11 33.965,12 22,13 30,14 419.49,15 54,16 5}
{0 CHEMBL1077908,1 1,2 19,3 5,4 32,5 2,6 24,7 46.603,8 9,9 1,10 55,11 44.222,12 28,13 38,14 536.71,15 70,16 5}
{0 CHEMBL1078081,2 13,3 3,4 29,6 16,7 38.279,8 11,10 42,11 36.057,12 24,13 30,14 407.56,15 59,16 5}
{0 CHEMBL1078173,2 13,3 3,4 31,6 16,7 39.04,8 11,10 41,11 36.584,12 24,13 30,14 409.58,15 61,16 5}
{0 CHEMBL1078215,2 13,3 4,4 26,6 16,7 37.546,8 10,10 44,11 36.922,12 23,13 33,14 465.52,15 59,16 5}
{0 CHEMBL1078240,1 1,2 13,3 5,4 27,5 2,6 18,7 39.938,8 9,9 2,10 46,11 37.996,12 22,13 33,14 495.05,15 60,16 5}
{0 CHEMBL1078283,2 14,3 4,4 30,5 1,6 17,7 39.739,8 10,10 44,11 37.793,12 24,13 32,14 438.58,15 62,16 5}
{0 CHEMBL1078438,2 12,3 3,4 26,6 16,7 34.762,8 9,10 39,11 33.025,12 21,13 28,14 382.51,15 54,16 5}
{0 CHEMBL1078449,2 13,3 3,4 30,6 16,7 38.284,8 10,10 41,11 36.078,12 23,13 30,14 410.57,15 60,16 5}
{0 CHEMBL1078450,2 14,3 5,4 33,5 1,6 17,7 42.711,8 12,10 46,11 40.54,12 26,13 34,14 467.62,15 67,16 5}
{0 CHEMBL1078451,2 13,3 3,4 28,6 16,7 37.216,8 10,10 41,11 35.44,12 23,13 30,14 413.54,15 58,16 5}
{0 CHEMBL1078528,1 1,2 13,3 5,4 32,5 2,6 18,7 42.603,8 11,9 1,10 47,11 40.222,12 24,13 34,14 488.67,15 66,16 5}
{0 CHEMBL1078745,2 13,3 4,4 33,6 16,7 42.256,8 13,10 45,11 39.825,12 26,13 33,14 451.62,15 66,16 5}
{0 CHEMBL1078799,2 13,3 4,4 28,6 16,7 37.671,8 10,10 42,11 36.155,12 23,13 31,14 429.54,15 59,16 5}
{0 CHEMBL1078841,2 13,3 2,4 28,6 16,7 36.069,8 9,10 39,11 33.837,12 22,13 28,14 380.54,15 56,16 5}
{0 CHEMBL1078895,2 13,3 3,4 33,6 16,7 40.802,8 12,10 42,11 38.111,12 25,13 31,14 423.61,15 64,16 5}
{0 CHEMBL1078896,2 14,3 4,4 34,5 1,6 17,7 44.262,8 13,10 48,11 41.847,12 27,13 35,14 478.65,15 69,16 5}
{0 CHEMBL1078903,1 1,2 13,3 2,4 25,6 16,7 34.949,8 8,9 1,10 38,11 32.476,12 21,13 27,14 383.56,15 52,16 5}
{0 CHEMBL1078904,1 1,2 13,3 2,4 25,6 16,7 34.949,8 8,9 1,10 38,11 32.476,12 21,13 27,14 383.56,15 52,16 5}
{0 CHEMBL1078956,2 13,3 3,4 28,6 16,7 37.216,8 10,10 41,11 35.44,12 23,13 30,14 413.54,15 58,16 5}
{0 CHEMBL1079006,1 1,2 14,3 3,4 27,5 1,6 17,7 38.165,8 9,9 1,10 42,11 35.717,12 23,13 30,14 425.6,15 57,16 5}
{0 CHEMBL1079007,1 1,2 13,3 2,4 27,6 16,7 36.711,8 9,9 1,10 39,11 34.003,12 22,13 28,14 397.59,15 55,16 5}
{0 CHEMBL1079171,1 1,2 13,3 2,4 27,6 16,7 36.711,8 9,9 1,10 39,11 34.003,12 22,13 28,14 397.59,15 55,16 5}
{0 CHEMBL1079180,1 1,2 13,3 4,4 24,5 2,6 18,7 37.659,8 8,9 2,10 45,11 36.137,12 21,13 32,14 483.01,15 56,16 5}
{0 CHEMBL1079312,2 13,3 3,4 26,6 16,7 36.375,8 9,9 1,10 40,11 34.358,12 22,13 29,14 415.96,15 55,16 5}
{0 CHEMBL1079313,1 1,2 13,3 5,4 31,5 2,6 18,7 41.597,8 11,9 1,10 46,11 39.2,12 24,13 33,14 473.65,15 64,16 5}
{0 CHEMBL1079314,2 13,3 5,4 26,5 2,6 18,7 36.671,8 9,10 44,11 35.454,12 22,13 31,14 426.52,15 57,16 5}
{0 CHEMBL1079686,1 1,2 17,3 5,4 37,5 2,6 23,7 50.131,8 12,9 1,10 56.5,11 47.297,12 29,13 40,14 567.78,15 77,16 5}
{0 CHEMBL1079874,2 14,3 5,4 28,5 1,6 17,7 39.125,8 10,10 45,11 37.87,12 24,13 33,14 457.55,15 61,16 5}
{0 CHEMBL1080584,2 14,3 4,4 29,5 1,6 17,7 39.676,8 10,10 45,11 38.176,12 24,13 33,14 456.57,15 62,16 5}
{0 CHEMBL1080585,2 14,3 5,4 28,5 1,6 17,7 40.046,8 10,9 1,10 45,11 38.314,12 24,13 33,14 474,15 61,16 5}
{0 CHEMBL1080586,2 14,3 4,4 24,5 1,6 17,7 36.068,8 8,9 1,10 42,11 34.546,12 22,13 30,14 429.94,15 54,16 5}
{0 CHEMBL1080950,1 1,2 13,3 5,4 28,5 2,6 18,7 41.637,8 10,9 2,10 48,11 39.906,12 23,13 35,14 527.07,15 63,16 5}
{0 CHEMBL1080951,2 13,3 2,4 23,6 16,7 35.017,8 8,9 2,10 39,11 32.944,12 21,13 28,14 420.37,15 51,16 5}
{0 CHEMBL1081133,1 1,2 16,3 5,4 32,5 2,6 23,7 45.853,8 10,9 1,10 54.5,11 43.738,12 26,13 38,14 540.71,15 70,16 5}
{0 CHEMBL1081317,1 1,2 12,3 2,4 26,6 16,7 35.955,8 9,9 1,10 39,11 33.497,12 21,13 28,14 398.58,15 54,16 5}
{0 CHEMBL1082036,1 1,2 13,3 6,4 37,5 2,6 18,7 48.336,8 15,9 1,10 52,11 45.496,12 28,13 38,14 543.75,15 75,16 5}
{0 CHEMBL1082037,1 1,2 13,3 2,4 29,6 16,7 38.472,8 10,9 1,10 40,11 35.529,12 23,13 29,14 411.62,15 58,16 5}
{0 CHEMBL1082038,1 1,2 14,3 3,4 24,5 1,6 17,7 35.648,8 7,9 1,10 41,11 33.685,12 21,13 29,14 412.56,15 53,16 5}
{0 CHEMBL1082039,1 1,2 19,3 2,4 23,6 22,7 36.188,8 4,9 1,10 43,11 33.949,12 23,13 29,14 405.56,15 52,16 5}
{0 CHEMBL1082040,1 1,2 13,3 2,4 26,6 16,7 37.568,8 9,9 2,10 40,11 34.83,12 22,13 29,14 432.03,15 55,16 5}
{0 CHEMBL1161327,1 2,2 35,3 12,4 68,5 9,6 37,7 97.137,8 20,9 2,10 109,11 92.959,12 55,13 81,14 1153.49,15 149,16 6}
{0 CHEMBL1161328,1 2,2 35,3 11,4 68,5 9,6 37,7 96.683,8 20,9 2,10 108,11 92.244,12 55,13 80,14 1137.49,15 148,16 6.214}
{0 CHEMBL1161330,1 2,2 35,3 12,4 63,5 9,6 37,7 92.609,8 18,9 2,10 106,11 88.884,12 53,13 78,14 1110.41,15 141,16 6}
{0 CHEMBL1161331,1 2,2 35,3 13,4 72,5 9,6 37,7 101.114,8 22,9 2,10 112,11 96.727,12 57,13 84,14 1197.55,15 156,16 6}
{0 CHEMBL1161332,1 2,2 34,3 10,4 58,5 8,6 36,7 86.171,8 16,9 2,10 99,11 82.379,12 50,13 72,14 1023.32,15 130,16 6}
{0 CHEMBL1161333,1 2,2 35,3 12,4 65,5 9,6 37,7 94.37,8 19,9 2,10 107,11 90.411,12 54,13 79,14 1124.44,15 144,16 5}
{0 CHEMBL1161334,1 2,2 28,3 11,4 63,5 8,6 30,7 87.154,8 20,9 2,10 95,11 83.169,12 48,13 72,14 1034.36,15 135,16 6}
{0 CHEMBL1161755,1 2,2 27,3 11,4 66,5 7,6 29,7 88.671,8 22,9 2,10 94,11 84.201,12 49,13 72,14 1035.39,15 138,16 8.509}
{0 CHEMBL1161756,1 2,2 27,3 11,4 65,5 7,6 29,7 91.33,8 22,9 3,10 95,11 85.518,12 49,13 73,14 1161.28,15 138,16 8.796}
{0 CHEMBL1161757,1 2,2 27,3 16,4 75,5 7,6 29,7 103.41,8 28,9 3,10 107,11 97.726,12 55,13 84,14 1323.44,15 159,16 8.658}
{0 CHEMBL1161758,1 2,2 27,3 21,4 85,5 7,6 29,7 115.489,8 34,9 3,10 119,11 109.934,12 61,13 95,14 1485.6,15 180,16 8.921}
{0 CHEMBL1161759,1 3,2 29,3 18,4 77,5 9,6 31,7 109.728,8 29,9 4,10 115,11 103.87,12 58,13 90,14 1425.56,15 167,16 8.699}
{0 CHEMBL1161760,1 2,2 27,3 26,4 95,5 7,6 29,7 127.569,8 40,9 3,10 131,11 122.142,12 67,13 106,14 1647.76,15 201,16 8.996}
{0 CHEMBL1161761,1 2,2 28,3 12,4 63,5 8,6 30,7 91.023,8 21,9 3,10 97,11 85.706,12 49,13 74,14 1175.26,15 137,16 8.77}
{0 CHEMBL1161762,1 2,2 28,3 17,4 73,5 8,6 30,7 103.103,8 27,9 3,10 109,11 97.914,12 55,13 85,14 1337.42,15 158,16 8.6}
{0 CHEMBL1161763,1 2,2 28,3 22,4 83,5 8,6 30,7 115.182,8 33,9 3,10 121,11 110.122,12 61,13 96,14 1499.58,15 179,16 8.672}
{0 CHEMBL1161764,1 2,2 27,3 26,4 95,5 7,6 29,7 127.569,8 40,9 3,10 131,11 122.142,12 67,13 106,14 1647.76,15 201,16 8.959}
{0 CHEMBL1161765,1 2,2 28,3 12,4 63,5 8,6 30,7 91.023,8 21,9 3,10 97,11 85.706,12 49,13 74,14 1175.26,15 137,16 9.328}
{0 CHEMBL1161766,1 2,2 28,3 17,4 73,5 8,6 30,7 103.103,8 27,9 3,10 109,11 97.914,12 55,13 85,14 1337.42,15 158,16 8.699}
{0 CHEMBL1161767,1 2,2 28,3 22,4 83,5 8,6 30,7 115.182,8 33,9 3,10 121,11 110.122,12 61,13 96,14 1499.58,15 179,16 9.108}
{0 CHEMBL1161768,1 2,2 28,3 27,4 93,5 8,6 30,7 127.262,8 39,9 3,10 133,11 122.33,12 67,13 107,14 1661.74,15 200,16 9.022}
{0 CHEMBL1161769,1 3,2 29,3 18,4 77,5 9,6 31,7 109.728,8 29,9 4,10 115,11 103.87,12 58,13 90,14 1425.56,15 167,16 8.699}
{0 CHEMBL1161770,1 2,2 27,3 11,4 65,5 7,6 29,7 91.33,8 22,9 3,10 95,11 85.518,12 49,13 73,14 1161.28,15 138,16 9}
{0 CHEMBL1161771,1 2,2 27,3 16,4 75,5 7,6 29,7 103.41,8 28,9 3,10 107,11 97.726,12 55,13 84,14 1323.44,15 159,16 8.845}
{0 CHEMBL1161772,1 2,2 27,3 21,4 85,5 7,6 29,7 115.489,8 34,9 3,10 119,11 109.934,12 61,13 95,14 1485.6,15 180,16 8.951}
{0 CHEMBL1161774,1 2,2 28,3 27,4 93,5 8,6 30,7 127.262,8 39,9 3,10 133,11 122.33,12 67,13 107,14 1661.74,15 200,16 8.742}
{0 CHEMBL1161775,1 3,2 28,3 17,4 79,5 8,6 30,7 110.035,8 30,9 4,10 113,11 103.682,12 58,13 89,14 1411.58,15 168,16 8.529}
{0 CHEMBL1161776,1 3,2 28,3 17,4 79,5 8,6 30,7 110.035,8 30,9 4,10 113,11 103.682,12 58,13 89,14 1411.58,15 168,16 8.582}
{0 CHEMBL1201959,2 17,4 28,6 21,7 39.16,8 9,10 45.5,11 36.407,12 26,13 30,14 396.58,15 58,16 5}
{0 CHEMBL1223226,2 29,3 10,4 68,5 8,6 30,7 87.683,8 22,10 94,11 83.639,12 51,13 71,14 981.29,15 139,16 7.357}
{0 CHEMBL1223227,2 42,3 11,4 74,5 9,6 43,7 102.421,8 21,10 116,11 97.934,12 63,13 84,14 1147.47,15 158,16 6}
{0 CHEMBL1223228,2 42,3 11,4 74,5 9,6 43,7 102.421,8 21,10 116,11 97.934,12 63,13 84,14 1147.47,15 158,16 7.337}
{0 CHEMBL1223229,2 33,3 10,4 70,5 8,6 35,7 92.444,8 22,10 101.5,11 88.166,12 55,13 75,14 1031.35,15 145,16 8.018}
{0 CHEMBL1223230,2 35,3 10,4 70,5 8,6 36,7 93.444,8 21,10 103,11 89.166,12 56,13 76,14 1043.36,15 146,16 6.449}
{0 CHEMBL1223231,2 35,3 10,4 70,5 8,6 36,7 93.444,8 21,10 103,11 89.166,12 56,13 76,14 1043.36,15 146,16 7.06}
{0 CHEMBL1223232,2 46,3 11,4 76,5 9,6 48,7 107.183,8 21,10 123.5,11 102.461,12 67,13 88,14 1197.53,15 164,16 6.996}
{0 CHEMBL1237140,2 17,4 34,6 21,7 43.444,8 11,10 46.5,11 39.988,12 28,13 32,14 426.66,15 66,16 5}
{0 CHEMBL1254140,2 17,3 6,4 35,5 1,6 18,7 47.54,8 12,9 1,10 50.5,11 45.115,12 29,13 38,14 543.11,15 73,16 5}
{0 CHEMBL1254235,2 17,3 6,4 35,5 1,6 18,7 47.54,8 12,9 1,10 50.5,11 45.115,12 29,13 38,14 543.11,15 73,16 5}
{0 CHEMBL1254321,2 17,3 6,4 38,5 1,6 18,7 48.444,8 13,10 50.5,11 45.814,12 30,13 38,14 522.7,15 76,16 5.215}
{0 CHEMBL1254395,2 17,3 6,4 38,5 1,6 18,7 48.444,8 13,10 50.5,11 45.814,12 30,13 38,14 522.7,15 76,16 5.479}
{0 CHEMBL1254476,2 21,3 6,4 36,5 1,6 23,7 49.682,8 11,10 56,11 47.287,12 32,13 40,14 544.7,15 76,16 6.187}
{0 CHEMBL1254967,1 1,2 17,3 5,4 33,5 1,6 18,7 46.972,8 11,9 2,10 49.5,11 44.06,12 28,13 37,14 545.15,15 70,16 6.009}
{0 CHEMBL132610,2 19,3 7,4 54,5 5,6 21,7 66.489,8 20,10 68,11 62.775,12 39,13 52,14 718.99,15 106,16 8.066}
{0 CHEMBL132658,1 1,2 11,3 6,4 49,5 5,6 15,7 57.154,8 20,9 1,10 55,11 53.172,12 31,13 43,14 619.92,15 92,16 6.921}
{0 CHEMBL133612,1 1,2 11,3 6,4 49,5 5,6 15,7 57.154,8 20,9 1,10 55,11 53.172,12 31,13 43,14 619.92,15 92,16 7.456}
{0 CHEMBL133909,2 17,3 5,4 46,5 4,6 20,7 57.535,8 17,10 60,11 54.238,12 34,13 45,14 618.86,15 91,16 7.071}
{0 CHEMBL134043,2 19,3 6,4 50,5 5,6 21,7 62.512,8 18,10 65,11 59.007,12 37,13 49,14 674.93,15 99,16 7.328}
{0 CHEMBL134111,1 2,2 15,3 6,4 45,5 5,6 20,7 58.279,8 17,9 2,10 60.5,11 54.306,12 32,13 45,14 659.96,15 90,16 7.854}
{0 CHEMBL134163,2 24,3 6,4 53,5 4,6 26,7 68.029,8 18,10 72,11 64.039,12 42,13 53,14 724,15 106,16 8.553}
{0 CHEMBL134280,2 18,3 5,4 47,5 4,6 20,7 58.29,8 17,10 60,11 54.744,12 35,13 45,14 617.87,15 92,16 9.301}
{0 CHEMBL134353,2 18,3 6,4 50,5 4,6 20,7 61.512,8 18,10 63,11 58.007,12 36,13 48,14 662.92,15 98,16 8.046}
{0 CHEMBL134923,2 17,3 6,4 48,5 3,6 19,7 61.364,8 19,9 1,10 63,11 57.813,12 36,13 48,14 682.34,15 96,16 7.921}
{0 CHEMBL135096,2 23,3 4,4 53,5 3,6 25,7 66.12,8 18,10 68,11 61.609,12 41,13 50,14 679.99,15 103,16 7.509}
{0 CHEMBL135099,2 21,3 4,4 51,5 3,6 24,7 63.359,8 18,10 65.5,11 59.083,12 39,13 48,14 653.95,15 99,16 7.77}
{0 CHEMBL140151,1 1,2 15,4 23,5 1,6 18,7 39.364,8 6,9 4,10 42.5,11 36.264,12 21,13 31,14 542.37,15 54,16 6.509}
{0 CHEMBL142283,1 1,2 12,4 30,5 1,6 13,7 43.404,8 11,9 4,10 41,11 39.349,12 23,13 32,14 559.45,15 62,16 5.796}
{0 CHEMBL142295,1 1,2 17,4 24,5 1,6 19,7 41.12,8 6,9 4,10 44,11 37.769,12 23,13 32,14 553.39,15 56,16 4.131}
{0 CHEMBL142321,1 1,2 12,4 22,5 1,6 13,7 35.358,8 6,9 4,10 35,11 32.242,12 18,13 27,14 491.32,15 49,16 5.638}
{0 CHEMBL142402,1 1,2 15,4 25,5 1,6 18,7 42.125,8 8,9 4,10 45.5,11 38.79,12 23,13 33,14 568.41,15 58,16 6}
{0 CHEMBL142422,1 1,2 15,4 21,5 1,6 18,7 37.603,8 5,9 4,10 41.5,11 34.737,12 20,13 30,14 528.34,15 51,16 6.049}
{0 CHEMBL142492,1 1,2 15,4 28,5 1,6 18,7 41.534,8 8,9 3,10 43.5,11 38.292,12 23,13 32,14 491.54,15 60,16 5.097}
{0 CHEMBL142549,1 1,2 21,4 25,5 1,6 24,7 45.125,8 5,9 4,10 51.5,11 41.79,12 26,13 36,14 604.44,15 61,16 5.77}
{0 CHEMBL142613,1 1,2 12,4 28,5 1,6 13,7 41.642,8 10,9 4,10 40,11 37.823,12 22,13 31,14 545.42,15 59,16 5.77}
{0 CHEMBL142822,1 1,2 15,4 27,5 1,6 18,7 39.41,8 7,9 2,10 41.5,11 36.135,12 22,13 30,14 487.52,15 57,16 4.481}
{0 CHEMBL142823,1 1,2 15,4 25,5 1,6 18,7 41.125,8 7,9 4,10 43.5,11 37.79,12 22,13 32,14 556.4,15 57,16 5.658}
{0 CHEMBL142986,1 1,2 19,4 29,5 1,6 23,7 44.171,8 7,9 2,10 49,11 40.662,12 26,13 34,14 537.58,15 63,16 6.109}
{0 CHEMBL143100,1 1,2 14,4 29,5 1,6 18,7 40.171,8 8,9 2,10 41.5,11 36.662,12 22,13 30,14 489.54,15 59,16 5.337}
{0 CHEMBL143164,1 1,2 12,4 26,5 1,6 13,7 38.881,8 8,9 4,10 37,11 35.296,12 20,13 29,14 519.38,15 55,16 5.699}
{0 CHEMBL143367,1 1,2 15,4 29,5 1,6 18,7 41.171,8 8,9 2,10 42.5,11 37.662,12 23,13 31,14 501.55,15 60,16 4.921}
{0 CHEMBL143409,1 1,2 15,4 25,5 1,6 18,7 41.125,8 7,9 4,10 43.5,11 37.79,12 22,13 32,14 556.4,15 57,16 5.699}
{0 CHEMBL143668,1 1,2 16,4 30,5 1,6 18,7 41.927,8 8,9 2,10 42.5,11 38.168,12 24,13 31,14 500.56,15 61,16 6}
{0 CHEMBL145472,1 1,2 12,4 26,5 1,6 13,7 38.881,8 8,9 4,10 37,11 35.296,12 20,13 29,14 519.38,15 55,16 6.081}
{0 CHEMBL146431,2 23,3 4,4 45,5 3,6 25,7 59.074,8 14,10 64,11 55.502,12 37,13 46,14 623.87,15 91,16 7.097}
{0 CHEMBL146536,2 17,3 4,4 51,5 3,6 19,7 61.359,8 20,10 61,11 57.083,12 37,13 46,14 629.93,15 97,16 7.398}
{0 CHEMBL147092,2 16,3 4,4 31,5 2,6 18,7 46.222,8 11,9 2,10 52,11 43.996,12 27,13 38,14 560.53,15 69,16 8.137}
{0 CHEMBL147214,2 17,3 4,4 49,5 3,6 19,7 58.597,8 18,10 58,11 54.556,12 35,13 44,14 603.89,15 93,16 8.229}
{0 CHEMBL147499,2 17,3 4,4 47,5 3,6 19,7 56.836,8 17,10 57,11 53.029,12 34,13 43,14 589.86,15 90,16 8.444}
{0 CHEMBL147711,2 17,3 4,4 47,5 3,6 19,7 55.836,8 16,10 55,11 52.029,12 33,13 42,14 577.85,15 89,16 8.658}
{0 CHEMBL147939,2 16,3 4,4 37,5 2,6 18,7 48.029,8 13,10 52,11 45.395,12 29,13 38,14 519.71,15 75,16 7.745}
{0 CHEMBL148149,2 17,3 4,4 45,5 3,6 19,7 55.074,8 16,10 56,11 51.502,12 33,13 42,14 575.83,15 87,16 7.328}
{0 CHEMBL148255,2 17,3 4,4 43,5 3,6 19,7 53.313,8 15,10 55,11 49.975,12 32,13 41,14 561.8,15 84,16 7.854}
{0 CHEMBL148309,2 22,3 4,4 41,5 2,6 24,7 55.552,8 13,10 62,11 52.449,12 35,13 44,14 595.81,15 85,16 8.515}
{0 CHEMBL152465,1 2,2 22,3 10,4 58,5 8,6 24,7 78.171,8 20,9 2,10 83,11 74.379,12 42,13 64,14 927.24,15 122,16 6.009}
{0 CHEMBL153158,2 17,3 3,4 29,5 3,6 19,7 41.165,8 8,10 48,11 39.866,12 25,13 35,14 485.59,15 64,16 5}
{0 CHEMBL154812,1 2,2 22,3 10,4 58,5 8,6 24,7 78.171,8 20,9 2,10 83,11 74.379,12 42,13 64,14 927.24,15 122,16 5}
{0 CHEMBL162140,1 1,2 23,3 1,4 32,5 1,6 31,7 49.035,8 8,9 1,10 60,11 45.879,12 31,13 39,14 536.76,15 71,16 5.495}
{0 CHEMBL163359,2 24,4 19,6 28,7 34.108,8 1,10 46,11 32.279,12 25,13 28,14 361.47,15 47,16 5.301}
{0 CHEMBL163643,2 19,3 1,4 32,5 2,6 23,7 44.387,8 9,10 51.5,11 41.692,12 28,13 35,14 468.66,15 67,16 5}
{0 CHEMBL1643384,2 49,3 17,4 110,5 15,6 54,7 147.353,8 35,10 164.5,11 141.802,12 84,13 123,14 1700.16,15 233,16 7.357}
{0 CHEMBL1643385,1 2,2 41,3 19,4 102,5 15,6 43,7 137.012,8 34,9 2,10 148,11 131.466,12 75,13 114,14 1624.09,15 216,16 9.398}
{0 CHEMBL1643387,2 53,3 20,4 110,5 16,6 56,7 150.467,8 34,10 170,11 145.43,12 87,13 127,14 1756.17,15 237,16 6.222}
{0 CHEMBL164964,2 18,3 2,4 19,5 2,6 24,7 32.267,8 3,10 44,11 31.224,12 21,13 28,14 373.45,15 47,16 5.102}
{0 CHEMBL165402,1 1,2 15,3 1,4 33,5 1,6 21,7 44.79,8 12,9 1,10 49,11 41.384,12 27,13 34,14 475.72,15 67,16 5.022}
{0 CHEMBL166134,2 18,4 20,6 22,7 31.114,8 3,10 39,11 29.3,12 21,13 25,14 328.45,15 45,16 5.301}
{0 CHEMBL166247,1 1,2 20,4 20,6 26,7 34.762,8 3,9 1,10 45,11 32.487,12 23,13 28,14 384.54,15 48,16 5.678}
{0 CHEMBL1680,1 2,2 27,3 10,4 66,5 7,6 29,7 88.217,8 22,9 2,10 93,11 83.487,12 49,13 71,14 1019.39,15 137,16 9.3}
{0 CHEMBL174206,1 2,2 53,3 10,4 79,5 9,6 55,7 117.791,8 20,9 2,10 136,11 111.669,12 73,13 96,14 1334.77,15 175,16 6}
{0 CHEMBL174490,2 18,4 21,5 1,6 22,7 32.12,8 3,10 40.5,11 30.321,12 21,13 26,14 343.47,15 47,16 5}
{0 CHEMBL174872,2 24,4 23,5 1,6 28,7 37.881,8 2,10 49.5,11 35.848,12 26,13 31,14 405.54,15 54,16 5.061}
{0 CHEMBL175197,2 24,4 21,5 1,6 28,7 37.756,8 2,10 51.5,11 36.615,12 26,13 33,14 441.52,15 54,16 5}
{0 CHEMBL175356,2 18,3 2,4 26,5 1,6 22,7 37.307,8 6,10 44.5,11 35.31,12 24,13 30,14 402.54,15 56,16 5}
{0 CHEMBL176313,2 24,3 1,4 22,5 1,6 28,7 39.909,8 3,10 54.5,11 39.24,12 27,13 36,14 489.54,15 58,16 5.375}
{0 CHEMBL1766089,2 20,3 1,4 30,6 23,7 43.989,8 9,9 1,10 49.5,11 40.982,12 29,13 34,14 472.07,15 64,16 8.081}
{0 CHEMBL1766090,2 20,3 2,4 30,5 3,6 20,7 44.444,8 9,9 1,10 50.5,11 41.696,12 29,13 35,14 488.07,15 65,16 9.554}
{0 CHEMBL1766091,2 20,3 1,4 31,6 23,7 44.995,8 9,9 1,10 50.5,11 42.003,12 29,13 35,14 487.09,15 66,16 7.469}
{0 CHEMBL1766092,2 20,3 2,4 32,6 23,7 46.205,8 10,9 1,10 51.5,11 43.223,12 30,13 36,14 502.1,15 68,16 7.301}
{0 CHEMBL1766093,2 20,3 1,4 29,6 23,7 44.847,8 9,9 2,10 50.5,11 41.809,12 29,13 35,14 506.51,15 64,16 7.959}
{0 CHEMBL1766094,2 20,3 1,4 29,6 23,7 43.927,8 9,9 1,10 50.5,11 41.365,12 29,13 35,14 490.06,15 64,16 8.328}
{0 CHEMBL1766095,2 20,3 1,4 30,6 23,7 43.989,8 9,9 1,10 49.5,11 40.982,12 29,13 34,14 472.07,15 64,16 7.699}
{0 CHEMBL1766096,2 21,3 2,4 31,6 23,7 45.199,8 9,9 1,10 50.5,11 42.202,12 30,13 35,14 487.08,15 66,16 9.42}
{0 CHEMBL1766097,2 21,3 2,4 31,6 23,7 45.199,8 9,9 1,10 50.5,11 42.202,12 30,13 35,14 487.08,15 66,16 8.959}
{0 CHEMBL1766098,2 21,3 2,4 33,6 23,7 46.961,8 10,9 1,10 51.5,11 43.729,12 31,13 36,14 501.11,15 69,16 7.886}
{0 CHEMBL1766099,2 22,3 2,4 32,5 1,6 24,7 47.205,8 9,9 1,10 53.5,11 44.223,12 31,13 37,14 514.11,15 69,16 9.409}
{0 CHEMBL1766100,2 18,3 1,4 31,6 22,7 43.995,8 10,9 1,10 49,11 41.003,12 28,13 34,14 475.08,15 65,16 8.319}
{0 CHEMBL1766101,2 18,3 1,4 31,6 22,7 43.995,8 10,9 1,10 49,11 41.003,12 28,13 34,14 475.08,15 65,16 6.839}
{0 CHEMBL1766102,2 22,3 2,4 26,5 1,6 24,7 40.921,8 5,9 1,10 48.5,11 38.643,12 27,13 33,14 460.01,15 59,16 9.42}
{0 CHEMBL1766103,2 21,3 2,4 25,6 23,7 38.915,8 5,9 1,10 45.5,11 36.621,12 26,13 31,14 432.98,15 56,16 8.319}
{0 CHEMBL1766104,2 18,3 2,4 29,6 22,7 42.688,8 9,9 1,10 49,11 40.191,12 27,13 34,14 477.05,15 63,16 8.081}
{0 CHEMBL1766105,2 21,3 3,4 32,6 23,7 44.796,8 9,10 50.5,11 42.089,12 30,13 35,14 468.64,15 67,16 7.959}
{0 CHEMBL1766106,2 19,3 2,4 29,5 2,6 20,7 43.688,8 9,9 1,10 50,11 41.191,12 28,13 35,14 489.06,15 64,16 5.854}
{0 CHEMBL1766107,2 21,3 2,4 30,5 2,6 20,7 45.137,8 9,9 1,10 51,11 42.585,12 30,13 36,14 505.07,15 66,16 8.824}
{0 CHEMBL1766108,2 20,3 2,4 30,5 1,6 24,7 45.694,8 9,9 1,10 53.5,11 43.212,12 29,13 37,14 516.09,15 67,16 7.699}
{0 CHEMBL1766109,2 20,3 1,4 32,5 1,6 19,7 46.364,8 10,9 2,10 49,11 42.841,12 30,13 35,14 507.54,15 67,16 10.208}
{0 CHEMBL1766110,2 20,3 1,4 33,5 1,6 19,7 45.506,8 10,9 1,10 48,11 42.014,12 30,13 34,14 473.1,15 67,16 8.119}
{0 CHEMBL176730,2 24,4 31,5 1,6 28,7 44.927,8 6,10 53.5,11 41.955,12 30,13 35,14 461.66,15 66,16 5.228}
{0 CHEMBL1791304,1 2,2 39,3 19,4 102,5 15,6 43,7 137.262,8 35,9 2,10 149,11 131.982,12 74,13 115,14 1640.1,15 217,16 8.155}
{0 CHEMBL1791305,1 2,2 39,3 19,4 102,5 15,6 43,7 137.262,8 35,9 2,10 149,11 131.982,12 74,13 115,14 1640.1,15 217,16 6}
{0 CHEMBL1791306,1 2,2 41,3 19,4 104,5 15,6 43,7 138.774,8 35,9 2,10 149,11 132.993,12 76,13 115,14 1638.12,15 219,16 10.155}
{0 CHEMBL1791307,1 2,2 35,3 18,4 101,5 15,6 37,7 131.802,8 35,9 2,10 139,11 126.246,12 70,13 109,14 1561.04,15 210,16 8.201}
{0 CHEMBL1791310,1 2,2 35,3 18,4 101,5 15,6 37,7 131.802,8 35,9 2,10 139,11 126.246,12 70,13 109,14 1561.04,15 210,16 7.699}
{0 CHEMBL1791311,1 2,2 35,3 18,4 101,5 15,6 37,7 131.802,8 35,9 2,10 139,11 126.246,12 70,13 109,14 1561.04,15 210,16 7.699}
{0 CHEMBL1791312,1 2,2 39,3 19,4 102,5 15,6 43,7 137.262,8 35,9 2,10 149,11 131.982,12 74,13 115,14 1640.1,15 217,16 9}
{0 CHEMBL1793859,1 2,2 37,3 9,4 69,5 8,6 41,7 100.393,8 21,9 3,10 112.5,11 95.169,12 58,13 82,14 1177.98,15 151,16 6.706}
{0 CHEMBL1793860,1 2,2 37,3 9,4 69,5 8,6 41,7 100.393,8 21,9 3,10 112.5,11 95.169,12 58,13 82,14 1177.98,15 151,16 6.092}
{0 CHEMBL1793861,1 2,2 35,3 9,4 68,5 8,6 40,7 98.637,8 21,9 3,10 111,11 93.664,12 56,13 81,14 1166.96,15 149,16 8.264}
{0 CHEMBL1793959,2 40,3 10,4 76,5 8,6 42,7 103.592,8 22,9 1,10 114,11 98.595,12 62,13 84,14 1170.94,15 160,16 6.099}
{0 CHEMBL1793960,2 44,3 10,4 78,5 8,6 47,7 108.353,8 22,9 1,10 121.5,11 103.122,12 66,13 88,14 1221,15 166,16 6.151}
{0 CHEMBL1793961,1 2,2 42,3 10,4 71,5 8,6 46,7 103.745,8 20,9 2,10 119,11 98.562,12 62,13 85,14 1194.58,15 156,16 6.695}
{0 CHEMBL1793962,2 44,3 10,4 78,5 8,6 47,7 108.353,8 22,9 1,10 121.5,11 103.122,12 66,13 88,14 1221,15 166,16 6.842}
{0 CHEMBL1793963,2 40,3 11,4 75,5 8,6 42,7 101.427,8 21,10 113,11 96.956,12 61,13 83,14 1138.47,15 158,16 6.352}
{0 CHEMBL1793964,1 2,2 41,3 19,4 104,5 15,6 43,7 138.774,8 35,9 2,10 149,11 132.993,12 76,13 115,14 1638.12,15 219,16 7.46}
{0 CHEMBL1794032,1 2,2 37,3 9,4 67,5 8,6 41,7 98.631,8 20,9 3,10 111.5,11 93.642,12 57,13 81,14 1163.95,15 148,16 7.917}
{0 CHEMBL1794033,1 2,2 37,3 9,4 69,5 8,6 41,7 100.393,8 21,9 3,10 112.5,11 95.169,12 58,13 82,14 1177.98,15 151,16 7.444}
{0 CHEMBL1794034,1 2,2 37,3 9,4 72,5 8,6 41,7 101.296,8 22,9 2,10 112.5,11 95.868,12 59,13 82,14 1157.57,15 154,16 7.051}
{0 CHEMBL1794035,1 2,2 41,3 19,4 104,5 15,6 43,7 138.774,8 35,9 2,10 149,11 132.993,12 76,13 115,14 1638.12,15 219,16 9.602}
{0 CHEMBL1794036,1 2,2 37,3 9,4 69,5 8,6 41,7 100.393,8 21,9 3,10 112.5,11 95.169,12 58,13 82,14 1177.98,15 151,16 7.286}
{0 CHEMBL1794037,1 2,2 37,3 9,4 69,5 8,6 41,7 100.393,8 21,9 3,10 112.5,11 95.169,12 58,13 82,14 1177.98,15 151,16 6}
{0 CHEMBL1794039,1 2,2 37,3 9,4 71,5 8,6 41,7 102.154,8 22,9 3,10 113.5,11 96.696,12 59,13 83,14 1192.01,15 154,16 8.03}
{0 CHEMBL1794040,1 2,2 37,3 9,4 69,5 8,6 41,7 100.393,8 21,9 3,10 112.5,11 95.169,12 58,13 82,14 1177.98,15 151,16 7.767}
{0 CHEMBL1794041,1 2,2 37,3 9,4 69,5 8,6 41,7 100.393,8 21,9 3,10 112.5,11 95.169,12 58,13 82,14 1177.98,15 151,16 6.724}
{0 CHEMBL1794042,1 2,2 34,3 9,4 68,5 8,6 40,7 97.024,8 21,9 2,10 110,11 92.331,12 55,13 80,14 1133.51,15 148,16 7.607}
{0 CHEMBL1794043,1 2,2 39,3 9,4 71,5 8,6 45,7 102.541,8 21,9 2,10 117.5,11 97.363,12 60,13 84,14 1182.58,15 155,16 7.564}
{0 CHEMBL1794044,1 2,2 37,3 9,4 61,5 8,6 41,7 93.347,8 17,9 3,10 108.5,11 89.062,12 54,13 78,14 1121.86,15 139,16 6}
{0 CHEMBL1794045,1 2,2 37,3 9,4 63,5 8,6 41,7 95.109,8 18,9 3,10 109.5,11 90.589,12 55,13 79,14 1135.89,15 142,16 6.499}
{0 CHEMBL1794046,1 2,2 39,3 9,4 73,5 8,6 42,7 104.916,8 22,9 3,10 116,11 99.223,12 61,13 85,14 1218.05,15 158,16 6.932}
{0 CHEMBL1823872,1 2,2 41,3 19,4 104,5 15,6 43,7 138.774,8 35,9 2,10 149,11 132.993,12 76,13 115,14 1638.12,15 219,16 10.196}
{0 CHEMBL1823873,1 2,2 41,3 19,4 104,5 15,6 43,7 138.774,8 35,9 2,10 149,11 132.993,12 76,13 115,14 1638.12,15 219,16 8.959}
{0 CHEMBL1824049,1 2,2 39,3 20,4 103,5 15,6 39,7 136.223,8 35,9 2,10 144,11 130.686,12 74,13 113,14 1615.08,15 216,16 7.456}
{0 CHEMBL1824050,1 2,2 39,3 20,4 103,5 15,6 39,7 136.223,8 35,9 2,10 144,11 130.686,12 74,13 113,14 1615.08,15 216,16 8.387}
{0 CHEMBL1824051,1 2,2 43,3 19,4 105,5 15,6 44,7 140.529,8 35,9 2,10 150.5,11 134.498,12 78,13 116,14 1649.14,15 221,16 7.824}
{0 CHEMBL1824052,1 2,2 43,3 19,4 105,5 15,6 44,7 140.529,8 35,9 2,10 150.5,11 134.498,12 78,13 116,14 1649.14,15 221,16 8.796}
{0 CHEMBL1824053,1 2,2 42,3 19,4 107,5 15,6 44,7 142.541,8 36,9 2,10 152.5,11 136.541,12 78,13 118,14 1679.18,15 225,16 6}
{0 CHEMBL1824054,1 2,2 42,3 19,4 107,5 15,6 44,7 142.541,8 36,9 2,10 152.5,11 136.541,12 78,13 118,14 1679.18,15 225,16 6.975}
{0 CHEMBL1824055,1 2,2 34,3 10,4 66,5 8,6 36,7 93.217,8 20,9 2,10 103,11 88.487,12 54,13 76,14 1079.44,15 142,16 6.886}
{0 CHEMBL1824056,1 2,2 36,3 10,4 67,5 8,6 37,7 94.972,8 20,9 2,10 104.5,11 89.992,12 56,13 77,14 1090.46,15 144,16 6.762}
{0 CHEMBL1824057,1 2,2 35,3 10,4 69,5 8,6 37,7 96.984,8 21,9 2,10 106.5,11 92.035,12 56,13 79,14 1120.5,15 148,16 6}
{0 CHEMBL1824058,1 2,2 35,3 10,4 69,5 8,6 37,7 96.984,8 21,9 2,10 106.5,11 92.035,12 56,13 79,14 1120.5,15 148,16 6}
{0 CHEMBL185861,1 1,2 19,4 25,6 26,7 41.154,8 6,9 2,10 50,11 38.411,12 25,13 33,14 477.08,15 58,16 8.398}
{0 CHEMBL187498,1 1,2 16,4 24,6 21,7 37.642,8 6,9 2,10 42.5,11 34.587,12 22,13 29,14 470.48,15 53,16 6.602}
{0 CHEMBL187768,1 1,2 19,4 28,6 26,7 42.057,8 7,9 1,10 50,11 39.11,12 26,13 33,14 456.67,15 61,16 7.658}
{0 CHEMBL188402,1 1,2 18,4 25,6 26,7 39.54,8 6,9 1,10 49,11 37.078,12 24,13 32,14 443.63,15 57,16 7.495}
{0 CHEMBL188767,1 1,2 20,4 27,6 26,7 41.052,8 6,9 1,10 49,11 38.089,12 26,13 32,14 441.65,15 59,16 7}
{0 CHEMBL188777,1 1,2 18,4 26,6 25,7 39.296,8 6,9 1,10 47.5,11 36.583,12 24,13 31,14 430.63,15 57,16 6.658}
{0 CHEMBL189554,1 1,2 19,4 25,6 26,7 41.154,8 6,9 2,10 50,11 38.411,12 25,13 33,14 477.08,15 58,16 8.227}
{0 CHEMBL190070,1 1,2 20,3 1,4 32,5 1,6 27,7 47.035,8 9,9 1,10 55,11 43.879,12 29,13 37,14 512.74,15 69,16 7.638}
{0 CHEMBL1907758,1 3,2 60,3 39,4 207,5 34,6 62,7 264.098,8 77,9 3,10 275,11 254.04,12 137,13 220,14 3149.06,15 427,16 8.624}
{0 CHEMBL190786,1 1,2 20,4 31,6 26,7 44.574,8 8,9 1,10 51,11 41.142,12 28,13 34,14 469.71,15 65,16 5.553}
{0 CHEMBL191025,1 1,2 19,4 26,6 26,7 40.296,8 6,9 1,10 49,11 37.583,12 25,13 32,14 442.64,15 58,16 7.921}
{0 CHEMBL191171,1 2,2 18,4 25,6 25,7 39.938,8 6,9 2,10 47.5,11 36.749,12 24,13 31,14 447.68,15 56,16 6.796}
{0 CHEMBL191255,1 1,2 20,4 27,6 26,7 41.052,8 6,9 1,10 49,11 38.089,12 26,13 32,14 441.65,15 59,16 6.824}
{0 CHEMBL2011461,2 26,3 7,4 60,5 6,6 28,7 77.024,8 20,10 82,11 72.872,12 46,13 61,14 837.14,15 121,16 7.347}
{0 CHEMBL2011462,2 26,3 7,4 58,5 6,6 28,7 75.262,8 19,10 81,11 71.345,12 45,13 60,14 823.11,15 118,16 8.26}
{0 CHEMBL2011463,2 26,3 7,4 58,5 6,6 28,7 75.262,8 19,10 81,11 71.345,12 45,13 60,14 823.11,15 118,16 8.357}
{0 CHEMBL2011464,2 26,3 7,4 58,5 6,6 28,7 75.262,8 19,10 81,11 71.345,12 45,13 60,14 823.11,15 118,16 8.377}
{0 CHEMBL2011465,2 26,3 7,4 60,5 6,6 28,7 77.024,8 20,10 82,11 72.872,12 46,13 61,14 837.14,15 121,16 8.509}
{0 CHEMBL2011466,2 26,3 7,4 60,5 6,6 28,7 77.024,8 20,10 82,11 72.872,12 46,13 61,14 837.14,15 121,16 8.387}
{0 CHEMBL2011467,2 26,3 7,4 62,5 6,6 28,7 78.785,8 21,10 83,11 74.398,12 47,13 62,14 851.17,15 124,16 7.357}
{0 CHEMBL2021544,1 2,2 46,3 8,4 70,5 8,6 48,7 103.83,8 18,9 2,10 119,11 98.111,12 64,13 84,14 1171.58,15 154,16 6}
{0 CHEMBL2021559,1 2,2 46,3 8,4 70,5 8,6 48,7 103.83,8 18,9 2,10 119,11 98.111,12 64,13 84,14 1171.58,15 154,16 6}
{0 CHEMBL2052017,2 26,3 8,4 54,5 6,6 28,7 73.194,8 18,10 82,11 70.006,12 44,13 60,14 823.06,15 114,16 9.301}
{0 CHEMBL2069499,2 17,4 34,6 21,7 43.444,8 11,10 46.5,11 39.988,12 28,13 32,14 426.66,15 66,16 5}
{0 CHEMBL2069502,2 17,3 1,4 26,6 21,7 37.853,8 8,10 45.5,11 35.595,12 25,13 30,14 398.55,15 56,16 6}
{0 CHEMBL2079558,1 2,2 42,3 9,4 73,5 8,6 46,7 105.052,8 21,9 2,10 119,11 99.374,12 63,13 85,14 1192.61,15 158,16 6.857}
{0 CHEMBL2079559,1 2,2 43,3 8,4 74,5 8,6 47,7 106.603,8 21,9 2,10 120.5,11 100.68,12 64,13 86,14 1203.64,15 160,16 5.87}
{0 CHEMBL2079563,1 2,2 32,3 10,4 69,5 8,6 35,7 94.984,8 22,9 2,10 103.5,11 90.035,12 54,13 77,14 1096.48,15 146,16 6.514}
{0 CHEMBL2079626,1 2,2 32,3 10,4 69,5 8,6 35,7 94.984,8 22,9 2,10 103.5,11 90.035,12 54,13 77,14 1096.48,15 146,16 6.456}
{0 CHEMBL2093026,1 2,2 28,3 11,4 63,5 8,6 30,7 87.154,8 20,9 2,10 95,11 83.169,12 48,13 72,14 1034.36,15 135,16 6.342}
{0 CHEMBL2093027,1 2,2 35,3 12,4 65,5 9,6 37,7 94.37,8 19,9 2,10 107,11 90.411,12 54,13 79,14 1124.44,15 144,16 6}
{0 CHEMBL2111200,1 2,2 36,3 11,4 69,5 8,6 37,7 97.188,8 21,9 2,10 106.5,11 92.234,12 57,13 79,14 1120.49,15 148,16 6.47}
{0 CHEMBL2111257,1 2,2 36,3 11,4 69,5 8,6 37,7 97.188,8 21,9 2,10 106.5,11 92.234,12 57,13 79,14 1120.49,15 148,16 7.523}
{0 CHEMBL2111258,1 2,2 36,3 11,4 69,5 8,6 37,7 97.188,8 21,9 2,10 106.5,11 92.234,12 57,13 79,14 1120.49,15 148,16 6.836}
{0 CHEMBL2112222,2 19,3 3,4 38,5 4,6 20,7 50.58,8 12,10 56,11 47.702,12 31,13 40,14 542.75,15 78,16 7.276}
{0 CHEMBL2112223,2 18,3 2,4 37,5 3,6 19,7 48.12,8 12,10 52,11 44.965,12 30,13 37,14 499.72,15 74,16 7.337}
{0 CHEMBL2112934,2 21,3 1,4 34,5 1,6 27,7 47.148,8 9,10 55,11 44.218,12 30,13 37,14 494.7,15 71,16 5.066}
{0 CHEMBL2112935,2 20,4 21,6 26,7 34.12,8 3,10 45,11 32.321,12 23,13 28,14 367.49,15 49,16 5.222}
{0 CHEMBL2114094,1 2,2 52,3 17,4 105,5 12,6 53,7 144.12,8 33,9 2,10 156.5,11 137.037,12 85,13 117,14 1645.17,15 222,16 6}
{0 CHEMBL2114095,1 2,2 52,3 17,4 105,5 12,6 53,7 144.12,8 33,9 2,10 156.5,11 137.037,12 85,13 117,14 1645.17,15 222,16 6}
{0 CHEMBL2115143,1 2,2 52,3 17,4 105,5 12,6 53,7 144.12,8 33,9 2,10 156.5,11 137.037,12 85,13 117,14 1645.17,15 222,16 5}
{0 CHEMBL216470,1 2,2 34,3 10,4 68,5 8,6 36,7 94.978,8 21,9 2,10 104,11 90.013,12 55,13 77,14 1093.47,15 145,16 7.398}
{0 CHEMBL216676,1 2,2 39,3 18,4 104,5 13,6 41,7 137.069,8 37,9 2,10 145,11 130.762,12 76,13 112,14 1594.1,15 216,16 6}
{0 CHEMBL216752,1 2,2 45,3 8,4 76,5 8,6 48,7 109.365,8 21,9 2,10 123,11 103.207,12 66,13 88,14 1229.68,15 164,16 5.742}
{0 CHEMBL216789,1 2,2 46,3 17,4 98,5 12,6 47,7 134.081,8 31,9 2,10 145.5,11 127.951,12 77,13 110,14 1556.03,15 208,16 6}
{0 CHEMBL216992,1 2,2 35,3 11,4 78,5 9,6 37,7 105.49,8 25,9 2,10 113,11 99.878,12 60,13 85,14 1207.64,15 163,16 7.824}
{0 CHEMBL217151,2 39,3 10,4 68,5 7,6 41,7 95.683,8 20,10 110,11 91.639,12 59,13 79,14 1077.37,15 147,16 9.1}
{0 CHEMBL217216,1 2,2 41,3 8,4 73,5 8,6 46,7 104.848,8 21,9 2,10 119,11 99.175,12 62,13 85,14 1192.62,15 158,16 6.084}
{0 CHEMBL217643,1 2,2 28,3 8,4 69,5 8,6 30,7 93.075,8 25,9 2,10 99,11 87.605,12 53,13 74,14 1052.47,15 143,16 6.599}
{0 CHEMBL217725,1 2,2 43,3 10,4 75,5 9,6 47,7 108.268,8 22,9 2,10 123,11 102.615,12 65,13 88,14 1234.65,15 163,16 7.317}
{0 CHEMBL219201,1 2,2 30,3 12,4 68,5 10,6 32,7 94.387,8 21,9 2,10 104,11 90.475,12 51,13 79,14 1133.47,15 147,16 8.208}
{0 CHEMBL219375,1 2,2 28,3 10,4 65,5 8,6 30,7 88.461,8 21,9 2,10 95,11 83.981,12 49,13 72,14 1032.39,15 137,16 8.69}
{0 CHEMBL2204935,2 22,3 1,4 23,6 31,7 41.529,8 5,10 58.5,11 40.484,12 27,13 37,14 494.58,15 60,16 5.395}
{0 CHEMBL227211,2 22,3 2,4 36,5 2,6 24,7 49.114,8 10,10 55,11 45.944,12 32,13 38,14 508.72,15 74,16 6.447}
{0 CHEMBL227212,2 23,3 3,4 37,5 3,6 25,7 51.574,8 10,10 59,11 48.68,12 33,13 41,14 551.75,15 78,16 7.081}
{0 CHEMBL2311098,1 2,2 38,3 10,4 68,5 8,6 41,7 99.842,8 20,9 3,10 112.5,11 94.862,12 58,13 82,14 1178.96,15 150,16 7.585}
{0 CHEMBL2311140,1 2,2 42,3 9,4 73,5 8,6 46,7 105.052,8 21,9 2,10 119,11 99.374,12 63,13 85,14 1192.61,15 158,16 7.123}
{0 CHEMBL2311181,1 2,2 42,3 9,4 73,5 8,6 46,7 105.052,8 21,9 2,10 119,11 99.374,12 63,13 85,14 1192.61,15 158,16 7.425}
{0 CHEMBL236587,2 13,3 3,4 27,6 16,7 35.517,8 9,10 39,11 33.53,12 22,13 28,14 381.52,15 55,16 5}
{0 CHEMBL236588,2 13,3 3,4 31,6 16,7 39.04,8 11,10 41,11 36.584,12 24,13 30,14 409.58,15 61,16 5}
{0 CHEMBL236610,2 13,3 2,4 24,6 16,7 34.159,8 8,9 1,10 38,11 32.116,12 21,13 27,14 385.93,15 51,16 5}
{0 CHEMBL236611,2 13,3 2,4 27,6 16,7 35.063,8 9,10 38,11 32.815,12 22,13 27,14 365.52,15 54,16 5}
{0 CHEMBL236788,1 1,2 13,3 5,4 31,5 2,6 18,7 41.847,8 10,9 1,10 47,11 39.716,12 23,13 34,14 489.66,15 65,16 5}
{0 CHEMBL237660,2 13,3 3,4 25,6 16,7 33.756,8 8,10 38,11 32.003,12 21,13 27,14 367.49,15 52,16 5}
{0 CHEMBL241329,2 12,3 2,4 26,5 1,6 13,7 34.921,8 9,9 1,10 36,11 32.643,12 21,13 27,14 387.95,15 53,16 5}
{0 CHEMBL251541,2 13,3 4,4 32,5 3,6 15,7 42.5,8 13,10 47,11 40.32,12 26,13 34,14 464.62,15 66,16 4.44}
{0 CHEMBL251835,2 15,3 2,4 27,5 1,6 21,7 42.671,8 11,9 1,10 52,11 40.378,12 26,13 35,14 535.49,15 62,16 5.17}
{0 CHEMBL252231,2 14,3 2,4 30,5 4,6 14,7 43.188,8 12,9 1,10 48,11 40.41,12 26,13 34,14 524.51,15 64,16 5.03}
{0 CHEMBL252232,2 15,3 2,4 27,5 1,6 21,7 42.671,8 11,9 1,10 52,11 40.378,12 26,13 35,14 535.49,15 62,16 5.41}
{0 CHEMBL252355,2 29,3 10,4 68,5 8,6 30,7 87.683,8 22,10 94,11 83.639,12 51,13 71,14 981.29,15 139,16 7.357}
{0 CHEMBL254210,2 35,3 9,4 70,5 8,6 36,7 92.99,8 21,10 102,11 88.451,12 56,13 75,14 1027.36,15 145,16 6}
{0 CHEMBL254500,2 14,3 2,4 30,5 4,6 14,7 43.188,8 12,9 1,10 48,11 40.41,12 26,13 34,14 524.51,15 64,16 4.91}
{0 CHEMBL261895,1 2,2 43,3 12,4 79,5 9,6 44,7 111.7,8 23,9 2,10 123.5,11 106.098,12 66,13 91,14 1282.7,15 170,16 6.324}
{0 CHEMBL261972,1 2,2 27,3 10,4 64,5 8,6 30,7 87.705,8 21,9 2,10 95,11 83.476,12 48,13 72,14 1033.38,15 136,16 6.536}
{0 CHEMBL262017,1 2,2 28,3 10,4 66,5 8,6 30,7 89.217,8 22,9 2,10 95,11 84.487,12 50,13 72,14 1031.4,15 138,16 8.77}
{0 CHEMBL262257,1 2,2 45,3 17,4 98,5 13,6 47,7 135.331,8 32,9 2,10 149,11 129.467,12 77,13 112,14 1584.05,15 210,16 6}
{0 CHEMBL262258,1 2,2 38,3 15,4 103,5 12,6 40,7 137.365,8 37,9 3,10 141,11 128.935,12 75,13 109,14 1659.98,15 212,16 6}
{0 CHEMBL262379,1 2,2 37,3 16,4 90,5 11,6 39,7 120.58,8 30,9 2,10 129,11 115.129,12 67,13 99,14 1411.85,15 189,16 7.796}
{0 CHEMBL262551,1 2,2 46,3 16,4 111,5 12,6 47,7 145.2,8 37,9 2,10 151.5,11 137.418,12 83,13 116,14 1639.23,15 227,16 6}
{0 CHEMBL262790,1 2,2 50,3 16,4 108,5 12,6 52,7 145.683,8 34,9 2,10 157,11 138.386,12 84,13 118,14 1662.22,15 226,16 6}
{0 CHEMBL262899,1 2,2 37,3 9,4 69,5 8,6 41,7 101.109,8 22,9 2,10 115.5,11 97.018,12 59,13 85,14 1211.54,15 154,16 7.947}
{0 CHEMBL262975,1 2,2 36,3 10,4 70,5 8,6 37,7 97.739,8 21,9 2,10 106.5,11 92.54,12 57,13 79,14 1119.51,15 149,16 6.24}
{0 CHEMBL263023,2 18,3 6,4 51,5 4,6 20,7 62.268,8 19,10 63,11 58.512,12 37,13 48,14 661.93,15 99,16 7.959}
{0 CHEMBL263024,2 18,3 5,4 47,5 4,6 20,7 58.29,8 17,10 60,11 54.744,12 35,13 45,14 617.87,15 92,16 8}
{0 CHEMBL263209,1 2,2 28,3 10,4 68,5 8,6 30,7 91.228,8 22,9 2,10 97,11 86.529,12 50,13 74,14 1061.44,15 142,16 7.77}
{0 CHEMBL263292,1 2,2 36,3 13,4 72,5 10,6 38,7 102.114,8 22,9 2,10 114,11 97.727,12 58,13 85,14 1209.56,15 157,16 6.155}
{0 CHEMBL263306,1 2,2 36,3 10,4 70,5 8,6 37,7 97.739,8 21,9 2,10 106.5,11 92.54,12 57,13 79,14 1119.51,15 149,16 6.991}
{0 CHEMBL263340,1 2,2 44,3 17,4 96,5 12,6 46,7 134.984,8 31,9 3,10 145,11 127.762,12 75,13 110,14 1670.9,15 206,16 6}
{0 CHEMBL263365,1 2,2 42,3 9,4 73,5 8,6 46,7 105.052,8 21,9 2,10 119,11 99.374,12 63,13 85,14 1192.61,15 158,16 7.336}
{0 CHEMBL263587,1 2,2 36,3 12,4 72,5 10,6 38,7 101.66,8 22,9 2,10 113,11 97.013,12 58,13 84,14 1193.56,15 156,16 7.022}
{0 CHEMBL263604,2 39,3 9,4 68,5 7,6 41,7 95.228,8 20,10 109,11 90.924,12 59,13 78,14 1061.37,15 146,16 8.7}
{0 CHEMBL263606,1 2,2 34,3 9,4 67,5 8,6 36,7 93.768,8 20,9 2,10 103,11 88.793,12 54,13 76,14 1078.46,15 143,16 7.458}
{0 CHEMBL263672,1 2,2 38,3 10,4 71,5 8,6 41,7 100.745,8 21,9 2,10 112.5,11 95.562,12 59,13 82,14 1158.55,15 153,16 7.112}
{0 CHEMBL264028,1 2,2 33,3 8,4 66,5 8,6 36,7 99.637,8 21,9 4,10 105,11 91.733,12 54,13 78,14 1329.26,15 144,16 7.495}
{0 CHEMBL264045,1 2,2 28,3 10,4 62,5 8,6 30,7 85.694,8 20,9 2,10 93,11 81.433,12 48,13 70,14 1003.34,15 132,16 6.093}
{0 CHEMBL264046,1 2,2 36,3 11,4 69,5 8,6 37,7 97.188,8 21,9 2,10 106.5,11 92.234,12 57,13 79,14 1120.49,15 148,16 5}
{0 CHEMBL264083,1 2,2 42,3 13,4 79,5 10,6 44,7 112.404,8 23,9 2,10 126,11 107.329,12 65,13 93,14 1314.71,15 172,16 6.928}
{0 CHEMBL264133,1 2,2 28,3 10,4 66,5 8,6 30,7 96.546,8 22,9 4,10 99,11 89.163,12 50,13 76,14 1313.22,15 142,16 9.201}
{0 CHEMBL264186,1 2,2 36,3 9,4 70,5 8,6 40,7 98.535,8 21,9 2,10 110,11 93.341,12 57,13 80,14 1131.53,15 150,16 10.1}
{0 CHEMBL264312,2 39,3 8,4 67,5 7,6 41,7 92.768,8 19,10 105,11 88.188,12 58,13 75,14 1018.34,15 142,16 8.662}
{0 CHEMBL264539,1 2,2 46,3 9,4 79,5 8,6 48,7 112.336,8 22,9 2,10 125,11 105.954,12 68,13 90,14 1258.72,15 169,16 5.652}
{0 CHEMBL264839,1 2,2 45,3 15,4 99,5 11,6 46,7 132.927,8 32,9 2,10 141.5,11 126.027,12 77,13 107,14 1511.03,15 206,16 6}
{0 CHEMBL265120,1 2,2 43,3 15,4 98,5 11,6 45,7 131.172,8 32,9 2,10 140,11 124.521,12 75,13 106,14 1500.01,15 204,16 6}
{0 CHEMBL265615,1 2,2 50,3 17,4 105,5 12,6 52,7 143.37,8 33,9 2,10 156,11 136.553,12 83,13 117,14 1649.17,15 222,16 5}
{0 CHEMBL265636,1 2,2 28,3 10,4 67,5 8,6 30,7 90.222,8 22,9 2,10 96,11 85.508,12 50,13 73,14 1046.42,15 140,16 7.829}
{0 CHEMBL265836,1 2,2 41,3 11,4 84,5 9,6 43,7 114.774,8 26,9 2,10 124,11 108.459,12 67,13 92,14 1297.77,15 176,16 6}
{0 CHEMBL265839,1 2,2 39,3 18,4 104,5 13,6 41,7 137.069,8 37,9 2,10 145,11 130.762,12 76,13 112,14 1594.1,15 216,16 6}
{0 CHEMBL265846,1 2,2 43,3 15,4 90,5 11,6 45,7 124.126,8 28,9 2,10 136,11 118.414,12 71,13 102,14 1443.89,15 192,16 6.672}
{0 CHEMBL265912,1 2,2 34,3 10,4 66,5 8,6 36,7 93.217,8 20,9 2,10 103,11 88.487,12 54,13 76,14 1079.44,15 142,16 7.359}
{0 CHEMBL266047,1 2,2 41,3 12,4 78,5 9,6 43,7 109.944,8 23,9 2,10 122,11 104.593,12 64,13 90,14 1271.68,15 168,16 6.587}
{0 CHEMBL266178,1 2,2 44,3 9,4 75,5 8,6 47,7 107.813,8 21,9 2,10 121.5,11 101.9,12 65,13 87,14 1218.65,15 162,16 6.101}
{0 CHEMBL266346,1 2,2 45,3 17,4 98,5 13,6 47,7 135.331,8 32,9 2,10 149,11 129.467,12 77,13 112,14 1584.05,15 210,16 6}
{0 CHEMBL266477,1 2,2 34,3 10,4 66,5 8,6 36,7 93.217,8 20,9 2,10 103,11 88.487,12 54,13 76,14 1079.44,15 142,16 7.387}
{0 CHEMBL266726,1 2,2 38,3 10,4 71,5 8,6 41,7 100.745,8 21,9 2,10 112.5,11 95.562,12 59,13 82,14 1158.55,15 153,16 7.631}
{0 CHEMBL267054,2 27,3 10,4 70,5 7,6 29,7 88.444,8 24,10 93,11 84.166,12 51,13 71,14 983.31,15 141,16 7.31}
{0 CHEMBL267860,1 2,2 35,3 19,4 100,5 15,6 37,7 131.251,8 35,9 2,10 139,11 125.939,12 70,13 109,14 1562.02,15 209,16 7.7}
{0 CHEMBL267947,1 2,2 35,3 11,4 67,5 9,6 37,7 95.677,8 20,9 2,10 107,11 91.223,12 55,13 79,14 1122.47,15 146,16 6}
{0 CHEMBL268161,1 2,2 34,3 10,4 66,5 8,6 36,7 93.217,8 20,9 2,10 103,11 88.487,12 54,13 76,14 1079.44,15 142,16 7.387}
{0 CHEMBL268205,1 2,2 43,3 16,4 96,5 11,6 45,7 129.865,8 31,9 2,10 140,11 123.709,12 74,13 106,14 1501.98,15 202,16 6}
{0 CHEMBL268448,1 2,2 43,3 15,4 98,5 11,6 45,7 131.172,8 32,9 2,10 140,11 124.521,12 75,13 106,14 1500.01,15 204,16 6}
{0 CHEMBL268611,1 2,2 45,3 15,4 89,5 11,6 50,7 126.62,8 27,9 2,10 143.5,11 121.425,12 72,13 106,14 1496.92,15 195,16 5}
{0 CHEMBL268930,1 3,2 37,3 8,4 75,5 8,6 41,7 106.95,8 25,9 3,10 117.5,11 100.777,12 62,13 86,14 1231.7,15 161,16 7.585}
{0 CHEMBL269023,1 2,2 46,3 18,4 109,5 14,6 48,7 146.598,8 37,9 2,10 158,11 139.837,12 83,13 120,14 1697.23,15 229,16 6}
{0 CHEMBL269485,1 2,2 38,3 15,4 100,5 12,6 40,7 130.183,8 34,9 2,10 136,11 123.564,12 72,13 105,14 1494.02,15 205,16 5}
{0 CHEMBL269532,1 2,2 29,3 11,4 65,5 9,6 31,7 89.915,8 21,9 2,10 98,11 85.696,12 50,13 74,14 1060.4,15 139,16 7.73}
{0 CHEMBL275806,1 2,2 41,3 9,4 73,5 8,6 46,7 105.052,8 22,9 2,10 119,11 99.374,12 63,13 85,14 1192.61,15 158,16 6}
{0 CHEMBL276098,1 2,2 22,3 10,4 60,5 8,6 24,7 79.932,8 21,9 2,10 84,11 75.906,12 43,13 65,14 941.27,15 125,16 6}
{0 CHEMBL281200,2 20,3 5,4 44,6 22,7 55.273,8 15,10 57,11 51.68,12 35,13 42,14 572.81,15 86,16 5.509}
{0 CHEMBL282129,2 26,3 5,4 51,6 28,7 65.563,8 16,10 69,11 61.281,12 42,13 50,14 677.96,15 101,16 6.222}
{0 CHEMBL282618,2 26,3 6,4 50,6 28,7 65.012,8 16,10 69,11 60.975,12 42,13 50,14 678.94,15 100,16 5.745}
{0 CHEMBL282803,2 26,3 6,4 50,6 28,7 65.012,8 16,10 69,11 60.975,12 42,13 50,14 678.94,15 100,16 5.569}
{0 CHEMBL285333,2 23,3 6,4 48,6 27,7 62.501,8 16,10 67.5,11 58.964,12 39,13 49,14 668.91,15 97,16 6.097}
{0 CHEMBL28824,2 17,3 5,4 42,6 21,7 52.762,8 15,10 55.5,11 49.669,12 32,13 41,14 562.78,15 83,16 5.337}
{0 CHEMBL29102,2 18,3 6,4 43,6 18,7 52.722,8 15,10 52,11 49.373,12 33,13 40,14 549.77,15 83,16 5.337}
{0 CHEMBL29311,2 26,3 6,4 50,6 28,7 65.012,8 16,10 69,11 60.975,12 42,13 50,14 678.94,15 100,16 5.585}
{0 CHEMBL296419,2 19,3 1,4 31,6 22,7 43.074,8 9,10 49,11 40.559,12 28,13 34,14 458.63,15 65,16 5}
{0 CHEMBL302567,2 18,3 2,4 35,5 3,6 19,7 46.358,8 11,10 51,11 43.439,12 29,13 36,14 485.69,15 71,16 6.211}
{0 CHEMBL305261,2 18,3 2,4 33,5 3,6 19,7 44.597,8 10,10 50,11 41.912,12 28,13 35,14 471.66,15 68,16 6.089}
{0 CHEMBL305279,2 18,3 2,4 41,5 3,6 19,7 52.643,8 15,10 56,11 49.019,12 33,13 40,14 539.79,15 81,16 8.398}
{0 CHEMBL308444,2 18,3 2,4 39,5 3,6 19,7 49.881,8 13,10 53,11 46.492,12 31,13 38,14 513.75,15 77,16 6.648}
{0 CHEMBL309948,2 19,3 6,4 43,5 5,6 21,7 55.472,8 13,10 60,11 52.921,12 32,13 45,14 621.82,15 88,16 4}
{0 CHEMBL311695,2 26,3 7,4 56,5 6,6 28,7 73.501,8 18,10 80,11 69.818,12 44,13 59,14 809.08,15 115,16 8.796}
{0 CHEMBL311789,2 19,3 6,4 51,5 5,6 21,7 62.518,8 17,10 64,11 59.028,12 36,13 49,14 677.94,15 100,16 5}
{0 CHEMBL316559,2 23,3 4,4 40,5 3,6 25,7 53.546,8 11,10 59,11 50.427,12 34,13 42,14 568.78,15 82,16 5.921}
{0 CHEMBL319458,2 17,4 38,6 21,7 46.967,8 13,10 48.5,11 43.041,12 30,13 34,14 454.72,15 72,16 5}
{0 CHEMBL329684,1 1,2 17,3 6,4 44,5 5,6 21,7 56.875,8 15,9 1,10 61,11 53.613,12 32,13 45,14 640.89,15 89,16 7.538}
{0 CHEMBL329824,1 1,2 17,3 6,4 45,5 5,6 21,7 57.631,8 16,9 1,10 61,11 54.119,12 33,13 45,14 639.9,15 90,16 6.921}
{0 CHEMBL330248,1 1,2 15,3 5,4 30,5 5,6 17,7 41.784,8 8,9 1,10 47,11 40.1,12 23,13 35,14 507.65,15 65,16 5.443}
{0 CHEMBL334340,2 18,3 5,4 48,5 4,6 20,7 59.296,8 17,10 61,11 55.765,12 35,13 46,14 632.89,15 94,16 7.959}
{0 CHEMBL334499,2 23,3 4,4 53,5 3,6 25,7 66.12,8 18,10 68,11 61.609,12 41,13 50,14 679.99,15 103,16 7.678}
{0 CHEMBL335045,2 17,3 4,4 47,5 3,6 19,7 58.472,8 18,10 60,11 55.322,12 35,13 46,14 639.87,15 93,16 8.538}
{0 CHEMBL335223,2 12,3 5,4 49,5 4,6 14,7 56.052,8 20,10 53,11 52.271,12 32,13 42,14 583.86,15 91,16 7.824}
{0 CHEMBL335238,2 17,3 4,4 48,5 3,6 19,7 58.535,8 18,10 59,11 54.939,12 35,13 45,14 621.88,15 93,16 8.301}
{0 CHEMBL336108,2 12,3 5,4 51,5 4,6 14,7 57.813,8 21,10 54,11 53.797,12 33,13 43,14 597.89,15 94,16 7.638}
{0 CHEMBL336286,1 1,2 17,3 6,4 46,5 5,6 21,7 59.33,8 17,9 1,10 63,11 56.029,12 34,13 47,14 671.92,15 93,16 7.959}
{0 CHEMBL336308,2 12,3 5,4 54,5 4,6 14,7 61.58,8 23,10 58,11 57.346,12 35,13 46,14 638.95,15 100,16 8.143}
{0 CHEMBL336819,2 17,3 4,4 49,5 3,6 19,7 58.597,8 18,10 58,11 54.556,12 35,13 44,14 603.89,15 93,16 8.602}
{0 CHEMBL336986,2 18,3 5,4 47,5 4,6 20,7 59.927,8 18,10 63,11 57.037,12 36,13 48,14 667.88,15 95,16 8.638}
{0 CHEMBL337083,2 17,3 4,4 49,5 3,6 19,7 58.597,8 18,10 58,11 54.556,12 35,13 44,14 603.89,15 93,16 8.337}
{0 CHEMBL337178,2 12,3 5,4 50,5 4,6 14,7 57.057,8 20,10 54,11 53.292,12 32,13 43,14 598.88,15 93,16 7.022}
{0 CHEMBL337179,2 24,3 5,4 53,5 4,6 26,7 67.575,8 18,10 71,11 63.324,12 42,13 52,14 708,15 105,16 8.301}
{0 CHEMBL337445,2 17,3 4,4 47,5 3,6 19,7 58.472,8 18,10 60,11 55.322,12 35,13 46,14 639.87,15 93,16 8.244}
{0 CHEMBL337645,2 19,3 5,4 47,5 4,6 24,7 60.54,8 17,10 66,11 57.26,12 36,13 48,14 657.9,15 95,16 7.071}
{0 CHEMBL337846,2 18,3 7,4 49,5 4,6 20,7 61.961,8 19,10 65,11 58.7,12 37,13 49,14 675.91,15 98,16 8}
{0 CHEMBL341645,2 20,3 4,4 37,5 2,6 23,7 51.029,8 12,10 58.5,11 48.395,12 32,13 41,14 555.74,15 78,16 6.914}
{0 CHEMBL341646,2 17,3 5,4 37,5 2,6 22,7 50.733,8 13,10 59,11 48.626,12 30,13 42,14 575.74,15 79,16 7.398}
{0 CHEMBL343010,2 17,3 4,4 42,5 3,6 19,7 54.887,8 16,10 59,11 52.652,12 33,13 45,14 629.8,15 87,16 8.886}
{0 CHEMBL343347,2 17,3 4,4 49,5 3,6 19,7 58.597,8 18,10 58,11 54.556,12 35,13 44,14 603.89,15 93,16 7.921}
{0 CHEMBL343897,2 17,3 4,4 50,5 3,6 19,7 60.603,8 19,10 61,11 56.577,12 36,13 46,14 630.92,15 96,16 8.854}
{0 CHEMBL344059,2 15,3 1,4 23,5 1,6 18,7 38.171,8 6,9 3,10 42.5,11 35.791,12 21,13 31,14 526.3,15 54,16 5.377}
{0 CHEMBL344074,1 1,2 18,4 18,5 1,6 23,7 38.085,8 3,9 4,10 47,11 35.705,12 21,13 32,14 551.33,15 50,16 5.523}
{0 CHEMBL344285,1 1,2 15,4 27,5 1,6 18,7 42.887,8 8,9 4,10 44.5,11 39.317,12 23,13 33,14 570.43,15 60,16 5.699}
{0 CHEMBL344404,1 1,2 15,3 2,4 23,5 3,6 20,7 39.165,8 6,9 3,10 46.5,11 37.163,12 21,13 33,14 508.48,15 56,16 6.301}
{0 CHEMBL344511,2 22,3 4,4 43,5 2,6 24,7 57.313,8 14,10 63,11 53.975,12 36,13 45,14 609.84,15 88,16 8.337}
{0 CHEMBL349355,1 1,2 15,3 1,4 31,5 1,6 21,7 42.029,8 10,9 1,10 46,11 38.857,12 25,13 32,14 449.68,15 63,16 5}
{0 CHEMBL355923,2 17,3 4,4 45,5 3,6 19,7 54.074,8 15,10 54,11 50.502,12 32,13 41,14 563.82,15 86,16 9}
{0 CHEMBL356717,2 16,3 4,4 39,5 2,6 18,7 49.79,8 14,10 53,11 46.922,12 30,13 39,14 533.74,15 78,16 7.959}
{0 CHEMBL356854,2 26,3 7,4 56,5 6,6 28,7 73.501,8 18,10 80,11 69.818,12 44,13 59,14 809.08,15 115,16 9.523}
{0 CHEMBL359215,1 1,2 15,4 29,5 1,6 18,7 44.648,8 9,9 4,10 45.5,11 40.844,12 24,13 34,14 584.46,15 63,16 6.11}
{0 CHEMBL359453,1 1,2 15,4 27,5 1,6 18,7 39.41,8 7,9 2,10 41.5,11 36.135,12 22,13 30,14 487.52,15 57,16 5.602}
{0 CHEMBL362859,2 24,4 22,5 1,6 28,7 38.739,8 2,9 1,10 50.5,11 36.676,12 26,13 32,14 439.98,15 54,16 5.46}
{0 CHEMBL363092,1 1,2 19,4 25,6 26,7 40.233,8 6,9 1,10 50,11 37.967,12 25,13 33,14 460.63,15 58,16 7.854}
{0 CHEMBL363712,1 1,2 20,4 29,6 26,7 42.813,8 7,9 1,10 50,11 39.616,12 27,13 33,14 455.68,15 62,16 6.215}
{0 CHEMBL364418,1 1,2 19,4 25,6 26,7 40.233,8 6,9 1,10 50,11 37.967,12 25,13 33,14 460.63,15 58,16 7.921}
{0 CHEMBL365627,1 1,2 16,4 29,6 21,7 39.813,8 8,9 1,10 43.5,11 36.616,12 24,13 30,14 419.65,15 59,16 6.367}
{0 CHEMBL367125,1 2,2 27,3 9,4 57,5 7,6 29,7 79.711,8 18,9 2,10 87,11 75.643,12 45,13 65,14 932.25,15 122,16 6.275}
{0 CHEMBL367699,2 24,4 22,5 1,6 28,7 39.455,8 3,10 53.5,11 38.525,12 27,13 35,14 473.54,15 57,16 5.219}
{0 CHEMBL367716,2 18,3 1,4 27,5 1,6 22,7 37.858,8 6,10 44.5,11 35.617,12 24,13 30,14 401.56,15 57,16 5}
{0 CHEMBL368176,2 24,3 1,4 21,5 1,6 28,7 38.211,8 2,10 52.5,11 37.33,12 26,13 34,14 457.52,15 55,16 5}
{0 CHEMBL368304,1 2,2 27,3 9,4 57,5 7,6 29,7 79.711,8 18,9 2,10 87,11 75.643,12 45,13 65,14 932.25,15 122,16 6.223}
{0 CHEMBL368334,2 24,3 1,4 25,5 1,6 28,7 40.097,8 3,10 51.5,11 38.09,12 27,13 33,14 435.57,15 58,16 5.209}
{0 CHEMBL368993,2 24,3 1,4 23,5 1,6 28,7 40.665,8 4,10 54.5,11 39.745,12 28,13 36,14 488.55,15 59,16 5}
{0 CHEMBL374833,2 29,3 3,4 43,5 3,6 31,7 60.859,8 11,10 70,11 57.261,12 40,13 48,14 641.88,15 91,16 6.987}
{0 CHEMBL376703,1 2,2 22,3 10,4 61,5 8,6 24,7 80.938,8 21,9 2,10 85,11 76.928,12 43,13 66,14 956.29,15 127,16 8.444}
{0 CHEMBL383915,1 2,2 34,3 11,4 66,5 8,6 36,7 93.671,8 20,9 2,10 104,11 89.201,12 54,13 77,14 1095.44,15 143,16 7.268}
{0 CHEMBL384072,1 2,2 46,3 18,4 111,5 14,6 48,7 148.359,8 38,9 2,10 159,11 141.364,12 84,13 121,14 1711.26,15 232,16 6}
{0 CHEMBL384164,1 2,2 28,3 10,4 67,5 8,6 30,7 90.222,8 22,9 2,10 96,11 85.508,12 50,13 73,14 1046.42,15 140,16 7.88}
{0 CHEMBL384195,1 2,2 45,3 16,4 99,5 11,6 46,7 133.382,8 32,9 2,10 142.5,11 126.742,12 77,13 108,14 1527.03,15 207,16 6}
{0 CHEMBL384396,1 2,2 28,3 10,4 67,5 8,6 30,7 90.222,8 22,9 2,10 96,11 85.508,12 50,13 73,14 1046.42,15 140,16 6.706}
{0 CHEMBL384607,1 2,2 33,3 8,4 66,5 8,6 38,7 96.808,8 21,9 2,10 111,11 92.089,12 56,13 80,14 1127.5,15 146,16 7.004}
{0 CHEMBL384630,1 2,2 43,3 8,4 74,5 8,6 47,7 106.603,8 21,9 2,10 120.5,11 100.68,12 64,13 86,14 1203.64,15 160,16 6.45}
{0 CHEMBL384647,2 36,3 9,4 66,5 7,6 40,7 92.717,8 20,10 107.5,11 88.914,12 56,13 77,14 1051.34,15 143,16 9.1}
{0 CHEMBL384781,1 2,2 35,3 11,4 68,5 9,6 37,7 96.683,8 20,9 2,10 108,11 92.244,12 55,13 80,14 1137.49,15 148,16 6.921}
{0 CHEMBL384836,1 2,2 28,3 11,4 67,5 8,6 30,7 90.677,8 22,9 2,10 97,11 86.223,12 50,13 74,14 1062.42,15 141,16 7.25}
{0 CHEMBL384855,1 2,2 43,3 15,4 98,5 11,6 45,7 134.836,8 32,9 3,10 142,11 126.86,12 75,13 108,14 1640.92,15 206,16 6}
{0 CHEMBL385307,1 3,2 41,3 8,4 78,5 8,6 46,7 111.774,8 25,9 3,10 124,11 104.921,12 66,13 89,14 1263.77,15 167,16 7.456}
{0 CHEMBL385409,1 2,2 28,3 11,4 65,5 8,6 30,7 88.915,8 21,9 2,10 96,11 84.696,12 49,13 73,14 1048.39,15 138,16 7.986}
{0 CHEMBL385689,1 2,2 37,3 8,4 69,5 8,6 41,7 99.018,8 21,9 2,10 111.5,11 94.01,12 58,13 81,14 1145.53,15 150,16 7.161}
{0 CHEMBL385745,1 2,2 37,3 9,4 67,5 8,6 41,7 98.631,8 20,9 3,10 111.5,11 93.642,12 57,13 81,14 1163.95,15 148,16 6.633}
{0 CHEMBL385746,1 2,2 37,3 9,4 67,5 8,6 41,7 98.631,8 20,9 3,10 111.5,11 93.642,12 57,13 81,14 1163.95,15 148,16 7.854}
{0 CHEMBL385811,1 2,2 50,3 16,4 106,5 12,6 52,7 143.922,8 33,9 2,10 156,11 136.859,12 83,13 117,14 1648.19,15 223,16 6}
{0 CHEMBL386023,1 2,2 43,3 15,4 96,5 11,6 45,7 129.41,8 31,9 2,10 139,11 122.995,12 74,13 105,14 1485.98,15 201,16 6}
{0 CHEMBL386676,1 2,2 28,3 11,4 67,5 8,6 30,7 90.677,8 22,9 2,10 97,11 86.223,12 50,13 74,14 1062.42,15 141,16 7.397}
{0 CHEMBL386784,1 2,2 35,3 12,4 73,5 9,6 37,7 101.416,8 23,9 2,10 111,11 96.518,12 58,13 83,14 1180.56,15 156,16 8.721}
{0 CHEMBL386909,1 2,2 28,3 10,4 68,5 8,6 30,7 91.228,8 22,9 2,10 97,11 86.529,12 50,13 74,14 1061.44,15 142,16 8.796}
{0 CHEMBL386922,1 2,2 43,3 16,4 95,5 11,6 45,7 132.524,8 31,9 3,10 141,11 125.026,12 74,13 107,14 1627.87,15 202,16 5}
{0 CHEMBL386995,1 2,2 35,3 11,4 67,5 9,6 37,7 95.677,8 20,9 2,10 107,11 91.223,12 55,13 79,14 1122.47,15 146,16 6.337}
{0 CHEMBL387005,1 2,2 38,3 15,4 99,5 12,6 40,7 133.842,8 35,9 3,10 139,11 125.881,12 73,13 107,14 1631.92,15 206,16 6}
{0 CHEMBL387198,1 2,2 39,3 18,4 100,5 13,6 41,7 133.546,8 35,9 2,10 143,11 127.709,12 74,13 110,14 1566.04,15 210,16 6}
{0 CHEMBL387458,1 2,2 36,3 11,4 69,5 8,6 37,7 97.188,8 21,9 2,10 106.5,11 92.234,12 57,13 79,14 1120.49,15 148,16 6.447}
{0 CHEMBL388069,2 16,3 2,4 30,5 2,6 18,7 39.83,8 9,10 44,11 37.364,12 25,13 31,14 418.59,15 61,16 6}
{0 CHEMBL391951,2 13,3 3,4 29,6 16,7 37.279,8 10,10 40,11 35.057,12 23,13 29,14 395.55,15 58,16 5}
{0 CHEMBL393333,2 13,3 3,4 31,6 16,7 40.04,8 12,10 43,11 37.584,12 25,13 31,14 421.59,15 62,16 5}
{0 CHEMBL393436,2 13,3 2,4 24,6 16,7 33.239,8 8,10 38,11 31.672,12 21,13 27,14 369.48,15 51,16 5}
{0 CHEMBL393718,1 1,2 13,3 5,4 28,5 2,6 18,7 39.08,8 9,9 1,10 45,11 37.168,12 22,13 32,14 460.61,15 60,16 5}
{0 CHEMBL404819,1 2,2 44,3 16,4 110,5 12,6 46,7 143.444,8 37,9 2,10 150,11 135.913,12 81,13 115,14 1628.21,15 225,16 6}
{0 CHEMBL404947,1 2,2 34,3 10,4 68,5 8,6 36,7 94.978,8 21,9 2,10 104,11 90.013,12 55,13 77,14 1093.47,15 145,16 7.569}
{0 CHEMBL405211,1 2,2 35,3 12,4 73,5 9,6 37,7 101.416,8 23,9 2,10 111,11 96.518,12 58,13 83,14 1180.56,15 156,16 7.337}
{0 CHEMBL405222,1 2,2 40,3 10,4 72,5 8,6 42,7 102.501,8 21,9 2,10 114,11 97.067,12 61,13 83,14 1169.57,15 155,16 5}
{0 CHEMBL405421,1 2,2 28,3 10,4 67,5 8,6 30,7 90.222,8 22,9 2,10 96,11 85.508,12 50,13 73,14 1046.42,15 140,16 8.983}
{0 CHEMBL405502,1 3,2 43,3 8,4 75,5 9,6 47,7 109.007,8 22,9 3,10 123,11 102.373,12 65,13 87,14 1234.72,15 162,16 6.379}
{0 CHEMBL405561,1 2,2 28,3 11,4 67,5 8,6 30,7 90.677,8 22,9 2,10 97,11 86.223,12 50,13 74,14 1062.42,15 141,16 8.048}
{0 CHEMBL405735,1 2,2 34,3 11,4 67,5 8,6 36,7 94.677,8 20,9 2,10 105,11 90.223,12 54,13 78,14 1110.46,15 145,16 6.77}
{0 CHEMBL405784,1 2,2 52,3 17,4 106,5 12,6 53,7 145.126,8 33,9 2,10 157.5,11 138.058,12 85,13 118,14 1660.19,15 224,16 6}
{0 CHEMBL405921,2 18,3 7,4 47,5 4,6 20,7 60.199,8 18,10 64,11 57.173,12 36,13 48,14 661.88,15 95,16 7.444}
{0 CHEMBL406000,2 37,3 10,4 74,5 9,6 41,7 100.217,8 23,10 113,11 95.736,12 60,13 82,14 1123.46,15 156,16 8.523}
{0 CHEMBL406051,1 2,2 36,3 9,4 69,5 8,6 40,7 97.529,8 21,9 2,10 109,11 92.32,12 57,13 79,14 1116.51,15 148,16 8.886}
{0 CHEMBL406095,1 2,2 46,3 18,4 105,5 14,6 48,7 143.075,8 35,9 2,10 156,11 136.784,12 81,13 118,14 1669.17,15 223,16 6}
{0 CHEMBL406152,1 2,2 33,3 8,4 66,5 8,6 36,7 94.194,8 21,9 2,10 105,11 89.866,12 54,13 78,14 1113.46,15 144,16 6.932}
{0 CHEMBL406197,1 2,2 43,3 15,4 99,5 11,6 45,7 132.177,8 32,9 2,10 141,11 125.543,12 75,13 107,14 1515.03,15 206,16 6}
{0 CHEMBL406260,1 2,2 37,3 8,4 70,5 8,6 41,7 99.08,8 21,9 2,10 110.5,11 93.627,12 58,13 80,14 1127.54,15 150,16 6.91}
{0 CHEMBL406273,1 2,2 47,3 10,4 83,5 9,6 52,7 118.564,8 24,9 2,10 134.5,11 112.238,12 71,13 96,14 1342.81,15 179,16 8.076}
{0 CHEMBL406373,1 2,2 36,3 10,4 68,5 8,6 37,7 99.393,8 21,9 3,10 106.5,11 92.836,12 57,13 79,14 1230.38,15 147,16 7.585}
{0 CHEMBL406374,1 2,2 41,3 12,4 77,5 9,6 43,7 108.938,8 23,9 2,10 121,11 103.572,12 64,13 89,14 1256.66,15 166,16 7.319}
{0 CHEMBL406455,1 2,2 35,3 11,4 67,5 9,6 37,7 95.677,8 20,9 2,10 107,11 91.223,12 55,13 79,14 1122.47,15 146,16 6}
{0 CHEMBL406491,1 2,2 31,3 8,4 65,5 8,6 35,7 92.438,8 21,9 2,10 103.5,11 88.361,12 52,13 77,14 1102.44,15 142,16 6.754}
{0 CHEMBL406559,1 2,2 45,3 15,4 99,5 11,6 46,7 132.927,8 32,9 2,10 141.5,11 126.027,12 77,13 107,14 1511.03,15 206,16 6}
{0 CHEMBL406738,1 2,2 41,3 8,4 76,5 8,6 46,7 107.365,8 23,9 2,10 120,11 101.207,12 64,13 86,14 1205.66,15 162,16 7.119}
{0 CHEMBL406769,1 2,2 42,3 13,4 79,5 10,6 44,7 112.404,8 23,9 2,10 126,11 107.329,12 65,13 93,14 1314.71,15 172,16 7.538}
{0 CHEMBL406771,1 2,2 45,3 17,4 102,5 13,6 47,7 138.853,8 34,9 2,10 151,11 132.521,12 79,13 114,14 1612.11,15 216,16 6}
{0 CHEMBL406815,1 2,2 35,3 12,4 71,5 9,6 37,7 99.654,8 22,9 2,10 110,11 94.991,12 57,13 82,14 1166.53,15 153,16 7.244}
{0 CHEMBL406816,1 2,2 34,3 10,4 66,5 8,6 36,7 93.217,8 20,9 2,10 103,11 88.487,12 54,13 76,14 1079.44,15 142,16 6.886}
{0 CHEMBL406829,1 2,2 34,3 10,4 66,5 8,6 36,7 93.217,8 20,9 2,10 103,11 88.487,12 54,13 76,14 1079.44,15 142,16 6.886}
{0 CHEMBL406951,1 2,2 36,3 9,4 70,5 8,6 40,7 98.535,8 21,9 2,10 110,11 93.341,12 57,13 80,14 1131.53,15 150,16 8.284}
{0 CHEMBL407014,1 2,2 40,3 18,4 103,5 14,6 42,7 136.314,8 35,9 2,10 145,11 130.257,12 75,13 112,14 1595.09,15 215,16 9.9}
{0 CHEMBL407025,1 2,2 34,3 11,4 66,5 8,6 36,7 93.671,8 20,9 2,10 104,11 89.201,12 54,13 77,14 1095.44,15 143,16 7.81}
{0 CHEMBL407027,1 2,2 45,3 17,4 102,5 13,6 47,7 138.853,8 34,9 2,10 151,11 132.521,12 79,13 114,14 1612.11,15 216,16 6}
{0 CHEMBL407051,1 2,2 43,3 16,4 97,5 11,6 45,7 134.285,8 32,9 3,10 142,11 126.553,12 75,13 108,14 1641.9,15 205,16 6}
{0 CHEMBL407120,1 2,2 43,3 16,4 96,5 11,6 45,7 129.865,8 31,9 2,10 140,11 123.709,12 74,13 106,14 1501.98,15 202,16 5}
{0 CHEMBL407125,1 2,2 45,3 15,4 99,5 11,6 46,7 132.927,8 32,9 2,10 141.5,11 126.027,12 77,13 107,14 1511.03,15 206,16 6}
{0 CHEMBL407181,1 2,2 41,3 8,4 72,5 8,6 46,7 103.842,8 21,9 2,10 118,11 98.153,12 62,13 84,14 1177.6,15 156,16 7.12}
{0 CHEMBL407195,1 2,2 33,3 8,4 66,5 8,6 36,7 94.194,8 21,9 2,10 105,11 89.866,12 54,13 78,14 1113.46,15 144,16 7.699}
{0 CHEMBL407209,1 2,2 28,3 10,4 67,5 8,6 30,7 90.222,8 22,9 2,10 96,11 85.508,12 50,13 73,14 1046.42,15 140,16 7.629}
{0 CHEMBL407297,1 2,2 45,3 17,4 102,5 13,6 47,7 137.853,8 33,9 2,10 149,11 131.521,12 78,13 113,14 1600.1,15 215,16 6}
{0 CHEMBL407436,1 2,2 35,3 11,4 68,5 9,6 37,7 96.683,8 20,9 2,10 108,11 92.244,12 55,13 80,14 1137.49,15 148,16 6}
{0 CHEMBL407459,2 26,3 8,4 54,5 6,6 28,7 73.194,8 18,10 82,11 70.006,12 44,13 60,14 823.06,15 114,16 9.7}
{0 CHEMBL407496,1 2,2 31,3 8,4 65,5 8,6 35,7 92.438,8 21,9 2,10 103.5,11 88.361,12 52,13 77,14 1102.44,15 142,16 7.509}
{0 CHEMBL407571,1 2,2 28,3 10,4 67,5 8,6 30,7 90.222,8 22,9 2,10 96,11 85.508,12 50,13 73,14 1046.42,15 140,16 8.987}
{0 CHEMBL407581,1 2,2 34,3 11,4 66,5 8,6 36,7 93.671,8 20,9 2,10 104,11 89.201,12 54,13 77,14 1095.44,15 143,16 7.59}
{0 CHEMBL407643,1 2,2 33,3 20,4 98,5 13,6 35,7 128.444,8 37,9 2,10 135,11 123.095,12 70,13 106,14 1519.96,15 204,16 8.5}
{0 CHEMBL407649,1 2,2 36,3 10,4 68,5 8,6 37,7 99.393,8 21,9 3,10 106.5,11 92.836,12 57,13 79,14 1230.38,15 147,16 6.172}
{0 CHEMBL407676,1 2,2 28,3 10,4 67,5 8,6 30,7 93.887,8 22,9 3,10 98,11 87.846,12 50,13 75,14 1187.33,15 142,16 8.854}
{0 CHEMBL407858,1 2,2 43,3 15,4 96,5 11,6 45,7 129.41,8 31,9 2,10 139,11 122.995,12 74,13 105,14 1485.98,15 201,16 5}
{0 CHEMBL408164,1 2,2 31,3 8,4 70,5 7,6 34,7 93.83,8 23,9 2,10 99.5,11 88.111,12 54,13 74,14 1051.48,15 144,16 6.362}
{0 CHEMBL408236,1 3,2 33,3 8,4 72,5 8,6 36,7 103.967,8 25,9 5,10 111,11 97.522,12 58,13 83,14 1232.53,15 155,16 7.721}
{0 CHEMBL408338,1 2,2 39,3 17,4 98,5 13,6 41,7 130.331,8 33,9 2,10 139,11 124.467,12 72,13 107,14 1524,15 205,16 7.367}
{0 CHEMBL408347,1 2,2 37,3 9,4 67,5 8,6 41,7 98.631,8 20,9 3,10 111.5,11 93.642,12 57,13 81,14 1163.95,15 148,16 7.921}
{0 CHEMBL408350,1 2,2 31,3 18,4 92,5 11,6 33,7 120.251,8 34,9 2,10 126,11 115.085,12 65,13 99,14 1421.85,15 191,16 7.854}
{0 CHEMBL408362,1 2,2 41,3 19,4 104,5 15,6 43,7 138.774,8 35,9 2,10 149,11 132.993,12 76,13 115,14 1638.12,15 219,16 10.398}
{0 CHEMBL408471,1 2,2 36,3 9,4 67,5 8,6 40,7 95.768,8 20,9 2,10 108,11 90.793,12 56,13 78,14 1102.48,15 145,16 7.542}
{0 CHEMBL408611,1 2,2 45,3 15,4 99,5 11,6 46,7 132.927,8 32,9 2,10 141.5,11 126.027,12 77,13 107,14 1511.03,15 206,16 6}
{0 CHEMBL408654,1 2,2 44,3 17,4 97,5 12,6 46,7 132.325,8 31,9 2,10 144,11 126.446,12 75,13 109,14 1545.01,15 206,16 5}
{0 CHEMBL408752,1 2,2 28,3 10,4 65,5 8,6 30,7 88.461,8 21,9 2,10 95,11 83.981,12 49,13 72,14 1032.39,15 137,16 9.824}
{0 CHEMBL408787,1 2,2 46,3 9,4 77,5 8,6 48,7 110.575,8 21,9 2,10 124,11 104.427,12 67,13 89,14 1244.69,15 166,16 7.796}
{0 CHEMBL408825,1 2,2 45,3 15,4 97,5 11,6 46,7 131.166,8 31,9 2,10 140.5,11 124.5,12 76,13 106,14 1497,15 203,16 6}
{0 CHEMBL408828,2 39,3 9,4 72,5 7,6 41,7 98.751,8 22,10 111,11 93.978,12 61,13 80,14 1089.43,15 152,16 9.3}
{0 CHEMBL408987,1 2,2 41,3 8,4 66,5 8,6 46,7 98.558,8 18,9 2,10 115,11 93.573,12 59,13 81,14 1135.51,15 147,16 6.788}
{0 CHEMBL409019,1 2,2 28,3 10,4 67,5 8,6 30,7 90.222,8 22,9 2,10 96,11 85.508,12 50,13 73,14 1046.42,15 140,16 7.25}
{0 CHEMBL409071,1 2,2 34,3 11,4 66,5 8,6 36,7 93.671,8 20,9 2,10 104,11 89.201,12 54,13 77,14 1095.44,15 143,16 7.367}
{0 CHEMBL409100,1 2,2 39,3 17,4 98,5 13,6 41,7 130.331,8 33,9 2,10 139,11 124.467,12 72,13 107,14 1524,15 205,16 7.372}
{0 CHEMBL409120,1 2,2 45,3 17,4 110,5 13,6 47,7 145.899,8 38,9 2,10 155,11 138.628,12 83,13 118,14 1668.23,15 228,16 6}
{0 CHEMBL409487,1 2,2 40,3 11,4 72,5 8,6 42,7 102.955,8 21,9 2,10 115,11 97.782,12 61,13 84,14 1185.57,15 156,16 6}
{0 CHEMBL409653,1 2,2 46,3 18,4 134,5 14,6 48,7 167.99,8 47,9 2,10 170,11 158.696,12 93,13 133,14 1884.61,15 267,16 6}
{0 CHEMBL409747,1 2,2 45,3 17,4 108,5 13,6 47,7 144.137,8 37,9 2,10 154,11 137.101,12 82,13 117,14 1654.2,15 225,16 6}
{0 CHEMBL409754,1 2,2 37,3 9,4 70,5 8,6 41,7 99.535,8 21,9 2,10 111.5,11 94.341,12 58,13 81,14 1143.54,15 151,16 7.452}
{0 CHEMBL409775,1 2,2 28,3 10,4 62,5 8,6 30,7 85.694,8 20,9 2,10 93,11 81.433,12 48,13 70,14 1003.34,15 132,16 6.093}
{0 CHEMBL409952,1 2,2 38,3 15,4 98,5 12,6 40,7 129.422,8 34,9 2,10 137,11 123.037,12 72,13 105,14 1492,15 203,16 6}
{0 CHEMBL409973,1 2,2 44,3 15,4 99,5 11,6 46,7 133.177,8 32,9 2,10 142.5,11 126.543,12 76,13 108,14 1527.04,15 207,16 6}
{0 CHEMBL410047,1 2,2 37,3 14,4 79,5 11,6 39,7 109.859,8 25,9 2,10 121,11 105.044,12 62,13 91,14 1294.68,15 170,16 8.301}
{0 CHEMBL410048,1 2,2 46,3 16,4 98,5 12,6 47,7 137.291,8 31,9 3,10 146.5,11 129.574,12 77,13 111,14 1680.94,15 209,16 6}
{0 CHEMBL410110,1 2,2 29,3 11,4 64,5 9,6 31,7 96.239,8 21,9 4,10 101,11 89.351,12 50,13 77,14 1327.2,15 141,16 8.721}
{0 CHEMBL410144,1 2,2 48,3 18,4 135,5 14,6 49,7 169.746,8 47,9 2,10 171.5,11 160.202,12 95,13 134,14 1895.63,15 269,16 6}
{0 CHEMBL410181,1 2,2 41,3 8,4 74,5 8,6 46,7 105.603,8 22,9 2,10 119,11 99.68,12 63,13 85,14 1191.63,15 159,16 6.265}
{0 CHEMBL410184,1 2,2 36,3 10,4 68,5 8,6 37,7 99.393,8 21,9 3,10 106.5,11 92.836,12 57,13 79,14 1230.38,15 147,16 6}
{0 CHEMBL410194,1 2,2 33,3 21,4 98,5 13,6 35,7 128.899,8 37,9 2,10 136,11 123.81,12 70,13 107,14 1535.96,15 205,16 8.9}
{0 CHEMBL410205,1 2,2 43,3 10,4 79,5 9,6 47,7 112.041,8 23,9 2,10 126,11 106.185,12 66,13 91,14 1278.72,15 170,16 7.893}
{0 CHEMBL410372,1 2,2 41,3 12,4 75,5 9,6 43,7 107.177,8 22,9 2,10 120,11 102.045,12 63,13 88,14 1242.63,15 163,16 6.747}
{0 CHEMBL410428,1 2,2 45,3 15,4 97,5 11,6 46,7 131.166,8 31,9 2,10 140.5,11 124.5,12 76,13 106,14 1497,15 203,16 6}
{0 CHEMBL410599,1 2,2 42,3 13,4 77,5 10,6 44,7 110.643,8 22,9 2,10 125,11 105.802,12 64,13 92,14 1300.68,15 169,16 6.26}
{0 CHEMBL410600,1 2,2 36,3 10,4 67,5 8,6 37,7 94.972,8 20,9 2,10 104.5,11 89.992,12 56,13 77,14 1090.46,15 144,16 6.762}
{0 CHEMBL410617,1 2,2 35,3 12,4 70,5 9,6 37,7 102.313,8 22,9 3,10 111,11 96.308,12 57,13 83,14 1292.42,15 153,16 6}
{0 CHEMBL410769,1 2,2 41,3 19,4 106,5 15,6 43,7 140.535,8 36,9 2,10 150,11 134.52,12 77,13 116,14 1652.15,15 222,16 9.8}
{0 CHEMBL410824,1 2,2 39,3 17,4 96,5 13,6 41,7 128.569,8 32,9 2,10 138,11 122.94,12 71,13 106,14 1509.97,15 202,16 9.481}
{0 CHEMBL410998,1 2,2 43,3 15,4 106,5 11,6 45,7 138.217,8 36,9 2,10 144,11 130.629,12 79,13 110,14 1556.13,15 216,16 5}
{0 CHEMBL411001,1 2,2 38,3 15,4 101,5 12,6 40,7 135.603,8 36,9 3,10 140,11 127.408,12 74,13 108,14 1645.95,15 209,16 6}
{0 CHEMBL411002,1 2,2 50,3 17,4 105,5 12,6 52,7 143.37,8 33,9 2,10 156,11 136.553,12 83,13 117,14 1649.17,15 222,16 6}
{0 CHEMBL411017,1 2,2 28,3 11,4 67,5 8,6 30,7 90.677,8 22,9 2,10 97,11 86.223,12 50,13 74,14 1062.42,15 141,16 7.846}
{0 CHEMBL411109,1 2,2 46,3 18,4 107,5 14,6 48,7 144.836,8 36,9 2,10 157,11 138.31,12 82,13 119,14 1683.2,15 226,16 6}
{0 CHEMBL411347,1 2,2 35,3 11,4 67,5 9,6 37,7 95.677,8 20,9 2,10 107,11 91.223,12 55,13 79,14 1122.47,15 146,16 6}
{0 CHEMBL411376,1 2,2 33,3 19,4 99,5 15,6 33,7 128.245,8 35,9 2,10 133,11 122.918,12 68,13 106,14 1522.98,15 205,16 6}
{0 CHEMBL411411,1 2,2 39,3 18,4 100,5 13,6 41,7 133.546,8 35,9 2,10 143,11 127.709,12 74,13 110,14 1566.04,15 210,16 6}
{0 CHEMBL411418,1 2,2 41,3 19,4 97,5 15,6 43,7 132.484,8 32,9 2,10 145,11 127.391,12 73,13 111,14 1581.01,15 208,16 9.3}
{0 CHEMBL411551,2 39,3 9,4 66,5 7,6 41,7 93.467,8 19,10 108,11 89.398,12 58,13 77,14 1047.34,15 143,16 9}
{0 CHEMBL411556,1 2,2 31,3 8,4 65,5 8,6 35,7 92.438,8 21,9 2,10 103.5,11 88.361,12 52,13 77,14 1102.44,15 142,16 6.987}
{0 CHEMBL411600,1 2,2 38,3 15,4 103,5 12,6 40,7 137.365,8 37,9 3,10 141,11 128.935,12 75,13 109,14 1659.98,15 212,16 6}
{0 CHEMBL411860,1 2,2 43,3 16,4 98,5 11,6 45,7 131.626,8 32,9 2,10 141,11 125.236,12 75,13 107,14 1516.01,15 205,16 6}
{0 CHEMBL412029,1 2,2 30,3 12,4 68,5 10,6 32,7 94.387,8 21,9 2,10 104,11 90.475,12 51,13 79,14 1133.47,15 147,16 8.125}
{0 CHEMBL412160,1 2,2 42,3 13,4 85,5 10,6 44,7 117.688,8 26,9 2,10 129,11 111.91,12 68,13 96,14 1356.8,15 181,16 6.886}
{0 CHEMBL412183,1 2,2 35,3 12,4 68,5 9,6 37,7 97.137,8 20,9 2,10 109,11 92.959,12 55,13 81,14 1153.49,15 149,16 6}
{0 CHEMBL412455,1 2,2 28,3 10,4 62,5 8,6 30,7 85.694,8 20,9 2,10 93,11 81.433,12 48,13 70,14 1003.34,15 132,16 6.738}
{0 CHEMBL412466,1 2,2 28,3 10,4 67,5 8,6 30,7 90.222,8 22,9 2,10 96,11 85.508,12 50,13 73,14 1046.42,15 140,16 8.735}
{0 CHEMBL412473,1 2,2 45,3 17,4 122,5 13,6 47,7 155.717,8 42,9 2,10 160,11 147.305,12 87,13 124,14 1756.41,15 246,16 6}
{0 CHEMBL412508,1 2,2 46,3 18,4 109,5 14,6 48,7 146.598,8 37,9 2,10 158,11 139.837,12 83,13 120,14 1697.23,15 229,16 6}
{0 CHEMBL412509,1 2,2 40,3 11,4 72,5 8,6 42,7 102.955,8 21,9 2,10 115,11 97.782,12 61,13 84,14 1185.57,15 156,16 6}
{0 CHEMBL412561,1 2,2 33,3 8,4 66,5 8,6 36,7 94.194,8 21,9 2,10 105,11 89.866,12 54,13 78,14 1113.46,15 144,16 6.975}
{0 CHEMBL412624,1 2,2 48,3 14,4 88,5 10,6 50,7 124.66,8 26,9 2,10 139,11 118.657,12 74,13 102,14 1433.88,15 190,16 5}
{0 CHEMBL412629,1 2,2 45,3 15,4 93,5 11,6 46,7 127.643,8 29,9 2,10 138.5,11 121.446,12 74,13 104,14 1468.94,15 197,16 6.255}
{0 CHEMBL412690,1 2,2 42,3 13,4 85,5 10,6 44,7 117.688,8 26,9 2,10 129,11 111.91,12 68,13 96,14 1356.8,15 181,16 7.921}
{0 CHEMBL412859,1 2,2 43,3 8,4 74,5 8,6 47,7 106.603,8 21,9 2,10 120.5,11 100.68,12 64,13 86,14 1203.64,15 160,16 7.432}
{0 CHEMBL413171,1 2,2 33,3 8,4 58,5 8,6 36,7 93.694,8 21,9 2,10 113,11 92.933,12 54,13 86,14 1257.38,15 144,16 6.199}
{0 CHEMBL413250,2 39,3 8,4 67,5 7,6 41,7 92.768,8 19,10 105,11 88.188,12 58,13 75,14 1018.34,15 142,16 7.53}
{0 CHEMBL413373,1 2,2 28,3 11,4 67,5 8,6 30,7 90.677,8 22,9 2,10 97,11 86.223,12 50,13 74,14 1062.42,15 141,16 8.011}
{0 CHEMBL413378,1 2,2 45,3 17,4 96,5 13,6 48,7 132.319,8 31,9 2,10 145.5,11 126.424,12 76,13 109,14 1542,15 205,16 6}
{0 CHEMBL413413,1 2,2 45,3 17,4 110,5 13,6 47,7 145.899,8 38,9 2,10 155,11 138.628,12 83,13 118,14 1668.23,15 228,16 6}
{0 CHEMBL413419,1 2,2 43,3 15,4 96,5 11,6 45,7 133.075,8 31,9 3,10 141,11 125.333,12 74,13 107,14 1626.89,15 203,16 6}
{0 CHEMBL413441,1 2,2 51,3 18,4 106,5 13,6 53,7 145.831,8 33,9 2,10 160,11 139.289,12 84,13 120,14 1692.2,15 226,16 5}
{0 CHEMBL413442,1 2,2 43,3 15,4 98,5 11,6 45,7 131.172,8 32,9 2,10 140,11 124.521,12 75,13 106,14 1500.01,15 204,16 6}
{0 CHEMBL413511,1 2,2 41,3 19,4 104,5 15,6 43,7 138.774,8 35,9 2,10 149,11 132.993,12 76,13 115,14 1638.12,15 219,16 9.699}
{0 CHEMBL413535,2 26,3 7,4 56,5 6,6 28,7 73.501,8 18,10 80,11 69.818,12 44,13 59,14 809.08,15 115,16 8.108}
{0 CHEMBL413617,1 2,2 36,3 11,4 67,5 8,6 37,7 95.427,8 20,9 2,10 105.5,11 90.707,12 56,13 78,14 1106.46,15 145,16 7.244}
{0 CHEMBL413651,1 2,2 27,3 10,4 64,5 8,6 30,7 87.705,8 21,9 2,10 95,11 83.476,12 48,13 72,14 1033.38,15 136,16 6.247}
{0 CHEMBL413709,1 2,2 42,3 9,4 72,5 8,6 46,7 107.711,8 21,9 3,10 120,11 100.69,12 63,13 86,14 1318.5,15 158,16 6.712}
{0 CHEMBL413735,1 2,2 36,3 9,4 72,5 8,6 40,7 100.296,8 22,9 2,10 111,11 94.868,12 58,13 81,14 1145.56,15 153,16 8.387}
{0 CHEMBL413741,2 38,3 8,4 62,5 6,6 40,7 88.239,8 18,10 102,11 84.113,12 56,13 72,14 975.26,15 134,16 9.1}
{0 CHEMBL413830,1 2,2 28,3 11,4 67,5 8,6 30,7 90.677,8 22,9 2,10 97,11 86.223,12 50,13 74,14 1062.42,15 141,16 7.582}
{0 CHEMBL413888,1 2,2 45,3 17,4 106,5 13,6 47,7 142.376,8 36,9 2,10 153,11 135.574,12 81,13 116,14 1640.17,15 222,16 6}
{0 CHEMBL413924,1 2,2 45,3 17,4 108,5 13,6 47,7 144.137,8 37,9 2,10 154,11 137.101,12 82,13 117,14 1654.2,15 225,16 6}
{0 CHEMBL414100,1 2,2 38,3 15,4 100,5 12,6 40,7 131.183,8 35,9 2,10 138,11 124.564,12 73,13 106,14 1506.03,15 206,16 6}
{0 CHEMBL414102,1 2,2 39,3 18,4 100,5 13,6 41,7 133.546,8 35,9 2,10 143,11 127.709,12 74,13 110,14 1566.04,15 210,16 6}
{0 CHEMBL414116,1 2,2 41,3 8,4 68,5 8,6 46,7 100.319,8 19,9 2,10 116,11 95.1,12 60,13 82,14 1149.54,15 150,16 6.693}
{0 CHEMBL414152,1 2,2 32,3 10,4 69,5 8,6 35,7 94.984,8 22,9 2,10 103.5,11 90.035,12 54,13 77,14 1096.48,15 146,16 9.3}
{0 CHEMBL414272,1 2,2 36,3 11,4 69,5 8,6 37,7 97.188,8 21,9 2,10 106.5,11 92.234,12 57,13 79,14 1120.49,15 148,16 6.47}
{0 CHEMBL414316,1 2,2 29,3 11,4 66,5 9,6 31,7 90.921,8 21,9 2,10 99,11 86.717,12 50,13 75,14 1075.42,15 141,16 7.959}
{0 CHEMBL414336,1 2,2 28,3 10,4 62,5 8,6 30,7 85.694,8 20,9 2,10 93,11 81.433,12 48,13 70,14 1003.34,15 132,16 6.738}
{0 CHEMBL414386,1 2,2 41,3 8,4 72,5 8,6 46,7 103.842,8 21,9 2,10 118,11 98.153,12 62,13 84,14 1177.6,15 156,16 7.092}
{0 CHEMBL414446,1 2,2 36,3 10,4 68,5 8,6 37,7 99.393,8 21,9 3,10 106.5,11 92.836,12 57,13 79,14 1230.38,15 147,16 7.658}
{0 CHEMBL414544,1 2,2 36,3 11,4 69,5 8,6 37,7 97.188,8 21,9 2,10 106.5,11 92.234,12 57,13 79,14 1120.49,15 148,16 6}
{0 CHEMBL414571,1 2,2 43,3 15,4 96,5 11,6 45,7 129.41,8 31,9 2,10 139,11 122.995,12 74,13 105,14 1485.98,15 201,16 5}
{0 CHEMBL414598,1 2,2 31,3 8,4 57,5 8,6 35,7 91.938,8 21,9 2,10 111.5,11 91.427,12 52,13 85,14 1246.36,15 142,16 6.196}
{0 CHEMBL414692,1 2,2 50,3 17,4 107,5 12,6 52,7 145.132,8 34,9 2,10 157,11 138.08,12 84,13 118,14 1663.2,15 225,16 6}
{0 CHEMBL414716,1 2,2 43,3 15,4 98,5 11,6 45,7 131.172,8 32,9 2,10 140,11 124.521,12 75,13 106,14 1500.01,15 204,16 6}
{0 CHEMBL414717,1 2,2 43,3 15,4 97,5 11,6 45,7 130.416,8 31,9 2,10 140,11 124.016,12 74,13 106,14 1501,15 203,16 6}
{0 CHEMBL414749,1 2,2 51,3 18,4 106,5 13,6 53,7 145.831,8 33,9 2,10 160,11 139.289,12 84,13 120,14 1692.2,15 226,16 5}
{0 CHEMBL414916,1 2,2 36,3 11,4 67,5 8,6 37,7 95.427,8 20,9 2,10 105.5,11 90.707,12 56,13 78,14 1106.46,15 145,16 7.62}
{0 CHEMBL414951,1 2,2 41,3 18,4 104,5 15,6 43,7 138.319,8 35,9 2,10 148,11 132.278,12 76,13 114,14 1622.12,15 218,16 10.1}
{0 CHEMBL415075,1 2,2 41,3 19,4 97,5 15,6 43,7 132.484,8 32,9 2,10 145,11 127.391,12 73,13 111,14 1581.01,15 208,16 6}
{0 CHEMBL415143,1 2,2 45,3 15,4 99,5 11,6 46,7 132.927,8 32,9 2,10 141.5,11 126.027,12 77,13 107,14 1511.03,15 206,16 6}
{0 CHEMBL415144,1 2,2 50,3 16,4 107,5 12,6 52,7 148.342,8 34,9 3,10 158,11 139.703,12 84,13 119,14 1788.11,15 226,16 6}
{0 CHEMBL415201,1 2,2 37,3 8,4 69,5 8,6 41,7 99.018,8 21,9 2,10 111.5,11 94.01,12 58,13 81,14 1145.53,15 150,16 7.456}
{0 CHEMBL415340,1 2,2 32,3 10,4 69,5 8,6 35,7 94.984,8 22,9 2,10 103.5,11 90.035,12 54,13 77,14 1096.48,15 146,16 6.928}
{0 CHEMBL415359,1 2,2 43,3 12,4 79,5 9,6 44,7 111.7,8 23,9 2,10 123.5,11 106.098,12 66,13 91,14 1282.7,15 170,16 6.69}
{0 CHEMBL415409,1 3,2 40,3 8,4 79,5 9,6 46,7 111.779,8 25,9 3,10 124.5,11 104.942,12 65,13 89,14 1266.78,15 168,16 7.076}
{0 CHEMBL415582,1 2,2 36,3 11,4 69,5 8,6 37,7 97.188,8 21,9 2,10 106.5,11 92.234,12 57,13 79,14 1120.49,15 148,16 7.921}
{0 CHEMBL415585,1 2,2 36,3 11,4 69,5 8,6 37,7 97.188,8 21,9 2,10 106.5,11 92.234,12 57,13 79,14 1120.49,15 148,16 7.796}
{0 CHEMBL415800,2 54,3 9,4 82,5 8,6 58,7 118.422,8 21,9 1,10 137,11 112.461,12 75,13 96,14 1317.13,15 178,16 6}
{0 CHEMBL415823,1 2,2 28,3 10,4 65,5 8,6 30,7 88.461,8 21,9 2,10 95,11 83.981,12 49,13 72,14 1032.39,15 137,16 6.738}
{0 CHEMBL420948,2 19,3 6,4 51,5 5,6 21,7 62.518,8 17,10 64,11 59.028,12 36,13 49,14 677.94,15 100,16 4}
{0 CHEMBL421362,2 26,3 7,4 54,5 6,6 28,7 72.739,8 18,10 81,11 69.291,12 44,13 59,14 807.06,15 113,16 8.292}
{0 CHEMBL425090,1 2,2 34,3 10,4 66,5 8,6 36,7 93.217,8 20,9 2,10 103,11 88.487,12 54,13 76,14 1079.44,15 142,16 7.387}
{0 CHEMBL425465,1 2,2 43,3 15,4 98,5 11,6 45,7 131.172,8 32,9 2,10 140,11 124.521,12 75,13 106,14 1500.01,15 204,16 6}
{0 CHEMBL425973,2 69,3 21,4 151,5 17,6 73,7 199.155,8 50,10 217,11 189.702,12 119,13 161,14 2211.91,15 312,16 6}
{0 CHEMBL426072,1 1,2 20,4 25,6 26,7 39.29,8 5,9 1,10 48,11 36.562,12 25,13 31,14 427.62,15 56,16 6.194}
{0 CHEMBL426519,1 2,2 28,3 10,4 71,5 8,6 30,7 93.745,8 24,9 2,10 98,11 88.562,12 52,13 75,14 1074.48,15 146,16 5.594}
{0 CHEMBL426698,1 2,2 43,3 15,4 98,5 11,6 45,7 131.172,8 32,9 2,10 140,11 124.521,12 75,13 106,14 1500.01,15 204,16 6}
{0 CHEMBL427658,1 2,2 45,3 15,4 99,5 11,6 46,7 132.927,8 32,9 2,10 141.5,11 126.027,12 77,13 107,14 1511.03,15 206,16 6}
{0 CHEMBL427663,2 39,3 8,4 65,5 7,6 41,7 91.007,8 18,10 104,11 86.661,12 57,13 74,14 1004.31,15 139,16 8.343}
{0 CHEMBL427793,1 2,2 35,3 12,4 71,5 9,6 37,7 99.654,8 22,9 2,10 110,11 94.991,12 57,13 82,14 1166.53,15 153,16 6.206}
{0 CHEMBL428281,1 2,2 36,3 11,4 69,5 8,6 37,7 97.188,8 21,9 2,10 106.5,11 92.234,12 57,13 79,14 1120.49,15 148,16 7.921}
{0 CHEMBL428295,1 2,2 46,3 17,4 98,5 12,6 47,7 134.081,8 31,9 2,10 145.5,11 127.951,12 77,13 110,14 1556.03,15 208,16 6}
{0 CHEMBL428799,1 2,2 51,3 18,4 105,5 13,6 53,7 148.49,8 33,9 3,10 161,11 140.606,12 84,13 121,14 1818.09,15 226,16 6}
{0 CHEMBL429000,1 2,2 36,3 7,4 70,5 7,6 40,7 98.319,8 22,9 2,10 108.5,11 92.801,12 58,13 79,14 1116.53,15 149,16 6.569}
{0 CHEMBL429050,2 54,3 9,4 82,5 8,6 58,7 118.422,8 21,9 1,10 137,11 112.461,12 75,13 96,14 1317.13,15 178,16 6.279}
{0 CHEMBL429164,1 2,2 46,3 18,4 111,5 14,6 48,7 148.359,8 38,9 2,10 159,11 141.364,12 84,13 121,14 1711.26,15 232,16 6}
{0 CHEMBL429166,1 2,2 37,3 8,4 73,5 8,6 41,7 103.461,8 23,9 3,10 113.5,11 97.508,12 60,13 83,14 1190.04,15 156,16 6.78}
{0 CHEMBL429371,1 2,2 43,3 8,4 75,5 8,6 47,7 107.609,8 21,9 2,10 121.5,11 101.702,12 64,13 87,14 1218.66,15 162,16 6.175}
{0 CHEMBL429709,1 2,2 45,3 15,4 99,5 11,6 46,7 132.927,8 32,9 2,10 141.5,11 126.027,12 77,13 107,14 1511.03,15 206,16 6}
{0 CHEMBL433303,2 26,3 7,4 54,5 6,6 28,7 72.739,8 18,10 81,11 69.291,12 44,13 59,14 807.06,15 113,16 9.2}
{0 CHEMBL433872,1 1,2 15,4 27,5 1,6 18,7 42.887,8 8,9 4,10 44.5,11 39.317,12 23,13 33,14 570.43,15 60,16 6.248}
{0 CHEMBL434159,1 1,2 20,3 1,4 28,5 1,6 27,7 43.512,8 7,9 1,10 53,11 40.825,12 27,13 35,14 484.68,15 63,16 8.549}
{0 CHEMBL434991,1 1,2 17,3 8,4 51,5 5,6 21,7 63.824,8 19,9 1,10 66,11 60.129,12 36,13 50,14 713.99,15 101,16 7.638}
{0 CHEMBL435631,2 16,3 4,4 42,5 2,6 18,7 53.557,8 16,10 57,11 50.47,12 32,13 42,14 574.8,15 84,16 7.854}
{0 CHEMBL435981,2 11,3 4,4 43,5 3,6 13,7 49.313,8 17,10 47,11 45.975,12 28,13 37,14 513.76,15 80,16 6.75}
{0 CHEMBL436678,1 2,2 29,3 11,4 65,5 9,6 31,7 93.58,8 21,9 3,10 100,11 88.034,12 50,13 76,14 1201.31,15 141,16 7.921}
{0 CHEMBL436887,1 2,2 43,3 16,4 96,5 11,6 45,7 129.865,8 31,9 2,10 140,11 123.709,12 74,13 106,14 1501.98,15 202,16 5}
{0 CHEMBL436892,1 2,2 30,3 13,4 70,5 10,6 32,7 96.603,8 22,9 2,10 106,11 92.717,12 52,13 81,14 1163.5,15 151,16 8.509}
{0 CHEMBL436962,1 2,2 36,3 14,4 78,5 10,6 38,7 107.853,8 25,9 2,10 118,11 103.023,12 61,13 89,14 1267.65,15 167,16 7.553}
{0 CHEMBL437040,1 3,2 37,3 8,4 75,5 8,6 41,7 106.95,8 25,9 3,10 117.5,11 100.777,12 62,13 86,14 1231.7,15 161,16 6.879}
{0 CHEMBL437057,1 2,2 33,3 8,4 58,5 8,6 36,7 93.694,8 21,9 2,10 113,11 92.933,12 54,13 86,14 1257.38,15 144,16 6}
{0 CHEMBL437073,1 2,2 35,3 19,4 100,5 15,6 37,7 131.251,8 35,9 2,10 139,11 125.939,12 70,13 109,14 1562.02,15 209,16 7.7}
{0 CHEMBL437074,1 2,2 34,3 10,4 67,5 8,6 36,7 94.222,8 20,9 2,10 104,11 89.508,12 54,13 77,14 1094.46,15 144,16 6.46}
{0 CHEMBL437081,1 2,2 39,3 8,4 71,5 8,6 45,7 102.086,8 21,9 2,10 116.5,11 96.648,12 60,13 83,14 1166.58,15 154,16 7.084}
{0 CHEMBL437085,1 2,2 41,3 12,4 76,5 9,6 43,7 108.183,8 22,9 2,10 121,11 103.066,12 63,13 89,14 1257.65,15 165,16 6.585}
{0 CHEMBL437093,1 2,2 28,3 11,4 67,5 8,6 30,7 90.677,8 22,9 2,10 97,11 86.223,12 50,13 74,14 1062.42,15 141,16 7.212}
{0 CHEMBL437220,1 2,2 37,3 8,4 69,5 8,6 41,7 99.938,8 21,9 3,10 111.5,11 94.454,12 58,13 81,14 1161.98,15 150,16 7.602}
{0 CHEMBL437348,1 2,2 38,3 15,4 101,5 12,6 40,7 135.603,8 36,9 3,10 140,11 127.408,12 74,13 108,14 1645.95,15 209,16 6}
{0 CHEMBL437414,1 3,2 33,3 8,4 72,5 8,6 36,7 103.967,8 25,9 5,10 111,11 97.522,12 58,13 83,14 1232.53,15 155,16 7.252}
{0 CHEMBL437448,1 2,2 33,3 8,4 66,5 8,6 36,7 97.024,8 21,9 4,10 105,11 91.15,12 54,13 78,14 1235.26,15 144,16 7.796}
{0 CHEMBL437451,1 2,2 45,3 15,4 91,5 11,6 46,7 125.882,8 28,9 2,10 137.5,11 119.92,12 73,13 103,14 1454.91,15 194,16 6.465}
{0 CHEMBL437827,1 2,2 39,3 18,4 100,5 13,6 41,7 133.546,8 35,9 2,10 143,11 127.709,12 74,13 110,14 1566.04,15 210,16 6}
{0 CHEMBL437846,1 2,2 42,3 13,4 76,5 10,6 44,7 113.302,8 22,9 3,10 126,11 107.119,12 64,13 93,14 1426.57,15 169,16 6}
{0 CHEMBL437905,1 2,2 45,3 15,4 99,5 11,6 46,7 132.927,8 32,9 2,10 141.5,11 126.027,12 77,13 107,14 1511.03,15 206,16 6}
{0 CHEMBL438031,1 2,2 41,3 18,4 102,5 15,6 43,7 136.558,8 34,9 2,10 147,11 130.751,12 75,13 113,14 1608.09,15 215,16 9}
{0 CHEMBL438043,1 2,2 35,3 19,4 100,5 15,6 37,7 131.251,8 35,9 2,10 139,11 125.939,12 70,13 109,14 1562.02,15 209,16 8.2}
{0 CHEMBL438188,2 39,3 9,4 74,5 7,6 41,7 100.512,8 23,10 112,11 95.505,12 62,13 81,14 1103.46,15 155,16 8.5}
{0 CHEMBL438247,1 2,2 20,3 8,4 48,5 6,6 22,7 66.205,8 16,9 2,10 71,11 62.8,12 36,13 54,14 785.06,15 102,16 6.423}
{0 CHEMBL438281,1 2,2 33,3 8,4 66,5 8,6 36,7 94.194,8 21,9 2,10 105,11 89.866,12 54,13 78,14 1113.46,15 144,16 6.618}
{0 CHEMBL438285,1 2,2 33,3 8,4 59,5 7,6 35,7 85.018,8 17,9 2,10 95,11 80.455,12 50,13 69,14 978.32,15 128,16 6}
{0 CHEMBL438471,1 2,2 28,3 11,4 67,5 8,6 30,7 90.677,8 22,9 2,10 97,11 86.223,12 50,13 74,14 1062.42,15 141,16 6.919}
{0 CHEMBL438546,1 2,2 35,3 12,4 68,5 9,6 37,7 97.137,8 20,9 2,10 109,11 92.959,12 55,13 81,14 1153.49,15 149,16 6.644}
{0 CHEMBL438576,1 2,2 45,3 15,4 99,5 11,6 46,7 132.927,8 32,9 2,10 141.5,11 126.027,12 77,13 107,14 1511.03,15 206,16 6}
{0 CHEMBL438602,1 2,2 36,3 13,4 77,5 10,6 38,7 106.643,8 24,9 2,10 117,11 101.802,12 60,13 88,14 1252.64,15 165,16 6.251}
{0 CHEMBL438630,1 2,2 48,3 14,4 88,5 10,6 50,7 124.66,8 26,9 2,10 139,11 118.657,12 74,13 102,14 1433.88,15 190,16 6}
{0 CHEMBL438722,1 3,2 37,3 8,4 75,5 8,6 41,7 107.87,8 25,9 4,10 117.5,11 101.222,12 62,13 86,14 1248.15,15 161,16 7.921}
{0 CHEMBL438726,1 2,2 33,3 8,4 58,5 8,6 36,7 93.694,8 21,9 2,10 113,11 92.933,12 54,13 86,14 1257.38,15 144,16 6.16}
{0 CHEMBL438776,1 2,2 50,3 17,4 105,5 12,6 52,7 143.37,8 33,9 2,10 156,11 136.553,12 83,13 117,14 1649.17,15 222,16 6}
{0 CHEMBL438895,1 2,2 35,3 12,4 67,5 9,6 37,7 96.131,8 20,9 2,10 108,11 91.938,12 55,13 80,14 1138.47,15 147,16 7.284}
{0 CHEMBL438987,1 2,2 45,3 17,4 102,5 13,6 47,7 138.853,8 34,9 2,10 151,11 132.521,12 79,13 114,14 1612.11,15 216,16 6}
{0 CHEMBL438999,1 2,2 43,3 10,4 81,5 9,6 47,7 113.802,8 24,9 2,10 127,11 107.712,12 67,13 92,14 1292.75,15 173,16 8.602}
{0 CHEMBL439005,1 2,2 38,3 9,4 68,5 8,6 41,7 99.387,8 20,9 3,10 111.5,11 94.148,12 58,13 81,14 1162.96,15 149,16 7.292}
{0 CHEMBL439077,1 2,2 41,3 12,4 76,5 9,6 43,7 108.183,8 22,9 2,10 121,11 103.066,12 63,13 89,14 1257.65,15 165,16 7.252}
{0 CHEMBL439111,1 2,2 39,3 18,4 100,5 13,6 41,7 133.546,8 35,9 2,10 143,11 127.709,12 74,13 110,14 1566.04,15 210,16 6}
{0 CHEMBL439135,1 2,2 45,3 17,4 106,5 13,6 47,7 142.376,8 36,9 2,10 153,11 135.574,12 81,13 116,14 1640.17,15 222,16 6}
{0 CHEMBL439136,1 2,2 33,3 8,4 66,5 8,6 36,7 96.035,8 21,9 4,10 105,11 90.755,12 54,13 78,14 1146.36,15 144,16 7.495}
{0 CHEMBL439263,1 2,2 45,3 15,4 99,5 11,6 46,7 132.927,8 32,9 2,10 141.5,11 126.027,12 77,13 107,14 1511.03,15 206,16 6}
{0 CHEMBL439350,1 2,2 28,3 10,4 65,5 8,6 30,7 90.461,8 23,9 2,10 99,11 85.981,12 51,13 74,14 1056.41,15 139,16 6.462}
{0 CHEMBL439461,1 2,2 28,3 10,4 67,5 8,6 30,7 90.222,8 22,9 2,10 96,11 85.508,12 50,13 73,14 1046.42,15 140,16 6}
{0 CHEMBL439902,1 2,2 34,3 10,4 67,5 8,6 36,7 94.222,8 20,9 2,10 104,11 89.508,12 54,13 77,14 1094.46,15 144,16 7.149}
{0 CHEMBL440066,1 2,2 45,3 15,4 100,5 11,6 46,7 133.933,8 32,9 2,10 142.5,11 127.048,12 77,13 108,14 1526.05,15 208,16 6}
{0 CHEMBL440067,1 2,2 41,3 8,4 73,5 8,6 46,7 104.848,8 21,9 2,10 119,11 99.175,12 62,13 85,14 1192.62,15 158,16 7.75}
{0 CHEMBL440074,1 2,2 45,3 17,4 105,5 13,6 47,7 145.035,8 36,9 3,10 154,11 136.891,12 81,13 117,14 1766.06,15 222,16 6}
{0 CHEMBL440083,1 2,2 44,3 17,4 97,5 12,6 46,7 132.325,8 31,9 2,10 144,11 126.446,12 75,13 109,14 1545.01,15 206,16 5}
{0 CHEMBL440618,1 2,2 46,3 17,4 97,5 12,6 47,7 136.74,8 31,9 3,10 146.5,11 129.268,12 77,13 111,14 1681.92,15 208,16 6}
{0 CHEMBL440636,1 2,2 28,3 10,4 67,5 8,6 30,7 93.887,8 22,9 3,10 98,11 87.846,12 50,13 75,14 1187.33,15 142,16 8.208}
{0 CHEMBL441185,1 2,2 29,3 11,4 66,5 9,6 31,7 90.921,8 21,9 2,10 99,11 86.717,12 50,13 75,14 1075.42,15 141,16 8.959}
{0 CHEMBL441202,1 2,2 45,3 17,4 104,5 13,6 47,7 140.615,8 35,9 2,10 152,11 134.047,12 80,13 115,14 1626.14,15 219,16 6}
{0 CHEMBL441579,1 2,2 41,3 18,4 102,5 15,6 43,7 136.558,8 34,9 2,10 147,11 130.751,12 75,13 113,14 1608.09,15 215,16 8.9}
{0 CHEMBL441920,1 2,2 32,3 19,4 90,5 12,6 34,7 119.944,8 33,9 2,10 128,11 115.273,12 65,13 100,14 1435.83,15 190,16 8.824}
{0 CHEMBL441941,1 2,2 27,3 11,4 64,5 8,6 30,7 88.16,8 21,9 2,10 96,11 84.191,12 48,13 73,14 1049.38,15 137,16 6}
{0 CHEMBL442315,1 3,2 62,3 38,4 209,5 35,6 63,7 266.405,8 77,9 3,10 277,11 255.852,12 139,13 221,14 3159.1,15 430,16 8.56}
{0 CHEMBL442494,1 3,2 60,3 39,4 207,5 34,6 62,7 264.098,8 77,9 3,10 275,11 254.04,12 137,13 220,14 3149.06,15 427,16 8.62}
{0 CHEMBL442508,1 2,2 45,3 16,4 107,5 13,6 47,7 142.927,8 36,9 2,10 153,11 135.881,12 81,13 116,14 1639.19,15 223,16 6}
{0 CHEMBL442605,2 17,3 3,4 35,5 3,6 19,7 45.813,8 11,10 50,11 43.153,12 28,13 36,14 489.68,15 71,16 6}
{0 CHEMBL443084,2 23,3 3,4 46,5 3,6 25,7 61.626,8 16,10 68,11 57.809,12 39,13 48,14 646.91,15 94,16 8.678}
{0 CHEMBL444639,1 2,2 45,3 15,4 99,5 11,6 46,7 132.927,8 32,9 2,10 141.5,11 126.027,12 77,13 107,14 1511.03,15 206,16 6}
{0 CHEMBL446077,1 2,2 38,3 10,4 70,5 8,6 41,7 101.603,8 21,9 3,10 113.5,11 96.389,12 59,13 83,14 1192.99,15 153,16 8.13}
{0 CHEMBL446165,2 17,3 5,4 51,5 3,6 19,7 60.813,8 19,10 60,11 56.797,12 36,13 46,14 633.92,15 97,16 8}
{0 CHEMBL446380,1 2,2 35,3 11,4 68,5 9,6 37,7 96.433,8 21,9 2,10 107,11 91.728,12 56,13 79,14 1121.48,15 147,16 8.097}
{0 CHEMBL447064,1 2,2 35,3 14,4 68,5 11,6 39,7 99.046,8 21,9 2,10 114,11 95.389,12 56,13 84,14 1197.5,15 152,16 8.444}
{0 CHEMBL447177,1 2,2 37,3 13,4 72,5 11,6 39,7 105.228,8 21,9 3,10 119,11 101.092,12 58,13 89,14 1287.04,15 161,16 7.284}
{0 CHEMBL447455,2 23,3 3,4 39,5 3,6 25,7 53.336,8 11,10 60,11 50.207,12 34,13 42,14 565.78,15 81,16 6.738}
{0 CHEMBL447658,1 2,2 37,3 11,4 69,5 9,6 38,7 100.302,8 20,9 3,10 111.5,11 95.599,12 57,13 83,14 1197.97,15 152,16 8.432}
{0 CHEMBL447989,1 2,2 35,3 11,4 64,5 9,6 37,7 92.91,8 19,9 2,10 105,11 88.675,12 54,13 77,14 1093.42,15 141,16 7.469}
{0 CHEMBL448026,2 23,3 3,4 39,5 3,6 25,7 53.336,8 11,10 60,11 50.207,12 34,13 42,14 565.78,15 81,16 8}
{0 CHEMBL448431,1 2,2 39,3 10,4 69,5 9,6 42,7 102.791,8 20,9 3,10 117.5,11 98.288,12 59,13 86,14 1239,15 155,16 8.31}
{0 CHEMBL448713,2 29,3 3,4 41,5 3,6 31,7 59.097,8 10,10 69,11 55.734,12 39,13 47,14 627.85,15 88,16 6.616}
{0 CHEMBL451932,1 2,2 29,3 10,4 74,5 9,6 31,7 100.376,8 26,9 3,10 106,11 94.959,12 55,13 81,14 1177.01,15 155,16 8.387}
{0 CHEMBL452074,1 2,2 37,3 12,4 68,5 9,6 41,7 99.137,8 20,9 2,10 114,11 94.959,12 57,13 83,14 1177.51,15 151,16 8.244}
{0 CHEMBL453412,2 29,3 3,4 39,5 3,6 31,7 57.336,8 9,10 68,11 54.207,12 38,13 46,14 613.82,15 85,16 7.921}
{0 CHEMBL453936,1 2,2 35,3 11,4 66,5 9,6 37,7 94.671,8 20,9 2,10 106,11 90.201,12 55,13 78,14 1107.45,15 144,16 8.319}
{0 CHEMBL453938,2 29,3 3,4 43,5 3,6 31,7 60.859,8 11,10 70,11 57.261,12 40,13 48,14 641.88,15 91,16 6.987}
{0 CHEMBL454202,2 24,3 4,4 44,5 4,6 26,7 60.319,8 14,10 68,11 56.997,12 38,13 48,14 648.88,15 92,16 8.678}
{0 CHEMBL455435,1 2,2 28,3 10,4 69,5 8,6 30,7 91.984,8 23,9 2,10 97,11 87.035,12 51,13 74,14 1060.45,15 143,16 8.31}
{0 CHEMBL455760,1 2,2 37,3 12,4 72,5 9,6 41,7 102.66,8 22,9 2,10 116,11 98.013,12 59,13 85,14 1205.57,15 157,16 6.573}
{0 CHEMBL460542,2 19,3 2,4 31,5 1,6 19,7 44.222,8 10,10 50,11 42.162,12 29,13 36,14 491.63,15 67,16 5.16}
{0 CHEMBL462020,2 23,3 3,4 37,5 3,6 25,7 51.574,8 10,10 59,11 48.68,12 33,13 41,14 551.75,15 78,16 6}
{0 CHEMBL466609,2 23,3 3,4 39,5 3,6 25,7 53.336,8 11,10 60,11 50.207,12 34,13 42,14 565.78,15 81,16 6.345}
{0 CHEMBL473160,2 17,3 4,4 32,5 3,6 19,7 43.5,8 10,10 49,11 41.32,12 27,13 35,14 476.63,15 67,16 6.538}
{0 CHEMBL473763,2 19,3 1,4 31,5 1,6 19,7 43.768,8 10,10 49,11 41.448,12 29,13 35,14 475.63,15 66,16 4.91}
{0 CHEMBL476240,2 23,3 3,4 39,5 3,6 25,7 53.336,8 11,10 60,11 50.207,12 34,13 42,14 565.78,15 81,16 6.114}
{0 CHEMBL498945,1 2,2 41,3 20,4 95,5 15,6 44,7 132.177,8 32,9 2,10 147.5,11 127.579,12 73,13 112,14 1594.99,15 207,16 8.886}
{0 CHEMBL498985,1 2,2 43,3 17,4 96,5 13,6 46,7 134.433,8 32,9 3,10 148.5,11 128.789,12 75,13 112,14 1607.47,15 208,16 8.009}
{0 CHEMBL499398,2 23,3 3,4 34,5 3,6 25,7 50.671,8 9,9 1,10 59,11 47.981,12 32,13 41,14 572.16,15 75,16 7.658}
{0 CHEMBL499446,1 2,2 44,3 20,4 100,5 16,6 45,7 141.569,8 34,9 3,10 157.5,11 136.503,12 78,13 120,14 1723.56,15 220,16 8.77}
{0 CHEMBL499681,2 24,3 4,4 44,5 4,6 26,7 61.569,8 14,10 71,11 58.513,12 38,13 50,14 676.9,15 94,16 9.137}
{0 CHEMBL499760,1 2,2 39,3 11,4 72,5 9,6 42,7 105.069,8 21,9 3,10 118.5,11 100.147,12 60,13 87,14 1251.04,15 159,16 8.032}
{0 CHEMBL499939,1 2,2 38,3 20,4 91,5 14,6 42,7 130.069,8 32,9 3,10 143,11 124.348,12 70,13 109,14 1667.81,15 200,16 8.921}
{0 CHEMBL500326,1 2,2 34,3 10,4 66,5 8,6 36,7 93.217,8 20,9 2,10 103,11 88.487,12 54,13 76,14 1079.44,15 142,16 7.839}
{0 CHEMBL500477,1 2,2 40,3 15,4 74,5 14,6 43,7 110.285,8 22,9 2,10 129.5,11 106.716,12 62,13 95,14 1347.66,15 169,16 8.569}
{0 CHEMBL501282,1 2,2 39,3 10,4 69,5 9,6 42,7 102.791,8 20,9 3,10 117.5,11 98.288,12 59,13 86,14 1239,15 155,16 7.638}
{0 CHEMBL501699,2 17,3 3,4 33,5 3,6 19,7 44.052,8 10,10 49,11 41.627,12 27,13 35,14 475.65,15 68,16 6.535}
{0 CHEMBL501776,1 2,2 34,3 10,4 66,5 8,6 36,7 93.217,8 20,9 2,10 103,11 88.487,12 54,13 76,14 1079.44,15 142,16 7.959}
{0 CHEMBL502077,1 2,2 44,3 18,4 101,5 14,6 47,7 140.416,8 34,9 3,10 154.5,11 134.579,12 78,13 117,14 1678.56,15 218,16 7.337}
{0 CHEMBL502219,1 2,2 39,3 10,4 70,5 9,6 42,7 102.853,8 20,9 3,10 116.5,11 97.905,12 59,13 85,14 1221.01,15 155,16 8.161}
{0 CHEMBL502511,1 2,2 35,3 11,4 66,5 9,6 37,7 94.671,8 20,9 2,10 106,11 90.201,12 55,13 78,14 1107.45,15 144,16 7.886}
{0 CHEMBL502777,1 2,2 34,3 10,4 66,5 8,6 36,7 93.217,8 20,9 2,10 103,11 88.487,12 54,13 76,14 1079.44,15 142,16 7.745}
{0 CHEMBL503036,1 2,2 35,3 11,4 66,5 9,6 37,7 94.671,8 20,9 2,10 106,11 90.201,12 55,13 78,14 1107.45,15 144,16 7.733}
{0 CHEMBL503379,1 1,2 23,3 5,4 47,5 5,6 27,7 65.188,8 16,9 1,10 74,11 61.447,12 39,13 52,14 726,15 99,16 6.485}
{0 CHEMBL503596,1 2,2 35,3 11,4 68,5 9,6 37,7 96.433,8 21,9 2,10 107,11 91.728,12 56,13 79,14 1121.48,15 147,16 8.31}
{0 CHEMBL504087,1 2,2 35,3 11,4 70,5 9,6 37,7 98.194,8 22,9 2,10 108,11 93.255,12 57,13 80,14 1135.51,15 150,16 8.187}
{0 CHEMBL504248,1 2,2 35,3 11,4 70,5 9,6 37,7 98.194,8 22,9 2,10 108,11 93.255,12 57,13 80,14 1135.51,15 150,16 7.398}
{0 CHEMBL504395,1 2,2 35,3 11,4 66,5 9,6 37,7 94.671,8 20,9 2,10 106,11 90.201,12 55,13 78,14 1107.45,15 144,16 7.387}
{0 CHEMBL504457,1 2,2 35,3 11,4 68,5 9,6 37,7 96.433,8 21,9 2,10 107,11 91.728,12 56,13 79,14 1121.48,15 147,16 7.31}
{0 CHEMBL504462,1 2,2 35,3 11,4 66,5 9,6 37,7 94.671,8 20,9 2,10 106,11 90.201,12 55,13 78,14 1107.45,15 144,16 7.959}
{0 CHEMBL504838,2 23,3 3,4 37,5 3,6 25,7 51.574,8 10,10 59,11 48.68,12 33,13 41,14 551.75,15 78,16 7.081}
{0 CHEMBL504930,2 23,3 3,4 35,5 3,6 25,7 49.813,8 9,10 58,11 47.153,12 32,13 40,14 537.72,15 75,16 6.987}
{0 CHEMBL505128,1 2,2 35,3 11,4 66,5 9,6 37,7 94.671,8 20,9 2,10 106,11 90.201,12 55,13 78,14 1107.45,15 144,16 7.481}
{0 CHEMBL505496,1 2,2 35,3 11,4 64,5 9,6 37,7 92.91,8 19,9 2,10 105,11 88.675,12 54,13 77,14 1093.42,15 141,16 6.963}
{0 CHEMBL505628,1 2,2 38,3 13,4 73,5 12,6 40,7 108.234,8 22,9 3,10 124,11 104.114,12 60,13 92,14 1326.08,15 165,16 7.569}
{0 CHEMBL505704,1 2,2 39,3 11,4 70,5 9,6 42,7 103.308,8 20,9 3,10 117.5,11 98.62,12 59,13 86,14 1237.01,15 156,16 8.032}
{0 CHEMBL505854,1 2,2 35,3 11,4 68,5 9,6 37,7 96.433,8 21,9 2,10 107,11 91.728,12 56,13 79,14 1121.48,15 147,16 8.046}
{0 CHEMBL505888,2 27,3 3,4 39,5 3,6 30,7 56.336,8 10,10 66.5,11 53.207,12 37,13 45,14 601.81,15 84,16 6.668}
{0 CHEMBL506326,1 2,2 40,3 13,4 74,5 12,6 41,7 109.989,8 22,9 3,10 125.5,11 105.619,12 62,13 93,14 1337.1,15 167,16 8.62}
{0 CHEMBL506892,1 2,2 35,3 11,4 64,5 9,6 37,7 92.91,8 19,9 2,10 105,11 88.675,12 54,13 77,14 1093.42,15 141,16 7.886}
{0 CHEMBL507148,1 2,2 39,3 10,4 69,5 9,6 42,7 101.847,8 20,9 3,10 115.5,11 96.884,12 59,13 84,14 1205.99,15 153,16 7.77}
{0 CHEMBL508585,1 2,2 38,3 20,4 92,5 14,6 42,7 127.41,8 32,9 2,10 142,11 123.031,12 70,13 108,14 1541.92,15 200,16 8.824}
{0 CHEMBL509192,1 2,2 40,3 11,4 71,5 10,6 43,7 105.313,8 20,9 3,10 120.5,11 100.641,12 60,13 88,14 1264.04,15 159,16 7.638}
{0 CHEMBL509363,1 2,2 28,3 9,4 59,5 8,6 30,7 84.586,8 18,9 3,10 93,11 80.535,12 46,13 70,14 1023.76,15 129,16 8.229}
{0 CHEMBL509513,1 1,2 23,3 5,4 43,5 5,6 27,7 60.665,8 13,9 1,10 70,11 57.393,12 36,13 49,14 685.93,15 92,16 8.377}
{0 CHEMBL510693,1 2,2 39,3 10,4 69,5 9,6 42,7 101.847,8 20,9 3,10 115.5,11 96.884,12 59,13 84,14 1205.99,15 153,16 6.801}
{0 CHEMBL510755,1 2,2 38,3 10,4 68,5 8,6 41,7 99.842,8 20,9 3,10 112.5,11 94.862,12 58,13 82,14 1178.96,15 150,16 7.585}
{0 CHEMBL510793,1 2,2 44,3 21,4 113,5 14,6 47,7 152.348,8 40,9 3,10 163.5,11 145.884,12 84,13 126,14 1810.74,15 239,16 7.398}
{0 CHEMBL510901,1 2,2 32,3 9,4 70,5 8,6 35,7 97.149,8 23,9 3,10 104.5,11 91.674,12 55,13 78,14 1128.95,15 148,16 7.237}
{0 CHEMBL511086,1 2,2 36,3 11,4 70,5 10,6 38,7 101.558,8 20,9 3,10 114,11 97.136,12 56,13 85,14 1229,15 155,16 7.824}
{0 CHEMBL523814,2 19,3 2,4 31,5 1,6 23,7 44.836,8 10,10 53,11 42.385,12 29,13 36,14 481.65,15 67,16 5.38}
{0 CHEMBL524327,1 2,2 36,3 11,4 70,5 10,6 38,7 101.558,8 20,9 3,10 114,11 97.136,12 56,13 85,14 1229,15 155,16 8.268}
{0 CHEMBL524341,1 2,2 40,3 21,4 98,5 16,6 40,7 137.262,8 34,9 3,10 151,11 132.691,12 74,13 117,14 1689.5,15 215,16 9.155}
{0 CHEMBL524870,1 2,2 35,3 11,4 64,5 9,6 37,7 92.91,8 19,9 2,10 105,11 88.675,12 54,13 77,14 1093.42,15 141,16 8.409}
{0 CHEMBL525030,1 2,2 35,3 11,4 66,5 9,6 37,7 94.671,8 20,9 2,10 106,11 90.201,12 55,13 78,14 1107.45,15 144,16 7.377}
{0 CHEMBL525397,1 2,2 35,3 11,4 66,5 9,6 37,7 94.671,8 20,9 2,10 106,11 90.201,12 55,13 78,14 1107.45,15 144,16 8.268}
{0 CHEMBL526498,1 2,2 37,3 13,4 69,5 11,6 40,7 100.597,8 20,9 2,10 115.5,11 96.695,12 57,13 85,14 1208.53,15 154,16 8.585}
{0 CHEMBL526523,1 2,2 37,3 21,4 93,5 15,6 39,7 127.87,8 32,9 2,10 141,11 123.767,12 69,13 109,14 1560.93,15 202,16 9.125}
{0 CHEMBL526524,1 2,2 41,3 18,4 95,5 13,6 42,7 131.882,8 32,9 3,10 143.5,11 126.483,12 73,13 110,14 1584.43,15 205,16 8.854}
{0 CHEMBL526550,1 2,2 28,3 10,4 61,5 8,6 30,7 84.938,8 19,9 2,10 93,11 80.928,12 47,13 70,14 1004.33,15 131,16 6.472}
{0 CHEMBL53204,2 23,3 6,4 48,6 27,7 62.501,8 16,10 67.5,11 58.964,12 39,13 49,14 668.91,15 97,16 6.097}
{0 CHEMBL538451,1 2,2 48,3 10,4 74,5 10,6 50,7 110.512,8 19,9 2,10 128,11 105.11,12 67,13 91,14 1271.67,15 165,16 7}
{0 CHEMBL538948,1 2,2 40,3 10,4 72,5 8,6 42,7 106.166,8 21,9 3,10 116,11 99.405,12 61,13 85,14 1310.48,15 157,16 6}
{0 CHEMBL539710,1 2,2 43,3 16,4 95,5 11,6 45,7 132.524,8 31,9 3,10 141,11 125.026,12 74,13 107,14 1627.87,15 202,16 6}
{0 CHEMBL539933,2 34,3 9,4 71,5 8,6 36,7 95.245,8 22,10 106,11 90.989,12 56,13 78,14 1070.4,15 149,16 8}
{0 CHEMBL540408,1 2,2 33,3 8,4 64,5 7,6 35,7 89.546,8 19,9 2,10 98,11 84.53,12 52,13 72,14 1021.4,15 136,16 6}
{0 CHEMBL540721,1 2,2 38,3 15,4 105,5 12,6 40,7 138.126,8 37,9 3,10 140,11 129.461,12 75,13 109,14 1662,15 214,16 6}
{0 CHEMBL54832,2 22,3 6,4 47,6 27,7 61.745,8 16,10 67.5,11 58.459,12 38,13 49,14 669.9,15 96,16 5.648}
{0 CHEMBL552013,1 2,2 43,3 15,4 96,5 11,6 45,7 129.41,8 31,9 2,10 139,11 122.995,12 74,13 105,14 1485.98,15 201,16 6}
{0 CHEMBL552988,1 2,2 33,3 9,4 63,5 7,6 35,7 92.66,8 19,9 3,10 100,11 86.562,12 52,13 74,14 1163.29,15 137,16 6}
{0 CHEMBL552989,1 2,2 51,3 10,4 77,5 9,6 54,7 118.694,8 20,9 3,10 135.5,11 111.48,12 71,13 96,14 1449.64,15 173,16 6}
{0 CHEMBL553655,1 2,2 36,3 9,4 66,5 8,6 37,7 93.762,8 19,9 2,10 103.5,11 88.772,12 55,13 76,14 1075.45,15 142,16 6}
{0 CHEMBL553656,1 2,2 35,3 8,4 59,5 7,6 36,7 86.018,8 16,9 2,10 96.5,11 81.455,12 51,13 70,14 990.33,15 129,16 6}
{0 CHEMBL553672,1 2,2 53,3 10,4 79,5 9,6 55,7 117.791,8 20,9 2,10 136,11 111.669,12 73,13 96,14 1334.77,15 175,16 6}
{0 CHEMBL554624,1 2,2 40,3 9,4 73,5 8,6 42,7 103.052,8 21,9 2,10 114,11 97.374,12 61,13 83,14 1168.59,15 156,16 6}
{0 CHEMBL554976,1 2,2 45,3 11,4 74,5 9,6 48,7 108.967,8 20,9 2,10 125.5,11 103.825,12 65,13 90,14 1263.65,15 164,16 6.62}
{0 CHEMBL555737,1 2,2 41,3 12,4 80,5 9,6 43,7 111.705,8 24,9 2,10 123,11 106.12,12 65,13 91,14 1285.71,15 171,16 6}
{0 CHEMBL555898,1 2,2 40,3 10,4 72,5 8,6 42,7 102.501,8 21,9 2,10 114,11 97.067,12 61,13 83,14 1169.57,15 155,16 6}
{0 CHEMBL555956,1 2,2 35,3 8,4 59,5 7,6 36,7 86.018,8 16,9 2,10 96.5,11 81.455,12 51,13 70,14 990.33,15 129,16 6}
{0 CHEMBL555977,1 2,2 43,3 11,4 74,5 9,6 44,7 110.382,8 21,9 3,10 121.5,11 103.647,12 64,13 89,14 1364.53,15 163,16 6}
{0 CHEMBL556735,1 2,2 48,3 10,4 74,5 10,6 50,7 110.512,8 19,9 2,10 128,11 105.11,12 67,13 91,14 1271.67,15 165,16 6}
{0 CHEMBL556949,1 2,2 50,3 17,4 105,5 12,6 52,7 143.37,8 33,9 2,10 156,11 136.553,12 83,13 117,14 1649.17,15 222,16 6}
{0 CHEMBL557288,1 2,2 39,3 12,4 67,5 9,6 42,7 99.131,8 19,9 2,10 114.5,11 94.938,12 58,13 83,14 1174.5,15 150,16 8.244}
{0 CHEMBL558161,1 2,2 43,3 11,4 75,5 9,6 44,7 107.722,8 21,9 2,10 120.5,11 102.33,12 64,13 88,14 1238.64,15 163,16 6}
{0 CHEMBL558600,1 2,2 46,3 17,4 98,5 12,6 47,7 134.081,8 31,9 2,10 145.5,11 127.951,12 77,13 110,14 1556.03,15 208,16 6}
{0 CHEMBL558935,1 2,2 43,3 11,4 75,5 9,6 44,7 107.722,8 21,9 2,10 120.5,11 102.33,12 64,13 88,14 1238.64,15 163,16 6}
{0 CHEMBL559022,1 2,2 43,3 15,4 96,5 11,6 45,7 133.075,8 31,9 3,10 141,11 125.333,12 74,13 107,14 1626.89,15 203,16 6}
{0 CHEMBL559150,1 2,2 41,3 11,4 84,5 9,6 43,7 114.774,8 26,9 2,10 124,11 108.459,12 67,13 92,14 1297.77,15 176,16 6}
{0 CHEMBL563124,1 2,2 43,3 8,4 67,5 7,6 46,7 102.728,8 18,9 3,10 115.5,11 95.901,12 61,13 82,14 1259.42,15 149,16 6}
{0 CHEMBL563461,1 2,2 43,3 16,4 98,5 11,6 45,7 131.626,8 32,9 2,10 141,11 125.236,12 75,13 107,14 1516.01,15 205,16 6}
{0 CHEMBL563462,1 2,2 36,3 9,4 66,5 8,6 37,7 93.762,8 19,9 2,10 103.5,11 88.772,12 55,13 76,14 1075.45,15 142,16 6}
{0 CHEMBL69303,2 18,3 2,4 41,5 3,6 19,7 52.643,8 15,10 56,11 49.019,12 33,13 40,14 539.79,15 81,16 7.699}
{0 CHEMBL69575,2 18,3 2,4 35,5 3,6 19,7 46.358,8 11,10 51,11 43.439,12 29,13 36,14 485.69,15 71,16 6.523}
{0 CHEMBL70096,2 19,3 4,4 37,5 4,6 20,7 50.029,8 12,10 56,11 47.395,12 31,13 40,14 543.73,15 77,16 5.955}
{0 CHEMBL70224,2 18,3 2,4 35,5 3,6 19,7 46.358,8 11,10 51,11 43.439,12 29,13 36,14 485.69,15 71,16 5}
{0 CHEMBL71723,2 18,3 2,4 41,5 3,6 19,7 52.643,8 15,10 56,11 49.019,12 33,13 40,14 539.79,15 81,16 5.759}
{0 CHEMBL76766,2 26,3 7,4 56,5 6,6 28,7 73.501,8 18,10 80,11 69.818,12 44,13 59,14 809.08,15 115,16 10.1}
{0 CHEMBL91696,1 1,2 17,3 6,4 46,5 5,6 21,7 58.637,8 16,9 1,10 62,11 55.14,12 33,13 46,14 654.92,15 92,16 5.114}
{0 CHEMBL92914,1 1,2 20,3 2,4 34,5 2,6 23,7 48,8 10,9 1,10 53.5,11 44.604,12 30,13 37,14 514.75,15 71,16 5.8}
{0 CHEMBL93304,2 18,3 5,4 44,5 4,6 20,7 55.773,8 15,10 59,11 52.712,12 33,13 44,14 604.83,15 88,16 5.796}
{0 CHEMBL93351,1 1,2 20,3 2,4 38,5 2,6 23,7 52.523,8 13,9 1,10 57.5,11 48.658,12 33,13 40,14 554.82,15 78,16 6.561}
{0 CHEMBL93859,2 18,3 5,4 45,5 3,6 23,7 57.779,8 16,10 63,11 54.733,12 34,13 46,14 631.86,15 91,16 8.187}
{0 CHEMBL94293,2 18,3 5,4 46,5 4,6 20,7 57.535,8 16,10 60,11 54.238,12 34,13 45,14 618.86,15 91,16 7.174}
{0 CHEMBL99895,2 18,3 5,4 47,5 3,6 23,7 59.54,8 17,10 64,11 56.26,12 35,13 47,14 645.89,15 94,16 11}
