{
  "data_qualities": {
    "quality": [
      {
        "name": "AutoCorrelation",
        "value": "0.49847692307692293"
      },
      {
        "name": "ClassEntropy",
        "value": []
      },
      {
        "name": "Dimensionality",
        "value": "4.53030303030303"
      },
      {
        "name": "EquivalentNumberOfAtts",
        "value": []
      },
      {
        "name": "MajorityClassPercentage",
        "value": []
      },
      {
        "name": "MajorityClassSize",
        "value": []
      },
      {
        "name": "MaxAttributeEntropy",
        "value": []
      },
      {
        "name": "MaxKurtosisOfNumericAtts",
        "value": "18.310696722450594"
      },
      {
        "name": "MaxMeansOfNumericAtts",
        "value": "5416328.87878788"
      },
      {
        "name": "MaxMutualInformation",
        "value": []
      },
      {
        "name": "MaxNominalAttDistinctValues",
        "value": []
      },
      {
        "name": "MaxSkewnessOfNumericAtts",
        "value": "3.9863711618304962"
      },
      {
        "name": "MaxStdDevOfNumericAtts",
        "value": "2494674.009858194"
      },
      {
        "name": "MeanAttributeEntropy",
        "value": []
      },
      {
        "name": "MeanKurtosisOfNumericAtts",
        "value": "2.8369712151788677"
      },
      {
        "name": "MeanMeansOfNumericAtts",
        "value": "18261.272850010177"
      },
      {
        "name": "MeanMutualInformation",
        "value": []
      },
      {
        "name": "MeanNoiseToSignalRatio",
        "value": []
      },
      {
        "name": "MeanNominalAttDistinctValues",
        "value": []
      },
      {
        "name": "MeanSkewnessOfNumericAtts",
        "value": "-1.4518252893111752"
      },
      {
        "name": "MeanStdDevOfNumericAtts",
        "value": "8406.563829078528"
      },
      {
        "name": "MinAttributeEntropy",
        "value": []
      },
      {
        "name": "MinKurtosisOfNumericAtts",
        "value": "-0.03542740979397063"
      },
      {
        "name": "MinMeansOfNumericAtts",
        "value": "-0.09015151515151515"
      },
      {
        "name": "MinMutualInformation",
        "value": []
      },
      {
        "name": "MinNominalAttDistinctValues",
        "value": []
      },
      {
        "name": "MinSkewnessOfNumericAtts",
        "value": "-3.5467995611563152"
      },
      {
        "name": "MinStdDevOfNumericAtts",
        "value": "0.010902192846295136"
      },
      {
        "name": "MinorityClassPercentage",
        "value": []
      },
      {
        "name": "MinorityClassSize",
        "value": []
      },
      {
        "name": "NumberOfBinaryFeatures",
        "value": "0.0"
      },
      {
        "name": "NumberOfClasses",
        "value": "0.0"
      },
      {
        "name": "NumberOfFeatures",
        "value": "299.0"
      },
      {
        "name": "NumberOfInstances",
        "value": "66.0"
      },
      {
        "name": "NumberOfInstancesWithMissingValues",
        "value": "0.0"
      },
      {
        "name": "NumberOfMissingValues",
        "value": "0.0"
      },
      {
        "name": "NumberOfNumericFeatures",
        "value": "298.0"
      },
      {
        "name": "NumberOfSymbolicFeatures",
        "value": "1.0"
      },
      {
        "name": "PercentageOfBinaryFeatures",
        "value": "0.0"
      },
      {
        "name": "PercentageOfInstancesWithMissingValues",
        "value": "0.0"
      },
      {
        "name": "PercentageOfMissingValues",
        "value": "0.0"
      },
      {
        "name": "PercentageOfNumericFeatures",
        "value": "99.66555183946488"
      },
      {
        "name": "PercentageOfSymbolicFeatures",
        "value": "0.33444816053511706"
      },
      {
        "name": "Quartile1AttributeEntropy",
        "value": []
      },
      {
        "name": "Quartile1KurtosisOfNumericAtts",
        "value": "1.3944604151571498"
      },
      {
        "name": "Quartile1MeansOfNumericAtts",
        "value": "2.779272727272727"
      },
      {
        "name": "Quartile1MutualInformation",
        "value": []
      },
      {
        "name": "Quartile1SkewnessOfNumericAtts",
        "value": "-2.1141563242510943"
      },
      {
        "name": "Quartile1StdDevOfNumericAtts",
        "value": "0.3391027482179806"
      },
      {
        "name": "Quartile2AttributeEntropy",
        "value": []
      },
      {
        "name": "Quartile2KurtosisOfNumericAtts",
        "value": "2.0777210955714853"
      },
      {
        "name": "Quartile2MeansOfNumericAtts",
        "value": "5.841689393939394"
      },
      {
        "name": "Quartile2MutualInformation",
        "value": []
      },
      {
        "name": "Quartile2SkewnessOfNumericAtts",
        "value": "-1.8981867174532665"
      },
      {
        "name": "Quartile2StdDevOfNumericAtts",
        "value": "0.6704899640656136"
      },
      {
        "name": "Quartile3AttributeEntropy",
        "value": []
      },
      {
        "name": "Quartile3KurtosisOfNumericAtts",
        "value": "3.3346441363650197"
      },
      {
        "name": "Quartile3MeansOfNumericAtts",
        "value": "12.30769318181818"
      },
      {
        "name": "Quartile3MutualInformation",
        "value": []
      },
      {
        "name": "Quartile3SkewnessOfNumericAtts",
        "value": "-1.7504619632159502"
      },
      {
        "name": "Quartile3StdDevOfNumericAtts",
        "value": "2.4733543602515375"
      },
      {
        "name": "StdvNominalAttDistinctValues",
        "value": []
      }
    ]
  }
}