"molecule_id","MW","RBF","O.","AMW","C.","H.","Me","Mi","Mp","pXC50"
{1 586.75,2 0.057,3 7.4,4 7.244,5 40.7,6 46.9,7 1.005,8 1.127,9 0.651,10 4.377}
{0 CHEMBL1242180,1 289.43,2 0.067,4 6.731,5 46.5,6 48.8,7 0.979,8 1.115,9 0.68,10 4.887}
{0 CHEMBL1276308,1 429.65,2 0.028,3 3,4 6.413,5 43.3,6 52.2,7 0.982,8 1.119,9 0.655,10 9.155}
{0 CHEMBL1299566,1 371.35,2 0.132,3 17.1,4 10.61,5 45.7,6 25.7,7 1.057,8 1.112,9 0.734,10 4.445}
{0 CHEMBL1299581,1 343.49,2 0.106,3 4.4,4 7.633,5 40,6 46.7,7 1,8 1.124,9 0.676,10 4.445}
{0 CHEMBL1300713,1 459.62,2 0.109,3 8.2,4 7.535,5 37.7,6 47.5,7 1.008,8 1.129,9 0.653,10 4.941}
{0 CHEMBL1301491,1 397.23,2 0.195,3 12.5,4 9.931,5 42.5,6 35,7 1.042,8 1.121,9 0.708,10 4.445}
{0 CHEMBL1302303,1 355.38,2 0.089,3 11.6,4 8.265,5 41.9,6 39.5,7 1.026,8 1.127,9 0.666,10 4.445}
{0 CHEMBL1302611,1 476.36,2 0.111,3 9.6,4 9.161,5 40.4,6 42.3,7 1.019,8 1.126,9 0.678,10 4.445}
{0 CHEMBL1302818,1 323.42,2 0.143,3 11.8,4 9.512,5 41.2,6 38.2,7 1.025,8 1.108,9 0.726,10 4.445}
{0 CHEMBL1303242,1 365.42,2 0.146,3 8.7,4 7.944,5 43.5,6 41.3,7 1.015,8 1.123,9 0.672,10 4.445}
{0 CHEMBL1304074,1 449.58,2 0.117,3 10.3,4 7.751,5 36.2,6 46.6,7 1.016,8 1.132,9 0.647,10 4.445}
{0 CHEMBL1304187,1 309.35,2 0.026,4 8.839,5 54.3,6 31.4,7 1.005,8 1.107,9 0.752,10 4.445}
{0 CHEMBL1305054,1 498.69,2 0.125,3 5,4 8.311,5 38.3,6 43.3,7 1.01,8 1.127,9 0.688,10 4.4}
{0 CHEMBL1305435,1 426.58,2 0.085,3 7.1,4 7.617,5 41.1,6 46.4,7 1.003,8 1.12,9 0.672,10 4.891}
{0 CHEMBL1305575,1 395.42,2 0.184,3 8.5,4 8.413,5 44.7,6 38.3,7 1.025,8 1.128,9 0.678,10 4.55}
{0 CHEMBL1305642,1 402.55,2 0.093,3 3.9,4 7.893,5 47.1,6 43.1,7 0.996,8 1.108,9 0.709,10 4.879}
{0 CHEMBL1306019,1 325.18,2 0.091,3 9.4,4 10.162,5 40.6,6 40.6,7 1.022,8 1.124,9 0.697,10 4.445}
{0 CHEMBL1306377,1 278.71,2 0.063,3 10,4 9.29,5 43.3,6 36.7,7 1.031,8 1.121,9 0.701,10 4.922}
{0 CHEMBL1307861,1 425.2,2 0.15,3 15.8,4 11.189,5 42.1,6 26.3,7 1.067,8 1.126,9 0.724,10 4.445}
{0 CHEMBL1307972,1 403.35,2 0.114,3 2.4,4 9.604,5 47.6,6 38.1,7 1.008,8 1.103,9 0.76,10 5.175}
{0 CHEMBL1309164,1 361.44,2 0.1,3 4.3,4 7.69,5 48.9,6 42.6,7 1.002,8 1.115,9 0.691,10 4.972}
{0 CHEMBL1309254,1 222.26,2 0.034,3 3.7,4 8.232,5 51.9,6 37,7 1.002,8 1.106,9 0.723,10 4.446}
{0 CHEMBL1310024,1 309.4,2 0.136,3 4.8,4 7.367,5 42.9,6 45.2,7 1.001,8 1.125,9 0.667,10 4.4}
{0 CHEMBL1310435,1 395.47,2 0.106,3 8.9,4 8.788,5 44.4,6 37.8,7 1.019,8 1.115,9 0.707,10 4.445}
{0 CHEMBL1310742,1 329.42,2 0.1,3 5.3,4 8.669,5 39.5,6 39.5,7 1.017,8 1.129,9 0.695,10 4.445}
{0 CHEMBL1310929,1 390.76,2 0.15,3 15.8,4 10.283,5 42.1,6 28.9,7 1.059,8 1.128,9 0.701,10 4.445}
{0 CHEMBL1311585,1 336.38,2 0.091,3 7.3,4 8.204,5 43.9,6 39,7 1.017,8 1.125,9 0.682,10 4.445}
{0 CHEMBL1311742,1 498.3,2 0.159,3 9.3,4 11.588,5 37.2,6 27.9,7 1.079,8 1.155,9 0.711,10 4.94}
{0 CHEMBL1312446,1 371.52,2 0.136,3 7.1,4 6.634,5 39.3,6 51.8,7 0.996,8 1.128,9 0.634,10 4.445}
{0 CHEMBL1312683,1 362.49,2 0.188,3 8.5,4 7.713,5 38.3,6 46.8,7 1.009,8 1.126,9 0.662,10 4.445}
{0 CHEMBL1312689,1 456.57,2 0.105,3 3.8,4 8.615,5 45.3,6 37.7,7 1.01,8 1.118,9 0.715,10 4.877}
{0 CHEMBL1315639,1 517.67,2 0.114,3 9,4 7.726,5 35.8,6 46.3,7 1.015,8 1.135,9 0.646,10 4.445}
{0 CHEMBL1316462,1 360.45,2 0.1,3 4.3,4 7.669,5 44.7,6 42.6,7 1.003,8 1.122,9 0.681,10 4.445}
{0 CHEMBL1318140,1 319.35,2 0.121,3 6.5,4 10.302,5 32.3,6 29,7 1.053,8 1.156,9 0.697,10 5.238}
{0 CHEMBL1318520,1 524.12,2 0.087,3 6.1,4 7.941,5 43.9,6 45.5,7 1.001,8 1.113,9 0.693,10 4.796}
{0 CHEMBL1318808,1 322.73,2 0.118,3 12.1,4 9.78,5 39.4,6 33.3,7 1.048,8 1.134,9 0.689,10 4.445}
{0 CHEMBL1319816,1 374.52,2 0.12,3 4.2,4 7.802,5 35.4,6 45.8,7 1.009,8 1.139,9 0.66,10 4.445}
{0 CHEMBL1321725,1 454.97,2 0.167,3 11.3,4 8.584,5 37.7,6 43.4,7 1.024,8 1.126,9 0.672,10 4.445}
{0 CHEMBL1323722,1 477.38,2 0.122,3 6.4,4 10.157,5 44.7,6 38.3,7 1.02,8 1.116,9 0.727,10 5.084}
{0 CHEMBL1323983,1 218.29,2 0.129,3 3.3,4 7.276,5 36.7,6 46.7,7 1.005,8 1.143,9 0.643,10 4.445}
{0 CHEMBL132431,1 504.56,2 0.141,3 8.2,4 8.271,5 39.3,6 39.3,7 1.025,8 1.137,9 0.662,10 4.445}
{0 CHEMBL1325021,1 356.83,2 0.068,3 7.1,4 8.496,5 45.2,6 40.5,7 1.014,8 1.116,9 0.698,10 5.036}
{0 CHEMBL1325149,1 388.94,2 0.055,3 3.8,4 7.48,5 38.5,6 48.1,7 1.002,8 1.133,9 0.657,10 4.4}
{0 CHEMBL1325166,1 311.22,2 0.103,3 3.6,4 11.115,5 42.9,6 39.3,7 1.009,8 1.109,9 0.76,10 4.399}
{0 CHEMBL1325226,1 298.44,2 0.146,3 2.6,4 7.652,5 43.6,6 46.2,7 0.992,8 1.114,9 0.698,10 4.875}
{0 CHEMBL1327038,1 323.38,2 0.093,3 7.3,4 7.887,5 43.9,6 41.5,7 1.012,8 1.123,9 0.676,10 4.932}
{0 CHEMBL1329069,1 510.68,2 0.117,3 9.3,4 6.809,5 40,6 50.7,7 1.001,8 1.125,9 0.635,10 5.225}
{0 CHEMBL1329520,1 382.51,2 0.164,3 5.6,4 7.084,5 38.9,6 48.1,7 1.002,8 1.133,9 0.644,10 4.445}
{0 CHEMBL1330077,1 315.39,2 0.135,3 5.7,4 9.011,5 40,6 37.1,7 1.022,8 1.128,9 0.704,10 4.445}
{0 CHEMBL1331226,1 356.41,2 0.083,3 10.9,4 7.748,5 41.3,6 43.5,7 1.017,8 1.126,9 0.655,10 5.059}
{0 CHEMBL1332512,1 362.49,2 0.106,3 2.3,4 8.238,5 45.5,6 40.9,7 1,8 1.114,9 0.715,10 4.59}
{0 CHEMBL1334848,1 391.47,2 0.146,3 10.3,4 10.038,5 38.5,6 33.3,7 1.039,8 1.124,9 0.723,10 4.445}
{0 CHEMBL1335068,1 381.4,2 0.116,3 17.1,4 9.302,5 36.6,6 36.6,7 1.048,8 1.131,9 0.669,10 4.593}
{0 CHEMBL1335291,1 400.57,2 0.079,3 6.6,4 6.567,5 37.7,6 52.5,7 0.996,8 1.132,9 0.627,10 4.445}
{0 CHEMBL1336789,1 386.46,2 0.125,3 11.1,4 8.588,5 42.2,6 40,7 1.022,8 1.117,9 0.689,10 4.445}
{0 CHEMBL1337807,1 418.61,2 0.167,3 6.8,4 7.095,5 37.3,6 50.8,7 0.999,8 1.128,9 0.646,10 4.445}
{0 CHEMBL1337957,1 328.4,2 0.109,3 9.1,4 7.464,5 40.9,6 45.5,7 1.011,8 1.127,9 0.652,10 4.875}
{0 CHEMBL1338983,1 369.41,2 0.125,3 10.9,4 8.031,5 41.3,6 41.3,7 1.022,8 1.127,9 0.66,10 4.445}
{0 CHEMBL1339071,1 312.4,2 0.07,4 7.81,5 50,6 40,7 0.993,8 1.112,9 0.715,10 4.462}
{0 CHEMBL1339283,1 313.42,2 0.043,3 2.3,4 7.289,5 51.2,6 44.2,7 0.986,8 1.103,9 0.705,10 4.445}
{0 CHEMBL1339546,1 333.85,2 0.133,3 4.7,4 7.764,5 39.5,6 46.5,7 1.005,8 1.13,9 0.666,10 4.867}
{0 CHEMBL1339547,1 302.38,2 0.108,3 8.6,4 8.639,5 42.9,6 40,7 1.016,8 1.115,9 0.703,10 4.4}
{0 CHEMBL1339694,1 383.42,2 0.102,3 8.7,4 8.335,5 52.2,6 37,7 1.01,8 1.101,9 0.716,10 4.445}
{0 CHEMBL1340423,1 473.59,2 0.091,3 4.8,4 7.639,5 40.3,6 43.5,7 1.009,8 1.133,9 0.662,10 4.87}
{0 CHEMBL1341317,1 330.79,2 0.075,3 7.9,4 8.705,5 44.7,6 39.5,7 1.018,8 1.118,9 0.699,10 5.031}
{0 CHEMBL1342033,1 311.15,2 0.1,3 10.3,4 10.729,5 41.4,6 37.9,7 1.029,8 1.122,9 0.708,10 4.445}
{0 CHEMBL1343218,1 349.45,2 0.205,3 9.3,4 8.127,5 37.2,6 44.2,7 1.018,8 1.13,9 0.665,10 4.445}
{0 CHEMBL1344348,1 398.49,2 0.146,3 6.5,4 8.663,5 39.1,6 39.1,7 1.021,8 1.131,9 0.687,10 4.445}
{0 CHEMBL1345229,1 267.38,2 0.027,3 8.6,4 7.639,5 37.1,6 48.6,7 1.007,8 1.125,9 0.66,10 4.786}
{0 CHEMBL1346405,1 308.35,2 0.147,3 12.1,4 9.344,5 36.4,6 36.4,7 1.04,8 1.134,9 0.683,10 4.445}
{0 CHEMBL1347672,1 218.22,2 0.037,3 15.4,4 8.393,5 46.2,6 38.5,7 1.028,8 1.112,9 0.678,10 4.538}
{0 CHEMBL1348955,1 247.37,2 0.025,3 5.1,4 6.343,5 38.5,6 53.8,7 0.99,8 1.13,9 0.629,10 4.884}
{0 CHEMBL1349095,1 337.41,2 0.065,3 6.8,4 7.668,5 43.2,6 43.2,7 1.008,8 1.124,9 0.67,10 4.445}
{0 CHEMBL1349155,1 430.38,2 0.094,3 3.9,4 8.439,5 41.2,6 47.1,7 0.998,8 1.124,9 0.679,10 4.445}
{0 CHEMBL1350077,1 328.34,2 0.057,3 6.1,4 9.95,5 42.4,6 33.3,7 1.054,8 1.147,9 0.695,10 4.445}
{0 CHEMBL1350250,1 307.32,2 0.161,3 13.3,4 10.244,5 36.7,6 30,7 1.055,8 1.136,9 0.701,10 4.463}
{0 CHEMBL1350292,1 386.49,2 0.143,3 9.3,4 7.157,5 38.9,6 48.1,7 1.008,8 1.13,9 0.637,10 4.445}
{0 CHEMBL1350576,1 313.73,2 0.091,4 9.804,5 43.8,6 34.4,7 1.046,8 1.155,9 0.695,10 4.445}
{0 CHEMBL1352064,1 357.42,2 0.167,3 10,4 8.935,5 42.5,6 37.5,7 1.025,8 1.119,9 0.701,10 4.816}
{0 CHEMBL1353381,1 312.34,2 0.121,3 3.1,4 9.761,5 43.8,6 34.4,7 1.045,8 1.145,9 0.703,10 4.885}
{0 CHEMBL1355445,1 422.51,2 0.137,3 6.3,4 8.802,5 41.7,6 37.5,7 1.02,8 1.126,9 0.7,10 4.445}
{0 CHEMBL1355544,1 473.65,2 0.136,3 7.8,4 7.401,5 37.5,6 48.4,7 1.006,8 1.129,9 0.65,10 4.637}
{0 CHEMBL1359086,1 432.6,2 0.133,3 6.9,4 7.459,5 36.2,6 48.3,7 1.007,8 1.133,9 0.649,10 4.445}
{0 CHEMBL1359493,1 463.6,2 0.121,3 4.8,4 7.359,5 38.1,6 46,7 1.007,8 1.138,9 0.647,10 4.445}
{0 CHEMBL1359805,1 380.45,2 0.154,3 11.8,4 7.46,5 33.3,6 47.1,7 1.024,8 1.145,9 0.615,10 4.445}
{0 CHEMBL1361674,1 453.99,2 0.125,3 9.3,4 8.407,5 37,6 44.4,7 1.02,8 1.129,9 0.67,10 4.445}
{0 CHEMBL1361709,1 462.37,2 0.132,3 4,4 9.247,5 48,6 40,7 1.003,8 1.11,9 0.723,10 4.4}
{0 CHEMBL1365924,1 329.42,2 0.1,3 5.3,4 8.669,5 39.5,6 39.5,7 1.017,8 1.129,9 0.695,10 4.445}
{0 CHEMBL1366319,1 349.41,2 0.103,3 2.8,4 9.706,5 44.4,6 30.6,7 1.025,8 1.124,9 0.741,10 4.771}
{0 CHEMBL1366895,1 329.46,2 0.091,3 4.8,4 7.844,5 40.5,6 45.2,7 1.003,8 1.123,9 0.683,10 4.4}
{0 CHEMBL1367428,1 274.13,2 0.148,3 11.1,4 10.153,5 37,6 44.4,7 1.023,8 1.128,9 0.677,10 4.768}
{0 CHEMBL1368216,1 262.29,2 0.118,3 12.1,4 7.948,5 39.4,6 42.4,7 1.025,8 1.131,9 0.648,10 4.445}
{0 CHEMBL1368708,1 448.63,2 0.088,3 5.6,4 8.308,5 35.2,6 44.4,7 1.013,8 1.133,9 0.677,10 4.857}
{0 CHEMBL1370927,1 202.23,2 0.038,3 8,4 8.089,5 44,6 40,7 1.016,8 1.123,9 0.679,10 4.735}
{0 CHEMBL1372451,1 332.44,2 0.111,3 5.9,4 9.778,5 41.2,6 35.3,7 1.022,8 1.115,9 0.743,10 4.446}
{0 CHEMBL1372654,1 493.63,2 0.091,3 8.1,4 7.962,5 41.9,6 43.5,7 1.01,8 1.12,9 0.679,10 4.87}
{0 CHEMBL1372947,1 389.59,2 0.152,3 6.3,4 6.184,5 36.5,6 55.6,7 0.991,8 1.133,9 0.615,10 4.445}
{0 CHEMBL1373969,1 420.37,2 0.094,3 3.9,4 8.243,5 41.2,6 45.1,7 1.006,8 1.125,9 0.687,10 5.327}
{0 CHEMBL1375217,1 370.81,2 0.116,3 9.8,4 9.044,5 46.3,6 36.6,7 1.025,8 1.114,9 0.708,10 4.559}
{0 CHEMBL1375564,1 388.51,2 0.138,3 8.9,4 6.938,5 37.5,6 50,7 1.006,8 1.133,9 0.628,10 4.445}
{0 CHEMBL1375844,1 420.84,2 0.146,3 13,4 9.149,5 39.1,6 37,7 1.041,8 1.133,9 0.673,10 4.498}
{0 CHEMBL1377245,1 349.47,2 0.077,3 4.1,4 7.132,5 42.9,6 46.9,7 0.996,8 1.124,9 0.664,10 4.445}
{0 CHEMBL1377495,1 460.56,2 0.175,3 10.7,4 8.224,5 37.5,6 42.9,7 1.023,8 1.131,9 0.661,10 4.445}
{0 CHEMBL1378385,1 285.76,2 0.059,4 8.93,5 43.8,6 37.5,7 1.011,8 1.128,9 0.717,10 4.954}
{0 CHEMBL1379948,1 350.4,2 0.106,3 9.1,4 7.964,5 45.5,6 40.9,7 1.013,8 1.117,9 0.68,10 4.445}
{0 CHEMBL1380143,1 330.35,2 0.098,3 7.7,4 8.471,5 41,6 38.5,7 1.031,8 1.14,9 0.664,10 5.072}
{0 CHEMBL1380630,1 391.45,2 0.133,3 11.4,4 8.897,5 36.4,6 38.6,7 1.035,8 1.135,9 0.671,10 4.925}
{0 CHEMBL1381248,1 312.41,2 0.121,3 9.4,4 9.763,5 34.4,6 37.5,7 1.034,8 1.129,9 0.71,10 4.445}
{0 CHEMBL1381741,1 391.44,2 0.109,3 13.6,4 8.896,5 38.6,6 38.6,7 1.035,8 1.127,9 0.675,10 4.445}
{0 CHEMBL1381921,1 519.83,2 0.176,3 12,4 10.397,5 38,6 40,7 1.033,8 1.122,9 0.704,10 4.445}
{0 CHEMBL1383315,1 439.53,2 0.111,3 9.6,4 8.452,5 42.3,6 40.4,7 1.019,8 1.119,9 0.688,10 5.401}
{0 CHEMBL1383927,1 421.44,2 0.132,3 12,4 8.429,5 44,6 38,7 1.027,8 1.121,9 0.677,10 4.445}
{0 CHEMBL1384085,1 414.58,2 0.069,3 5.5,4 7.538,5 38.2,6 47.3,7 1.003,8 1.129,9 0.662,10 4.648}
{0 CHEMBL1384939,1 414.6,2 0.091,3 6.3,4 6.478,5 37.5,6 53.1,7 0.995,8 1.132,9 0.625,10 4.445}
{0 CHEMBL1385112,1 320.37,2 0.093,3 7.5,4 8.009,5 47.5,6 40,7 1.009,8 1.113,9 0.693,10 4.445}
{0 CHEMBL1385327,1 410.99,2 0.133,3 6.8,4 6.966,5 35.6,6 52.5,7 1.002,8 1.136,9 0.629,10 5.072}
{0 CHEMBL1387702,1 322.38,2 0.135,3 11.1,4 8.955,5 36.1,6 38.9,7 1.034,8 1.134,9 0.675,10 4.445}
{0 CHEMBL1387923,1 331.81,2 0.088,3 3.1,4 10.369,5 43.8,6 31.3,7 1.028,8 1.119,9 0.759,10 5.289}
{0 CHEMBL1389754,1 342.41,2 0.15,3 7.9,4 9.011,5 42.1,6 36.8,7 1.023,8 1.122,9 0.706,10 4.445}
{0 CHEMBL1389892,1 400.52,2 0.117,3 8.8,4 7.027,5 38.6,6 49.1,7 1.006,8 1.131,9 0.635,10 4.445}
{0 CHEMBL1391033,1 372.51,2 0.116,3 4.9,4 9.086,5 41.5,6 39,7 1.013,8 1.116,9 0.727,10 4.445}
{0 CHEMBL1393091,1 448.47,2 0.145,3 11.3,4 8.462,5 43.4,6 37.7,7 1.027,8 1.124,9 0.676,10 4.445}
{0 CHEMBL1393156,1 477.71,2 0.169,3 6.3,4 7.583,5 36.5,6 49.2,7 1.002,8 1.127,9 0.663,10 4.659}
{0 CHEMBL1393412,1 402.49,2 0.127,3 3.8,4 7.594,5 39.6,6 45.3,7 1.015,8 1.145,9 0.645,10 4.801}
{0 CHEMBL1393911,1 463.97,2 0.119,3 3.6,4 8.285,5 46.4,6 41.1,7 1.009,8 1.121,9 0.698,10 4.932}
{0 CHEMBL1396313,1 401.45,2 0.185,3 13.5,4 7.72,5 40.4,6 44.2,7 1.021,8 1.126,9 0.645,10 4.445}
{0 CHEMBL1396740,1 319.44,2 0.163,3 8.3,4 6.655,5 37.5,6 52.1,7 1,8 1.132,9 0.624,10 4.445}
{0 CHEMBL1396943,1 390.5,2 0.157,3 10.2,4 7.969,5 38.8,6 44.9,7 1.015,8 1.125,9 0.664,10 4.445}
{0 CHEMBL1396951,1 306.27,2 0.086,3 11.8,4 9.008,5 35.3,6 38.2,7 1.066,8 1.169,9 0.617,10 4.445}
{0 CHEMBL1398705,1 354.86,2 0.065,3 4.5,4 8.065,5 45.5,6 43.2,7 1.003,8 1.116,9 0.696,10 5.176}
{0 CHEMBL1399772,1 343.25,2 0.079,4 9.535,5 44.4,6 41.7,7 0.998,8 1.12,9 0.721,10 5.495}
{0 CHEMBL1399858,1 437.42,2 0.094,3 4,4 8.748,5 42,6 44,7 1.006,8 1.116,9 0.713,10 4.888}
{0 CHEMBL1400374,1 438.93,2 0.12,3 10.4,4 9.144,5 37.5,6 39.6,7 1.032,8 1.13,9 0.685,10 4.892}
{0 CHEMBL1400379,1 337.45,2 0.158,3 10.8,4 9.12,5 40.5,6 40.5,7 1.02,8 1.11,9 0.715,10 4.445}
{0 CHEMBL1402758,1 303.41,2 0.154,3 7.9,4 7.984,5 42.1,6 44.7,7 1.006,8 1.115,9 0.687,10 4.445}
{0 CHEMBL1403168,1 316.46,2 0.093,3 4.8,4 7.535,5 40.5,6 47.6,7 0.997,8 1.121,9 0.677,10 4.445}
{0 CHEMBL1406398,1 461.69,2 0.145,3 6,4 6.891,5 35.8,6 52.2,7 0.997,8 1.133,9 0.637,10 4.445}
{0 CHEMBL1406616,1 290.77,2 0.081,3 5.7,4 8.308,5 42.9,6 42.9,7 1.01,8 1.122,9 0.689,10 5.031}
{0 CHEMBL1408016,1 387.9,2 0.118,3 6.1,4 7.916,5 40.8,6 44.9,7 1.009,8 1.127,9 0.67,10 4.445}
{0 CHEMBL1408691,1 413.35,2 0.105,3 5.6,4 11.482,5 38.9,6 36.1,7 1.024,8 1.116,9 0.761,10 4.445}
{0 CHEMBL1408992,1 379.48,2 0.106,3 4.5,4 8.625,5 43.2,6 38.6,7 1.012,8 1.121,9 0.708,10 4.445}
{0 CHEMBL1409060,1 354.47,2 0.065,3 4.7,4 8.243,5 41.9,6 41.9,7 1.008,8 1.122,9 0.696,10 5.016}
{0 CHEMBL1409474,1 330.39,2 0.103,3 10.8,4 8.929,5 43.2,6 37.8,7 1.024,8 1.115,9 0.704,10 4.445}
{0 CHEMBL1411648,1 224.23,2 0.037,3 8,4 8.969,5 52,6 32,7 1.02,8 1.106,9 0.728,10 4.894}
{0 CHEMBL1412284,1 264.33,2 0.097,3 10,4 8.811,5 40,6 40,7 1.023,8 1.121,9 0.694,10 5.08}
{0 CHEMBL1412433,1 247.39,2 0.175,4 6.343,5 33.3,6 53.8,7 0.989,8 1.149,9 0.618,10 5.157}
{0 CHEMBL1412449,1 332.37,2 0.108,3 11.4,4 9.496,5 40,6 34.3,7 1.038,8 1.126,9 0.701,10 4.445}
{0 CHEMBL1412525,1 345.42,2 0.146,3 7.7,4 8.857,5 38.5,6 38.5,7 1.025,8 1.131,9 0.688,10 4.445}
{0 CHEMBL1412560,1 301.21,2 0.103,3 3.6,4 10.758,5 42.9,6 35.7,7 1.024,8 1.11,9 0.773,10 4.445}
{0 CHEMBL1412573,1 251.23,4 9.663,5 46.2,6 30.8,7 1.053,8 1.161,9 0.688,10 4.982}
{0 CHEMBL1413003,1 419.45,2 0.057,3 4,4 8.389,5 40,6 40,7 1.033,8 1.153,9 0.652,10 4.754}
{0 CHEMBL1413178,1 216.29,2 0.038,4 9.404,5 43.5,6 34.8,7 1.011,8 1.119,9 0.748,10 5.456}
{0 CHEMBL1414984,1 421.54,2 0.109,3 7.5,4 7.954,5 37.7,6 45.3,7 1.017,8 1.135,9 0.657,10 4.445}
{0 CHEMBL1415554,1 360.38,2 0.159,3 9.5,4 8.58,5 33.3,6 38.1,7 1.039,8 1.154,9 0.641,10 4.445}
{0 CHEMBL1417374,1 345.38,2 0.091,3 7.3,4 8.424,5 48.8,6 36.6,7 1.014,8 1.113,9 0.706,10 4.445}
{0 CHEMBL1418980,1 287.79,2 0.061,3 9.4,4 8.993,5 37.5,6 43.8,7 1.021,8 1.122,9 0.694,10 4.792}
{0 CHEMBL1420204,1 339.45,2 0.093,3 4.9,4 8.279,5 43.9,6 41.5,7 1.005,8 1.116,9 0.705,10 4.958}
{0 CHEMBL1420606,1 371.51,2 0.114,3 7.1,4 8.845,5 45.2,6 40.5,7 1.007,8 1.102,9 0.732,10 4.916}
{0 CHEMBL1421321,1 318.34,2 0.075,3 7.9,4 8.377,5 39.5,6 39.5,7 1.032,8 1.143,9 0.655,10 4.906}
{0 CHEMBL1421738,1 347.85,2 0.077,3 5.4,4 9.401,5 43.2,6 37.8,7 1.018,8 1.115,9 0.73,10 4.4}
{0 CHEMBL1421781,1 353.36,2 0.048,4 8.834,5 40,6 37.5,7 1.044,8 1.169,9 0.653,10 5.105}
{0 CHEMBL1424665,1 364.44,2 0.08,3 6.4,4 7.754,5 42.6,6 42.6,7 1.01,8 1.126,9 0.67,10 4.4}
{0 CHEMBL1426939,1 436.36,2 0.157,3 4,4 8.727,5 40,6 46,7 1.008,8 1.133,9 0.672,10 4.445}
{0 CHEMBL1427335,1 387.36,2 0.089,3 11.9,4 9.223,5 40.5,6 33.3,7 1.049,8 1.142,9 0.668,10 4.569}
{0 CHEMBL1427505,1 389.46,2 0.1,3 7.9,4 10.249,5 44.7,6 31.6,7 1.036,8 1.115,9 0.748,10 4.445}
{0 CHEMBL1429074,1 491.45,2 0.07,3 5.7,4 9.273,5 39.6,6 43.4,7 1.01,8 1.123,9 0.698,10 4.4}
{0 CHEMBL1433533,1 402.46,2 0.167,3 9.6,4 7.74,5 40.4,6 44.2,7 1.021,8 1.134,9 0.646,10 4.445}
{0 CHEMBL1433789,1 474.46,2 0.138,3 17.9,4 8.472,5 39.3,6 39.3,7 1.041,8 1.129,9 0.646,10 4.445}
{0 CHEMBL1436916,1 404.86,2 0.093,3 10,4 10.121,5 42.5,6 32.5,7 1.038,8 1.119,9 0.729,10 4.445}
{0 CHEMBL1438470,1 322.43,2 0.063,3 4.3,4 7.009,5 34.8,6 50,7 1.009,8 1.15,9 0.619,10 4.714}
{0 CHEMBL1438505,1 248.26,2 0.097,3 13.3,4 8.275,5 40,6 40,7 1.031,8 1.13,9 0.655,10 4.967}
{0 CHEMBL1438559,1 231.31,4 9.252,5 40,6 36,7 1.014,8 1.13,9 0.728,10 4.875}
{0 CHEMBL1439259,1 432.6,2 0.117,3 6.9,4 7.459,5 36.2,6 48.3,7 1.007,8 1.133,9 0.649,10 4.445}
{0 CHEMBL1440409,1 335.37,2 0.048,4 8.384,5 40,6 40,7 1.031,8 1.16,9 0.654,10 5.198}
{0 CHEMBL1440892,1 339.42,2 0.083,3 8.7,4 7.379,5 43.5,6 45.7,7 1.005,8 1.119,9 0.662,10 4.824}
{0 CHEMBL1443177,1 261.34,2 0.081,3 2.9,4 7.467,5 51.4,6 42.9,7 0.989,8 1.103,9 0.708,10 4.722}
{0 CHEMBL1444382,1 323.82,2 0.111,3 8.6,4 9.252,5 42.9,6 40,7 1.019,8 1.111,9 0.72,10 4.446}
{0 CHEMBL1444434,1 359.42,2 0.146,3 10.6,4 7.647,5 38.3,6 44.7,7 1.019,8 1.134,9 0.641,10 5.1}
{0 CHEMBL1444919,1 444.56,2 0.127,3 3.8,4 8.549,5 44.2,6 38.5,7 1.01,8 1.12,9 0.71,10 4.445}
{0 CHEMBL1445152,1 454.06,2 0.091,3 5.7,4 8.567,5 37.7,6 45.3,7 1.009,8 1.122,9 0.696,10 4.4}
{0 CHEMBL1445386,1 420.46,2 0.055,3 9.8,4 8.244,5 43.1,6 39.2,7 1.022,8 1.125,9 0.674,10 4.445}
{0 CHEMBL1446737,1 388.53,2 0.173,3 7.8,4 7.618,5 39.2,6 47.1,7 1.006,8 1.124,9 0.664,10 4.445}
{0 CHEMBL1446989,1 323.73,2 0.103,3 14.8,4 11.99,5 44.4,6 22.2,7 1.066,8 1.112,9 0.773,10 4.445}
{0 CHEMBL1448184,1 410.57,2 0.2,3 8.2,4 8.379,5 34.7,6 44.9,7 1.017,8 1.131,9 0.673,10 4.445}
{0 CHEMBL1450191,1 372.55,2 0.063,3 4.4,4 8.279,5 42.2,6 44.4,7 0.999,8 1.111,9 0.713,10 4.919}
{0 CHEMBL1452295,1 283.42,2 0.051,3 2.7,4 7.66,5 45.9,6 45.9,7 0.988,8 1.107,9 0.708,10 4.62}
{0 CHEMBL1453121,1 302.4,2 0.093,3 2.4,4 7.376,5 48.8,6 43.9,7 0.99,8 1.11,9 0.697,10 4.4}
{0 CHEMBL1453181,1 412.57,2 0.12,3 6.3,4 8.595,5 43.8,6 41.7,7 1.006,8 1.108,9 0.719,10 4.922}
{0 CHEMBL1453780,1 403.99,2 0.117,3 5.2,4 6.965,5 39.7,6 51.7,7 0.994,8 1.126,9 0.649,10 4.7}
{0 CHEMBL1454557,1 408.75,2 0.15,3 15.8,4 10.757,5 42.1,6 26.3,7 1.072,8 1.137,9 0.7,10 4.445}
{0 CHEMBL1455565,1 354.5,2 0.055,3 3.8,4 6.817,5 38.5,6 50,7 0.996,8 1.134,9 0.641,10 4.4}
{0 CHEMBL1456171,1 283.36,2 0.103,3 5.3,4 7.457,5 42.1,6 44.7,7 1.004,8 1.127,9 0.665,10 4.585}
{0 CHEMBL1456725,1 318.28,2 0.083,3 11.4,4 9.094,5 37.1,6 37.1,7 1.064,8 1.165,9 0.628,10 4.965}
{0 CHEMBL1457927,1 570.51,2 0.173,3 8,4 11.41,5 40,6 26,7 1.091,8 1.167,9 0.696,10 4.659}
{0 CHEMBL1459712,1 303.3,2 0.167,3 14.3,4 8.666,5 40,6 37.1,7 1.039,8 1.132,9 0.66,10 4.525}
{0 CHEMBL1459876,1 444.48,2 0.137,3 10.4,4 9.26,5 41.7,6 35.4,7 1.038,8 1.129,9 0.692,10 4.445}
{0 CHEMBL1460895,1 352.42,2 0.125,3 8.7,4 7.661,5 43.5,6 43.5,7 1.01,8 1.121,9 0.667,10 4.445}
{0 CHEMBL1460902,1 399.48,2 0.161,3 11.1,4 7.398,5 40.7,6 46.3,7 1.012,8 1.125,9 0.646,10 4.445}
{0 CHEMBL1461035,1 508.76,2 0.12,3 2.8,4 7.066,5 37.5,6 50,7 0.994,8 1.133,9 0.653,10 5.256}
{0 CHEMBL1461482,1 356.32,2 0.15,3 15.8,4 9.377,5 42.1,6 31.6,7 1.05,8 1.129,9 0.679,10 4.445}
{0 CHEMBL1462756,1 316.35,2 0.073,3 10.3,4 8.112,5 38.5,6 41,7 1.026,8 1.136,9 0.652,10 4.781}
{0 CHEMBL1464490,1 475.56,2 0.138,3 9.1,4 8.647,5 45.5,6 38.2,7 1.018,8 1.113,9 0.705,10 4.445}
{0 CHEMBL1465404,1 321.4,2 0.132,3 8.1,4 8.686,5 35.1,6 40.5,7 1.027,8 1.138,9 0.672,10 4.446}
{0 CHEMBL1465978,1 242.33,2 0.034,4 8.975,5 44.4,6 37,7 1.005,8 1.117,9 0.739,10 4.446}
{0 CHEMBL1466076,1 317.4,2 0.211,3 8.1,4 8.578,5 40.5,6 40.5,7 1.018,8 1.123,9 0.692,10 4.445}
{0 CHEMBL1466711,1 361.46,2 0.109,3 9.1,4 8.215,5 38.6,6 43.2,7 1.017,8 1.127,9 0.672,10 4.445}
{0 CHEMBL1467678,1 378.59,2 0.145,3 1.7,4 6.31,5 40,6 53.3,7 0.982,8 1.129,9 0.642,10 4.978}
{0 CHEMBL1469549,1 317.38,2 0.091,3 9.5,4 7.557,5 38.1,6 45.2,7 1.016,8 1.135,9 0.641,10 4.445}
{0 CHEMBL1469670,1 388.6,2 0.115,3 4,4 7.772,5 40,6 48,7 0.995,8 1.116,9 0.692,10 5.27}
{0 CHEMBL1469961,1 356.42,2 0.104,3 8.7,4 7.748,5 39.1,6 43.5,7 1.017,8 1.134,9 0.651,10 4.906}
{0 CHEMBL1470063,1 409.54,2 0.13,3 2.3,4 9.524,5 41.9,6 34.9,7 1.017,8 1.121,9 0.74,10 4.916}
{0 CHEMBL1471788,1 380.48,2 0.043,4 8.455,5 40,6 42.2,7 1.022,8 1.148,9 0.674,10 4.911}
{0 CHEMBL1471916,1 287.34,2 0.125,3 3.3,4 9.578,5 46.7,6 33.3,7 1.025,8 1.121,9 0.737,10 5.105}
{0 CHEMBL1472424,1 375.88,2 0.184,3 8.3,4 7.831,5 41.7,6 45.8,7 1.009,8 1.122,9 0.668,10 4.445}
{0 CHEMBL1472570,1 323.85,2 0.094,3 3.3,4 10.795,5 43.3,6 33.3,7 1.021,8 1.105,9 0.789,10 4.981}
{0 CHEMBL1475194,1 317.35,2 0.086,3 12.1,4 9.617,5 42.4,6 33.3,7 1.037,8 1.119,9 0.713,10 4.446}
{0 CHEMBL1475299,1 381.47,2 0.056,3 7.8,4 7.48,5 41.2,6 45.1,7 1.009,8 1.127,9 0.656,10 4.686}
{0 CHEMBL1479011,1 393.29,2 0.132,3 5.6,4 10.925,5 41.7,6 36.1,7 1.022,8 1.118,9 0.743,10 4.4}
{0 CHEMBL1479201,1 227.34,2 0.028,4 6.686,5 41.2,6 50,7 0.985,8 1.129,9 0.657,10 4.872}
{0 CHEMBL1480140,1 384.47,2 0.167,3 9.6,4 7.394,5 40.4,6 46.2,7 1.011,8 1.127,9 0.647,10 4.445}
{0 CHEMBL1480504,1 351.35,2 0.186,3 16.7,4 8.365,5 35.7,6 40.5,7 1.042,8 1.14,9 0.632,10 4.446}
{0 CHEMBL1480880,1 283.3,2 0.083,3 11.8,4 8.332,5 47.1,6 38.2,7 1.021,8 1.113,9 0.688,10 4.922}
{0 CHEMBL1480936,1 451.52,2 0.102,3 5.5,4 8.209,5 47.3,6 38.2,7 1.01,8 1.117,9 0.7,10 4.445}
{0 CHEMBL1481067,1 339.41,2 0.075,3 5.4,4 9.173,5 43.2,6 35.1,7 1.021,8 1.121,9 0.72,10 4.445}
{0 CHEMBL1481928,1 337.41,2 0.103,4 9.372,5 47.2,6 33.3,7 1.018,8 1.123,9 0.741,10 4.446}
{0 CHEMBL1483497,1 350.4,2 0.106,3 9.1,4 7.964,5 45.5,6 40.9,7 1.013,8 1.117,9 0.68,10 4.445}
{0 CHEMBL1484503,1 310.5,2 0.065,4 7.057,5 43.2,6 50,7 0.98,8 1.115,9 0.688,10 4.531}
{0 CHEMBL1484596,1 438.92,2 0.118,3 12.5,4 9.144,5 39.6,6 39.6,7 1.032,8 1.122,9 0.69,10 4.445}
{0 CHEMBL1485039,1 336.4,2 0.073,3 12.8,4 8.626,5 38.5,6 41,7 1.028,8 1.125,9 0.673,10 4.445}
{0 CHEMBL1486651,1 370.51,2 0.16,3 6.3,4 7.719,5 41.7,6 45.8,7 1.002,8 1.119,9 0.68,10 4.662}
{0 CHEMBL1487723,1 340.49,2 0.106,3 2.3,4 7.738,5 40.9,6 45.5,7 0.997,8 1.124,9 0.687,10 4.729}
{0 CHEMBL1487959,1 454.37,2 0.14,3 9.8,4 11.082,5 46.3,6 31.7,7 1.034,8 1.097,9 0.785,10 4.445}
{0 CHEMBL1488101,1 472.98,2 0.127,3 9.4,4 8.924,5 43.4,6 39.6,7 1.02,8 1.114,9 0.706,10 4.727}
{0 CHEMBL1488229,1 262.29,2 0.176,3 12.1,4 7.948,5 39.4,6 42.4,7 1.025,8 1.131,9 0.648,10 4.445}
{0 CHEMBL1488497,1 420.48,2 0.137,3 14.3,4 8.581,5 38.8,6 40.8,7 1.031,8 1.125,9 0.667,10 4.445}
{0 CHEMBL1489923,1 443.01,2 0.047,3 1.7,4 7.509,5 40.7,6 47.5,7 1.001,8 1.134,9 0.664,10 4.418}
{0 CHEMBL1490392,1 231.23,2 0.036,3 11.5,4 8.893,5 42.3,6 34.6,7 1.036,8 1.13,9 0.679,10 4.495}
{0 CHEMBL1490835,1 434.56,2 0.164,3 5.7,4 8.199,5 43.4,6 41.5,7 1.008,8 1.118,9 0.696,10 4.445}
{0 CHEMBL1491289,1 316.32,2 0.135,3 8.6,4 9.038,5 34.3,6 34.3,7 1.045,8 1.156,9 0.655,10 4.445}
{0 CHEMBL1491483,1 393.5,2 0.109,3 3.8,4 7.567,5 38.5,6 44.2,7 1.008,8 1.139,9 0.655,10 4.445}
{0 CHEMBL1491703,1 306.39,2 0.023,3 4.9,4 7.473,5 46.3,6 43.9,7 0.998,8 1.116,9 0.683,10 4.623}
{0 CHEMBL1492131,1 365.42,2 0.093,3 9.8,4 8.913,5 39,6 39,7 1.034,8 1.134,9 0.677,10 4.445}
{0 CHEMBL1494091,1 342.44,2 0.082,3 6.4,4 7.286,5 38.3,6 46.8,7 1.007,8 1.135,9 0.643,10 5.08}
{0 CHEMBL1494764,1 208.26,2 0.087,3 9.1,4 9.466,5 40.9,6 36.4,7 1.027,8 1.117,9 0.721,10 4.445}
{0 CHEMBL1495129,1 442.53,2 0.125,3 11.3,4 8.35,5 41.5,6 41.5,7 1.02,8 1.119,9 0.679,10 4.445}
{0 CHEMBL1495764,1 368.45,2 0.136,3 7.1,4 8.773,5 42.9,6 38.1,7 1.018,8 1.12,9 0.705,10 4.445}
{0 CHEMBL1498437,1 384.42,2 0.12,3 12.5,4 8.009,5 41.7,6 41.7,7 1.023,8 1.125,9 0.658,10 4.445}
{0 CHEMBL1498550,1 405.59,2 0.096,3 6,4 8.112,5 38,6 46,7 1.006,8 1.122,9 0.686,10 4.4}
{0 CHEMBL1498709,1 382.65,2 0.162,3 10.8,4 10.342,5 35.1,6 37.8,7 1.048,8 1.137,9 0.696,10 4.547}
{0 CHEMBL1499512,1 316.32,2 0.135,3 8.6,4 9.038,5 34.3,6 34.3,7 1.045,8 1.156,9 0.655,10 4.445}
{0 CHEMBL1502254,1 365.42,2 0.125,3 8.7,4 7.944,5 43.5,6 41.3,7 1.015,8 1.123,9 0.672,10 4.915}
{0 CHEMBL1503291,1 419.33,2 0.095,3 5,4 10.483,5 42.5,6 37.5,7 1.017,8 1.117,9 0.738,10 4.445}
{0 CHEMBL1504109,1 476.98,2 0.107,3 9.4,4 9,5 39.6,6 39.6,7 1.026,8 1.125,9 0.692,10 4.793}
{0 CHEMBL1504769,1 311.33,2 0.132,3 8.3,4 8.648,5 41.7,6 36.1,7 1.028,8 1.133,9 0.679,10 4.445}
{0 CHEMBL1507740,1 314.4,2 0.158,3 5.6,4 8.733,5 41.7,6 38.9,7 1.015,8 1.122,9 0.705,10 4.445}
{0 CHEMBL1508246,1 302.35,2 0.122,3 12.5,4 7.559,5 42.5,6 45,7 1.015,8 1.12,9 0.653,10 4.724}
{0 CHEMBL1508267,1 331.41,2 0.133,4 7.707,5 39.5,6 44.2,7 1.014,8 1.151,9 0.651,10 4.958}
{0 CHEMBL1509187,1 372.49,2 0.149,3 6.5,4 8.098,5 39.1,6 43.5,7 1.012,8 1.127,9 0.677,10 4.445}
{0 CHEMBL1509868,1 415.61,2 0.067,3 5.2,4 7.166,5 37.9,6 50,7 0.997,8 1.128,9 0.654,10 4.879}
{0 CHEMBL1510591,1 415.54,2 0.131,3 8.5,4 7.043,5 37.3,6 49.2,7 1.007,8 1.135,9 0.63,10 4.445}
{0 CHEMBL1511273,1 296.31,2 0.083,3 8.8,4 8.715,5 44.1,6 35.3,7 1.027,8 1.126,9 0.689,10 4.965}
{0 CHEMBL1511447,1 335.45,2 0.083,3 2.2,4 7.292,5 41.3,6 45.7,7 0.998,8 1.131,9 0.665,10 4.745}
{0 CHEMBL1511754,1 390.6,2 0.083,3 5.3,4 6.853,5 36.8,6 52.6,7 0.994,8 1.129,9 0.644,10 4.805}
{0 CHEMBL1513666,1 451.57,2 0.138,3 8.1,4 7.283,5 40.3,6 46.8,7 1.007,8 1.128,9 0.648,10 4.445}
{0 CHEMBL1514116,1 447.56,2 0.138,3 10.7,4 7.992,5 37.5,6 44.6,7 1.019,8 1.129,9 0.657,10 4.698}
{0 CHEMBL1514916,1 330.46,2 0.019,3 8,4 6.609,5 40,6 52,7 0.996,8 1.125,9 0.634,10 4.399}
{0 CHEMBL1515941,1 479.07,2 0.07,3 5.6,4 8.872,5 38.9,6 42.6,7 1.013,8 1.121,9 0.707,10 4.683}
{0 CHEMBL1516127,1 430.55,2 0.1,3 8.5,4 9.161,5 40.4,6 38.3,7 1.022,8 1.119,9 0.712,10 5.066}
{0 CHEMBL1517445,1 389.33,2 0.098,3 5.1,4 9.983,5 48.7,6 28.2,7 1.059,8 1.148,9 0.699,10 4.4}
{0 CHEMBL1517567,1 384.45,2 0.087,3 9.3,4 8.941,5 41.9,6 37.2,7 1.025,8 1.122,9 0.699,10 4.445}
{0 CHEMBL1517605,1 487.71,2 0.077,3 4.8,4 7.866,5 37.1,6 46.8,7 1.004,8 1.128,9 0.675,10 4.873}
{0 CHEMBL1517735,1 323.37,2 0.093,3 9.8,4 7.887,5 46.3,6 41.5,7 1.012,8 1.114,9 0.681,10 4.445}
{0 CHEMBL1522312,1 360.46,2 0.136,3 4.8,4 8.582,5 50,6 38.1,7 1.003,8 1.101,9 0.736,10 4.502}
{0 CHEMBL1523389,1 354.51,2 0.102,3 4.3,4 7.543,5 42.6,6 46.8,7 0.995,8 1.117,9 0.685,10 4.445}
{0 CHEMBL1525654,1 455,2 0.113,3 5.1,4 7.712,5 40.7,6 45.8,7 1.005,8 1.128,9 0.667,10 4.624}
{0 CHEMBL1528507,1 265.34,2 0.081,3 2.9,4 7.581,5 45.7,6 42.9,7 0.998,8 1.12,9 0.687,10 5.076}
{0 CHEMBL1528660,1 237.27,2 0.032,3 6.9,4 8.182,5 51.7,6 37.9,7 1.006,8 1.103,9 0.715,10 4.446}
{0 CHEMBL1528742,1 333.37,2 0.119,3 7.5,4 8.334,5 47.5,6 37.5,7 1.015,8 1.115,9 0.699,10 4.445}
{0 CHEMBL1529188,1 355.33,2 0.122,3 15.4,4 9.111,5 43.6,6 33.3,7 1.043,8 1.124,9 0.681,10 4.445}
{0 CHEMBL1529280,1 230.33,2 0.056,3 5.7,4 6.581,5 42.9,6 51.4,7 0.989,8 1.119,9 0.65,10 4.62}
{0 CHEMBL1529617,1 426.57,2 0.143,3 6.6,4 6.993,5 37.7,6 49.2,7 1.003,8 1.135,9 0.635,10 4.445}
{0 CHEMBL1533526,1 381.52,2 0.161,3 5.5,4 6.937,5 40,6 49.1,7 0.998,8 1.129,9 0.646,10 4.445}
{0 CHEMBL1534546,1 349.46,2 0.179,3 10.5,4 9.196,5 42.1,6 39.5,7 1.02,8 1.107,9 0.722,10 4.445}
{0 CHEMBL1535999,1 339.45,2 0.093,3 4.9,4 8.279,5 43.9,6 41.5,7 1.005,8 1.116,9 0.705,10 4.445}
{0 CHEMBL1536116,1 438.55,2 0.164,3 7.5,4 8.275,5 41.5,6 41.5,7 1.014,8 1.122,9 0.686,10 4.445}
{0 CHEMBL1536360,1 329.36,2 0.111,3 11.8,4 9.687,5 44.1,6 32.4,7 1.036,8 1.115,9 0.721,10 4.445}
{0 CHEMBL1536804,1 353.37,2 0.163,3 9.8,4 8.619,5 41.5,6 36.6,7 1.03,8 1.132,9 0.674,10 4.445}
{0 CHEMBL1537999,1 331.48,2 0.111,3 4.5,4 7.534,5 38.6,6 47.7,7 1,8 1.127,9 0.669,10 4.916}
{0 CHEMBL1540237,1 450.63,2 0.071,3 3.8,4 8.502,5 43.4,6 41.5,7 1.003,8 1.113,9 0.718,10 4.978}
{0 CHEMBL1540637,1 417.5,2 0.133,3 11.6,4 9.709,5 41.9,6 34.9,7 1.032,8 1.113,9 0.724,10 4.445}
{0 CHEMBL1542260,1 186.25,4 9.803,5 52.6,6 31.6,7 1.002,8 1.092,9 0.799,10 4.929}
{0 CHEMBL1542543,1 358.53,2 0.067,3 2.4,4 8.536,5 40.5,6 42.9,7 1.002,8 1.118,9 0.717,10 4.934}
{0 CHEMBL1543776,1 432.57,2 0.157,3 8.2,4 8.828,5 38.8,6 40.8,7 1.019,8 1.122,9 0.699,10 4.897}
{0 CHEMBL1544409,1 363.87,2 0.064,3 2.3,4 8.27,5 47.7,6 40.9,7 1.001,8 1.113,9 0.714,10 5.158}
{0 CHEMBL1545396,1 371.23,2 0.139,4 10.919,5 41.2,6 32.4,7 1.024,8 1.137,9 0.733,10 4.894}
{0 CHEMBL1545645,1 352.21,2 0.139,3 8.6,4 10.063,5 40,6 40,7 1.023,8 1.127,9 0.694,10 4.445}
{0 CHEMBL1546211,1 430.56,2 0.098,3 6.4,4 9.161,5 38.3,6 38.3,7 1.022,8 1.127,9 0.708,10 4.4}
{0 CHEMBL1546346,1 270.43,2 0.105,4 7.309,5 43.2,6 48.6,7 0.982,8 1.115,9 0.696,10 4.445}
{0 CHEMBL1548574,1 325.8,2 0.118,3 9.1,4 9.873,5 39.4,6 36.4,7 1.033,8 1.123,9 0.718,10 4.572}
{0 CHEMBL1549424,1 364.54,2 0.172,3 6.9,4 6.285,5 34.5,6 55.2,7 0.996,8 1.139,9 0.608,10 4.445}
{0 CHEMBL1549657,1 294.78,2 0.063,3 6.7,4 9.826,5 43.3,6 36.7,7 1.023,8 1.112,9 0.741,10 4.694}
{0 CHEMBL1553387,1 381.54,2 0.075,3 4,4 7.631,5 42,6 46,7 0.997,8 1.12,9 0.684,10 4.4}
{0 CHEMBL1555772,1 453.57,2 0.121,3 7.3,4 8.247,5 40,6 41.8,7 1.015,8 1.127,9 0.679,10 4.445}
{0 CHEMBL1555905,1 341.53,2 0.22,3 6,4 6.831,5 32,6 54,7 0.999,8 1.141,9 0.623,10 4.98}
{0 CHEMBL1557219,1 454.73,2 0.083,3 4.4,4 10.105,5 40,6 40,7 1.007,8 1.096,9 0.783,10 4.685}
{0 CHEMBL1558070,1 290.38,2 0.056,3 5.9,4 8.541,5 38.2,6 41.2,7 1.016,8 1.13,9 0.688,10 4.4}
{0 CHEMBL1558455,1 443.91,2 0.127,3 11.3,4 8.376,5 43.4,6 41.5,7 1.021,8 1.118,9 0.679,10 4.445}
{0 CHEMBL1559766,1 380.46,2 0.156,3 7,4 8.848,5 44.2,6 37.2,7 1.018,8 1.117,9 0.712,10 4.445}
{0 CHEMBL1560341,1 312.09,2 0.12,3 16.7,4 13.004,5 41.7,6 25,7 1.067,8 1.125,9 0.738,10 4.445}
{0 CHEMBL1560744,1 391.52,2 0.156,3 7,4 9.105,5 37.2,6 39.5,7 1.022,8 1.127,9 0.704,10 4.445}
{0 CHEMBL1562983,1 361.45,2 0.1,3 2.1,4 7.69,5 46.8,6 42.6,7 1.002,8 1.123,9 0.686,10 4.445}
{0 CHEMBL1563358,1 431.19,2 0.075,3 5.1,4 11.056,5 35.9,6 38.5,7 1.036,8 1.126,9 0.746,10 4.81}
{0 CHEMBL1563623,1 319.27,2 0.147,3 15.2,4 9.675,5 42.4,6 30.3,7 1.06,8 1.138,9 0.675,10 4.616}
{0 CHEMBL1564670,1 351.49,2 0.132,3 3.9,4 6.892,5 41.2,6 49,7 0.994,8 1.127,9 0.653,10 5.111}
{0 CHEMBL1566908,1 387.47,2 0.109,3 11.3,4 7.311,5 39.6,6 47.2,7 1.013,8 1.127,9 0.639,10 4.734}
{0 CHEMBL1568462,1 439.53,2 0.127,3 9.6,4 8.452,5 42.3,6 40.4,7 1.019,8 1.119,9 0.688,10 4.445}
{0 CHEMBL1568789,1 435.56,2 0.081,4 7.382,5 35.6,6 47.5,7 1.014,8 1.161,9 0.627,10 4.445}
{0 CHEMBL1571037,1 656.71,2 0.071,3 16.7,4 8.419,5 41,6 41,7 1.032,8 1.119,9 0.663,10 4.445}
{0 CHEMBL1571146,1 366.4,2 0.149,3 11.1,4 8.142,5 44.4,6 40,7 1.02,8 1.119,9 0.675,10 4.445}
{0 CHEMBL1572079,1 369.46,2 0.135,3 8,4 7.389,5 40,6 46,7 1.009,8 1.13,9 0.649,10 4.445}
{0 CHEMBL1572178,1 450.41,2 0.136,3 7.1,4 8.043,5 39.3,6 50,7 1,8 1.125,9 0.658,10 4.445}
{0 CHEMBL1572202,1 440.55,2 0.111,3 8.3,4 7.342,5 38.3,6 46.7,7 1.011,8 1.134,9 0.641,10 4.445}
{0 CHEMBL1572233,1 292.79,2 0.079,3 5.4,4 7.913,5 40.5,6 45.9,7 1.007,8 1.127,9 0.672,10 5.093}
{0 CHEMBL1576216,1 346.39,2 0.132,3 2.8,4 9.622,5 44.4,6 33.3,7 1.035,8 1.136,9 0.717,10 4.445}
{0 CHEMBL1576362,1 413.07,2 0.152,3 9.4,4 12.908,5 46.9,6 34.4,7 1.026,8 1.103,9 0.77,10 4.445}
{0 CHEMBL1577090,1 405.42,2 0.102,3 4.3,4 8.626,5 40.4,6 38.3,7 1.038,8 1.154,9 0.656,10 4.4}
{0 CHEMBL1577792,1 373.45,2 0.157,3 10,4 7.469,5 38,6 46,7 1.016,8 1.134,9 0.638,10 4.994}
{0 CHEMBL1580065,1 385.48,2 0.146,3 8.7,4 8.38,5 41.3,6 41.3,7 1.017,8 1.121,9 0.686,10 4.916}
{0 CHEMBL1580083,1 323.33,2 0.128,3 10.8,4 8.739,5 45.9,6 35.1,7 1.028,8 1.119,9 0.693,10 4.445}
{0 CHEMBL1582342,1 455.93,2 0.146,3 4.4,4 10.132,5 40,6 31.1,7 1.036,8 1.134,9 0.728,10 4.4}
{0 CHEMBL1583292,1 369.27,2 0.056,3 5.9,4 10.861,5 38.2,6 38.2,7 1.023,8 1.125,9 0.728,10 4.877}
{0 CHEMBL1583698,1 273.78,2 0.111,3 2.9,4 7.822,5 45.7,6 45.7,7 0.995,8 1.114,9 0.697,10 4.681}
{0 CHEMBL1584716,1 406.86,2 0.167,3 10.6,4 8.657,5 38.3,6 40.4,7 1.031,8 1.134,9 0.665,10 4.692}
{0 CHEMBL1584946,1 374.48,2 0.127,3 9.4,4 7.066,5 37.7,6 49.1,7 1.008,8 1.133,9 0.631,10 4.445}
{0 CHEMBL1585209,1 373.45,2 0.082,3 4.3,4 7.946,5 44.7,6 40.4,7 1.007,8 1.124,9 0.687,10 5.252}
{0 CHEMBL1585517,1 364.43,2 0.1,3 8.5,4 7.754,5 44.7,6 42.6,7 1.01,8 1.119,9 0.674,10 4.445}
{0 CHEMBL1585705,1 238.32,2 0.059,4 7.447,5 43.8,6 43.8,7 0.995,8 1.127,9 0.682,10 5.024}
{0 CHEMBL1585786,1 461.6,2 0.131,3 8.5,4 7.824,5 35.6,6 45.8,7 1.016,8 1.136,9 0.65,10 4.691}
{0 CHEMBL1586630,1 355.48,2 0.075,3 2.7,4 9.608,5 43.2,6 35.1,7 1.014,8 1.114,9 0.752,10 4.445}
{0 CHEMBL1588904,1 346.35,2 0.146,3 10.3,4 8.881,5 33.3,6 35.9,7 1.045,8 1.156,9 0.645,10 4.445}
{0 CHEMBL1588912,1 408.91,2 0.113,3 6,4 8.178,5 46,6 42,7 1.007,8 1.114,9 0.697,10 4.4}
{0 CHEMBL1592033,1 384.47,2 0.073,3 9.6,4 7.394,5 40.4,6 46.2,7 1.011,8 1.127,9 0.647,10 4.445}
{0 CHEMBL1592758,1 377.26,2 0.071,3 7.5,4 9.431,5 42.5,6 42.5,7 1.012,8 1.12,9 0.695,10 4.445}
{0 CHEMBL1593844,1 415.54,2 0.065,3 8.5,4 7.043,5 37.3,6 49.2,7 1.007,8 1.135,9 0.63,10 4.445}
{0 CHEMBL1594635,1 382.48,2 0.128,3 6.7,4 8.5,5 42.2,6 40,7 1.014,8 1.121,9 0.697,10 4.445}
{0 CHEMBL1594702,1 316.08,2 0.12,3 20.8,4 13.17,5 37.5,6 25,7 1.081,8 1.134,9 0.715,10 4.445}
{0 CHEMBL1595937,1 243.24,2 0.107,3 11.1,4 9.009,5 44.4,6 33.3,7 1.035,8 1.125,9 0.691,10 4.848}
{0 CHEMBL1596928,1 352.42,2 0.146,3 8.7,4 7.661,5 43.5,6 43.5,7 1.01,8 1.121,9 0.667,10 4.445}
{0 CHEMBL1597286,1 280.14,2 0.074,3 3.8,4 10.775,5 42.3,6 38.5,7 1.015,8 1.123,9 0.726,10 5.013}
{0 CHEMBL1597726,1 318.38,2 0.048,4 8.164,5 48.7,6 38.5,7 1.006,8 1.124,9 0.706,10 4.838}
{0 CHEMBL1597966,1 347.43,2 0.116,3 9.8,4 8.474,5 39,6 41.5,7 1.021,8 1.126,9 0.678,10 4.445}
{0 CHEMBL1599930,1 373.89,2 0.068,3 4.9,4 9.119,5 43.9,6 39,7 1.013,8 1.114,9 0.726,10 4.4}
{0 CHEMBL1600535,1 361.48,2 0.075,3 4,4 7.23,5 44,6 46,7 0.996,8 1.121,9 0.671,10 5.104}
{0 CHEMBL1602924,1 336.88,2 0.146,3 2.6,4 8.638,5 38.5,6 43.6,7 1.008,8 1.128,9 0.7,10 4.445}
{0 CHEMBL1605666,1 225.31,3 3.1,4 7.041,5 46.9,6 46.9,7 0.988,8 1.113,9 0.681,10 5.076}
{0 CHEMBL1605903,1 327.3,2 0.125,3 22.6,4 10.558,5 35.5,6 29,7 1.075,8 1.133,9 0.682,10 4.445}
{0 CHEMBL1606194,1 393.48,2 0.145,3 7.7,4 7.567,5 42.3,6 44.2,7 1.009,8 1.125,9 0.662,10 4.445}
{0 CHEMBL1607451,1 349.44,2 0.1,3 8.3,4 7.28,5 33.3,6 47.9,7 1.016,8 1.147,9 0.619,10 4.445}
{0 CHEMBL1608402,1 326.5,2 0.085,3 2.2,4 7.256,5 42.2,6 48.9,7 0.988,8 1.117,9 0.683,10 4.513}
{0 CHEMBL1610311,1 335.41,2 0.106,3 8.9,4 7.454,5 33.3,6 46.7,7 1.02,8 1.148,9 0.621,10 4.445}
{0 CHEMBL1610875,1 360.23,2 0.105,3 5.6,4 10.006,5 44.4,6 38.9,7 1.014,8 1.118,9 0.718,10 4.798}
{0 CHEMBL1611106,1 294.78,2 0.063,3 6.7,4 9.826,5 43.3,6 36.7,7 1.023,8 1.112,9 0.741,10 4.796}
{0 CHEMBL1612097,1 338.35,2 0.122,3 10.3,4 8.676,5 43.6,6 35.9,7 1.029,8 1.126,9 0.683,10 4.804}
{0 CHEMBL1612809,1 208.23,3 4.2,4 8.676,5 54.2,6 33.3,7 1.008,8 1.102,9 0.74,10 4.445}
{0 CHEMBL1613013,1 317.35,2 0.086,3 12.1,4 9.617,5 42.4,6 33.3,7 1.037,8 1.119,9 0.713,10 4.445}
{0 CHEMBL1698464,1 428.46,2 0.083,3 4.4,4 9.521,5 48.9,6 33.3,7 1.034,8 1.126,9 0.722,10 4.965}
{0 CHEMBL1698646,1 494.47,2 0.1,3 7,4 8.675,5 42.1,6 43.9,7 1.011,8 1.115,9 0.703,10 4.922}
{0 CHEMBL1699187,1 230.32,2 0.074,4 8.858,5 42.3,6 38.5,7 1.005,8 1.121,9 0.729,10 5.876}
{0 CHEMBL1700017,1 366.5,2 0.109,3 5.7,4 6.915,5 41.5,6 49.1,7 0.996,8 1.125,9 0.651,10 4.441}
{0 CHEMBL1700752,1 458.51,2 0.164,3 13.6,4 7.771,5 39,6 44.1,7 1.024,8 1.13,9 0.64,10 4.445}
{0 CHEMBL1701517,1 334.44,2 0.135,3 11.1,4 9.29,5 44.4,6 38.9,7 1.018,8 1.1,9 0.735,10 4.93}
{0 CHEMBL1703446,1 324.46,2 0.12,3 4.2,4 6.76,5 41.7,6 50,7 0.991,8 1.125,9 0.652,10 4.446}
{0 CHEMBL1703566,1 462.35,2 0.13,3 9.1,4 10.508,5 43.2,6 36.4,7 1.025,8 1.114,9 0.731,10 4.922}
{0 CHEMBL1703638,1 526.59,2 0.056,3 13.2,4 7.744,5 39.7,6 44.1,7 1.022,8 1.128,9 0.644,10 6.83}
{0 CHEMBL1703756,1 366.4,2 0.128,3 11.1,4 8.142,5 44.4,6 40,7 1.02,8 1.119,9 0.675,10 4.445}
{0 CHEMBL1705854,1 209.31,2 0.12,4 8.372,5 32,6 44,7 1.009,8 1.146,9 0.678,10 4.736}
{0 CHEMBL1706512,1 425.48,2 0.125,3 11.1,4 7.879,5 40.7,6 42.6,7 1.02,8 1.128,9 0.655,10 4.533}
{0 CHEMBL1708331,1 311.46,3 4.2,4 6.489,5 41.7,6 52.1,7 0.987,8 1.123,9 0.647,10 5.094}
{0 CHEMBL1708715,1 293.35,2 0.051,3 5.4,4 7.928,5 45.9,6 40.5,7 1.007,8 1.119,9 0.689,10 4.792}
{0 CHEMBL1709651,1 387.48,2 0.054,3 9.4,4 7.311,5 37.7,6 47.2,7 1.012,8 1.134,9 0.635,10 4.445}
{0 CHEMBL1709889,1 240.23,2 0.036,3 11.5,4 9.24,5 50,6 30.8,7 1.032,8 1.11,9 0.718,10 4.445}
{0 CHEMBL1710117,1 386.54,2 0.067,3 6.9,4 6.664,5 37.9,6 51.7,7 0.998,8 1.132,9 0.629,10 4.445}
{0 CHEMBL1710560,1 370.44,2 0.077,3 10.2,4 7.56,5 40.8,6 44.9,7 1.014,8 1.126,9 0.651,10 4.445}
{0 CHEMBL1710648,1 331.4,2 0.064,3 11.1,4 7.364,5 40,6 46.7,7 1.013,8 1.127,9 0.642,10 4.445}
{0 CHEMBL1711982,1 380.48,2 0.017,3 12.7,4 6.918,5 36.4,6 50.9,7 1.012,8 1.132,9 0.615,10 4.445}
{0 CHEMBL1712149,1 359.44,2 0.067,3 9.5,4 8.558,5 40.5,6 40.5,7 1.021,8 1.123,9 0.686,10 4.4}
{0 CHEMBL1713127,1 339.41,2 0.109,3 4.7,4 7.893,5 53.5,6 39.5,7 0.996,8 1.099,9 0.721,10 4.621}
{0 CHEMBL1713275,1 370.47,2 0.109,3 6.8,4 8.42,5 40.9,6 40.9,7 1.015,8 1.124,9 0.69,10 4.445}
{0 CHEMBL1713613,1 421.56,2 0.125,3 5.7,4 7.954,5 43.4,6 43.4,7 1.004,8 1.117,9 0.691,10 4.445}
{0 CHEMBL1715382,1 355.45,2 0.114,3 7.1,4 8.463,5 42.9,6 40.5,7 1.013,8 1.118,9 0.699,10 4.445}
{0 CHEMBL1715768,1 383.49,2 0.164,3 7.5,4 7.236,5 39.6,6 47.2,7 1.006,8 1.13,9 0.645,10 4.445}
{0 CHEMBL1717026,1 591.9,2 0.099,3 3.4,4 6.803,5 37.9,6 51.7,7 0.991,8 1.13,9 0.647,10 4.78}
{0 CHEMBL1717403,1 391.54,2 0.111,3 7.7,4 7.53,5 36.5,6 48.1,7 1.008,8 1.131,9 0.651,10 4.894}
{0 CHEMBL1718892,1 444.55,2 0.158,3 10.9,4 8.083,5 40,6 43.6,7 1.018,8 1.123,9 0.668,10 4.445}
{0 CHEMBL1719626,1 338.46,2 0.078,3 8,4 6.769,5 32,6 52,7 1.009,8 1.148,9 0.604,10 4.912}
{0 CHEMBL1721357,1 318.36,2 0.1,3 5.3,4 8.378,5 47.4,6 36.8,7 1.013,8 1.118,9 0.704,10 4.445}
{0 CHEMBL1721620,1 351.72,2 0.171,3 17.6,4 10.345,5 41.2,6 29.4,7 1.063,8 1.128,9 0.696,10 4.445}
{0 CHEMBL1723814,1 348.45,2 0.045,3 4.9,4 8.499,5 48.8,6 39,7 1.003,8 1.103,9 0.729,10 4.952}
{0 CHEMBL1724087,1 395.5,2 0.133,3 11.6,4 9.198,5 37.2,6 39.5,7 1.03,8 1.123,9 0.696,10 4.852}
{0 CHEMBL1724732,1 229.26,2 0.103,3 7.1,4 8.188,5 42.9,6 39.3,7 1.018,8 1.128,9 0.678,10 4.445}
{0 CHEMBL1725694,1 411.38,2 0.104,3 6.4,4 8.753,5 38.3,6 40.4,7 1.059,8 1.173,9 0.62,10 4.851}
{0 CHEMBL1727101,1 313.73,2 0.091,4 9.804,5 43.8,6 34.4,7 1.046,8 1.155,9 0.695,10 4.445}
{0 CHEMBL1728248,1 323.48,2 0.049,3 5.3,4 8.513,5 36.8,6 44.7,7 1.008,8 1.123,9 0.699,10 4.445}
{0 CHEMBL1728820,1 262.33,3 10.8,4 7.09,5 40.5,6 48.6,7 1.007,8 1.124,9 0.64,10 4.978}
{0 CHEMBL1729050,1 416.24,2 0.119,3 12.5,4 10.406,5 47.5,6 35,7 1.029,8 1.107,9 0.724,10 4.445}
{0 CHEMBL1729353,1 355.43,2 0.122,3 8.5,4 7.562,5 40.4,6 44.7,7 1.012,8 1.129,9 0.653,10 4.445}
{0 CHEMBL1730188,1 307.41,2 0.179,3 7.9,4 8.09,5 36.8,6 44.7,7 1.014,8 1.13,9 0.667,10 4.445}
{0 CHEMBL1730950,1 278.33,2 0.081,3 5.7,4 7.952,5 48.6,6 40,7 1.005,8 1.112,9 0.7,10 4.712}
{0 CHEMBL1731458,1 421.55,2 0.163,3 8.5,4 8.969,5 36.2,6 40.4,7 1.025,8 1.129,9 0.691,10 4.445}
{0 CHEMBL1732331,1 391.51,2 0.156,3 9.3,4 9.105,5 39.5,6 39.5,7 1.022,8 1.118,9 0.708,10 4.445}
{0 CHEMBL1732415,1 321.4,2 0.158,3 8.1,4 8.686,5 35.1,6 40.5,7 1.027,8 1.138,9 0.672,10 4.445}
{0 CHEMBL1733772,1 379.24,2 0.075,3 7.9,4 9.98,5 39.5,6 39.5,7 1.024,8 1.13,9 0.692,10 4.589}
{0 CHEMBL1734396,1 369.44,2 0.163,3 7.3,4 9.011,5 41.5,6 36.6,7 1.024,8 1.125,9 0.704,10 4.445}
{0 CHEMBL1734467,1 278.31,2 0.133,3 13.8,4 9.597,5 41.4,6 34.5,7 1.039,8 1.118,9 0.708,10 4.737}
{0 CHEMBL1735689,1 723.71,2 0.121,3 14.9,4 8.319,5 39.1,6 41.4,7 1.042,8 1.139,9 0.634,10 5.166}
{0 CHEMBL1736045,1 462.47,2 0.137,3 10.4,4 9.635,5 41.7,6 33.3,7 1.049,8 1.136,9 0.691,10 4.445}
{0 CHEMBL1736199,1 232.3,4 7.743,5 53.3,6 40,7 0.987,8 1.102,9 0.727,10 5.189}
{0 CHEMBL1736548,1 331.42,2 0.119,3 10,4 8.285,5 42.5,6 42.5,7 1.014,8 1.114,9 0.689,10 4.445}
{0 CHEMBL1863682,1 333.4,2 0.109,3 6.8,4 7.577,5 38.6,6 45.5,7 1.017,8 1.141,9 0.64,10 4.445}
{0 CHEMBL1863945,1 400.59,2 0.155,3 5.4,4 7.153,5 39.3,6 50,7 0.996,8 1.124,9 0.659,10 4.545}
{0 CHEMBL1864080,1 315.4,2 0.13,3 9.1,4 7.168,5 40.9,6 47.7,7 1.006,8 1.125,9 0.646,10 4.445}
{0 CHEMBL1866510,1 245.34,2 0.069,4 8.762,5 39.3,6 39.3,7 1.008,8 1.131,9 0.713,10 5.4}
{0 CHEMBL1867058,1 370.26,2 0.118,3 6.1,4 11.22,5 36.4,6 36.4,7 1.03,8 1.131,9 0.727,10 4.445}
{0 CHEMBL1867842,1 513.69,2 0.099,3 5.9,4 7.554,5 39.7,6 47.1,7 1.007,8 1.13,9 0.659,10 4.835}
{0 CHEMBL1867980,1 391.51,2 0.088,3 5.6,4 7.25,5 42.6,6 46.3,7 1,8 1.124,9 0.662,10 4.445}
{0 CHEMBL1868288,1 411.04,2 0.118,3 2,4 8.389,5 36.7,6 46.9,7 1.001,8 1.125,9 0.699,10 4.975}
{0 CHEMBL1868489,1 316.39,2 0.182,3 9.3,4 7.358,5 39.5,6 46.5,7 1.011,8 1.13,9 0.644,10 4.445}
{0 CHEMBL1870152,1 404.55,2 0.131,3 5.2,4 6.975,5 43.1,6 48.3,7 0.994,8 1.121,9 0.66,10 4.623}
{0 CHEMBL1874790,1 372.83,2 0.156,3 9.3,4 8.67,5 44.2,6 39.5,7 1.021,8 1.119,9 0.693,10 4.445}
{0 CHEMBL1875320,1 511.92,2 0.085,3 8.9,4 9.141,5 41.1,6 37.5,7 1.045,8 1.144,9 0.667,10 4.6}
{0 CHEMBL1876196,1 444.39,2 0.078,3 10.6,4 9.455,5 46.8,6 31.9,7 1.052,8 1.136,9 0.685,10 4.842}
{0 CHEMBL1877115,1 348.52,2 0.163,3 4.2,4 7.261,5 35.4,6 50,7 0.999,8 1.135,9 0.65,10 4.445}
{0 CHEMBL1877372,1 399.46,2 0.104,3 11.1,4 8.877,5 42.2,6 37.8,7 1.027,8 1.119,9 0.695,10 4.715}
{0 CHEMBL1877753,1 386.49,2 0.105,3 9.3,4 7.157,5 38.9,6 48.1,7 1.008,8 1.13,9 0.637,10 4.446}
{0 CHEMBL1878181,1 423.5,2 0.155,3 10.7,4 7.562,5 42.9,6 44.6,7 1.012,8 1.12,9 0.658,10 4.445}
{0 CHEMBL1878973,1 356.48,2 0.111,4 8.488,5 50,6 38.1,7 0.995,8 1.105,9 0.744,10 4.894}
{0 CHEMBL1879983,1 440.41,2 0.12,3 4.2,4 9.175,5 35.4,6 45.8,7 1.009,8 1.134,9 0.683,10 4.445}
{0 CHEMBL1880945,1 452.49,2 0.115,3 8,4 9.05,5 42,6 38,7 1.039,8 1.139,9 0.678,10 4.449}
{0 CHEMBL1881832,1 433.72,2 0.184,3 8.1,4 11.722,5 40.5,6 29.7,7 1.05,8 1.12,9 0.768,10 4.445}
{0 CHEMBL1882211,1 404.41,2 0.091,3 9.5,4 9.629,5 35.7,6 35.7,7 1.06,8 1.159,9 0.658,10 5.103}
{0 CHEMBL1882587,1 434.51,2 0.148,3 13.5,4 8.356,5 38.5,6 42.3,7 1.027,8 1.126,9 0.663,10 4.445}
{0 CHEMBL1884626,1 400.92,2 0.065,3 4.5,4 9.112,5 43.2,6 38.6,7 1.015,8 1.118,9 0.722,10 4.445}
{0 CHEMBL1884960,1 331.39,2 0.132,3 8.3,4 9.205,5 38.9,6 36.1,7 1.031,8 1.131,9 0.697,10 4.445}
{0 CHEMBL1885515,1 489.62,2 0.072,3 3.1,4 7.65,5 46.9,6 42.2,7 0.998,8 1.117,9 0.692,10 4.897}
{0 CHEMBL1885633,1 234.25,2 0.033,3 7.1,4 8.366,5 42.9,6 39.3,7 1.028,8 1.137,9 0.667,10 4.605}
{0 CHEMBL1886358,1 301.37,2 0.116,3 9.8,4 7.35,5 41.5,6 46.3,7 1.009,8 1.124,9 0.651,10 4.445}
{0 CHEMBL1886617,1 332.35,2 0.095,3 12.5,4 8.309,5 37.5,6 40,7 1.034,8 1.138,9 0.647,10 4.445}
{0 CHEMBL1887245,1 383.25,2 0.19,3 9.8,4 9.348,5 41.5,6 39,7 1.03,8 1.123,9 0.698,10 4.445}
{0 CHEMBL1887624,1 397.5,2 0.089,3 1.9,4 7.361,5 35.2,6 48.1,7 1.018,8 1.161,9 0.619,10 4.445}
{0 CHEMBL1888871,1 195.24,2 0.038,4 8.135,5 50,6 37.5,7 0.998,8 1.114,9 0.721,10 5.019}
{0 CHEMBL1890401,1 372.41,2 0.208,3 12.8,4 7.924,5 40.4,6 42.6,7 1.024,8 1.127,9 0.651,10 4.445}
{0 CHEMBL1891319,1 352.49,2 0.083,3 4.4,4 7.833,5 44.4,6 44.4,7 0.997,8 1.113,9 0.698,10 4.581}
{0 CHEMBL1891974,1 359.47,2 0.113,3 7.8,4 7.048,5 37.3,6 49,7 1.007,8 1.135,9 0.632,10 4.445}
{0 CHEMBL1892932,1 377.49,2 0.093,3 7.3,4 9.207,5 43.9,6 39,7 1.02,8 1.113,9 0.724,10 4.79}
{0 CHEMBL1893675,1 479.58,2 0.076,3 4.9,4 7.862,5 45.9,6 41,7 1.005,8 1.119,9 0.689,10 5.387}
{0 CHEMBL1895181,1 332.3,2 0.162,3 16.7,4 9.231,5 38.9,6 33.3,7 1.053,8 1.136,9 0.661,10 4.445}
{0 CHEMBL1896348,1 284.26,2 0.182,3 18.8,4 8.883,5 31.3,6 37.5,7 1.06,8 1.153,9 0.619,10 5.104}
{0 CHEMBL1896995,1 397.47,2 0.073,3 9.6,4 7.644,5 40.4,6 44.2,7 1.015,8 1.129,9 0.652,10 4.693}
{0 CHEMBL1897822,1 357.39,2 0.149,3 13.3,4 7.942,5 42.2,6 42.2,7 1.023,8 1.122,9 0.657,10 4.445}
{0 CHEMBL1897938,1 368.48,2 0.093,3 5.9,4 7.225,5 39.2,6 47.1,7 1.004,8 1.133,9 0.647,10 4.445}
{0 CHEMBL1898971,1 369.45,2 0.196,3 10,4 7.389,5 42,6 46,7 1.009,8 1.122,9 0.653,10 4.445}
{0 CHEMBL1898977,1 372.82,2 0.158,3 13.5,4 10.076,5 35.1,6 35.1,7 1.05,8 1.135,9 0.692,10 4.445}
{0 CHEMBL1899898,1 461.71,2 0.156,3 4.8,4 7.447,5 37.1,6 50,7 0.997,8 1.125,9 0.667,10 4.898}
{0 CHEMBL1902259,1 323.4,2 0.105,3 5.6,4 8.983,5 47.2,6 36.1,7 1.013,8 1.109,9 0.733,10 4.834}
{0 CHEMBL1902592,1 352.42,2 0.104,3 8.7,4 7.661,5 43.5,6 43.5,7 1.01,8 1.121,9 0.667,10 4.445}
{0 CHEMBL1903167,1 388.51,2 0.138,3 8.9,4 6.938,5 37.5,6 50,7 1.006,8 1.133,9 0.628,10 4.445}
{0 CHEMBL1903223,1 426.34,2 0.105,3 8.3,4 11.843,5 41.7,6 33.3,7 1.03,8 1.108,9 0.773,10 4.445}
{0 CHEMBL1903362,1 499.7,2 0.071,3 1.5,4 7.688,5 41.5,6 44.6,7 0.997,8 1.126,9 0.685,10 4.841}
{0 CHEMBL1904453,1 454.5,2 0.067,3 10.7,4 8.116,5 50,6 39.3,7 1.012,8 1.104,9 0.698,10 4.988}
{0 CHEMBL1965376,1 442.26,2 0.159,3 14,4 10.285,5 34.9,6 37.2,7 1.047,8 1.141,9 0.667,10 5.333}
{0 CHEMBL1965433,1 280.37,2 0.088,3 3.1,4 8.762,5 50,6 37.5,7 1.001,8 1.1,9 0.748,10 4.935}
{0 CHEMBL1965654,1 383.31,2 0.109,3 4.4,4 8.518,5 37.8,6 44.4,7 1.015,8 1.134,9 0.678,10 4.858}
{0 CHEMBL1967019,1 383.44,2 0.16,3 10.2,4 7.825,5 40.8,6 42.9,7 1.018,8 1.128,9 0.656,10 4.811}
{0 CHEMBL1967149,1 352.5,2 0.106,3 2.2,4 7.833,5 42.2,6 44.4,7 0.997,8 1.121,9 0.694,10 4.445}
{0 CHEMBL1969300,1 429.36,2 0.152,3 11.1,4 9.541,5 40,6 33.3,7 1.068,8 1.16,9 0.647,10 4.969}
{0 CHEMBL1972216,1 335.81,2 0.1,3 2.6,4 8.837,5 50,6 36.8,7 1.007,8 1.109,9 0.734,10 4.967}
{0 CHEMBL1972217,1 369.41,2 0.125,3 10.9,4 8.031,5 41.3,6 41.3,7 1.022,8 1.127,9 0.66,10 5.026}
{0 CHEMBL1974053,1 204.24,4 8.51,5 58.3,6 33.3,7 0.994,8 1.093,9 0.762,10 5.162}
{0 CHEMBL1974180,1 326.38,2 0.14,3 9.5,4 7.771,5 42.9,6 42.9,7 1.014,8 1.123,9 0.665,10 5.399}
{0 CHEMBL1975006,1 285.33,2 0.135,3 8.3,4 7.926,5 41.7,6 41.7,7 1.016,8 1.128,9 0.665,10 5.074}
{0 CHEMBL1975487,1 410.46,2 0.208,3 11.5,4 7.893,5 42.3,6 42.3,7 1.019,8 1.123,9 0.661,10 4.642}
{0 CHEMBL1976374,1 362.47,2 0.098,3 4.1,4 7.397,5 42.9,6 44.9,7 1,8 1.125,9 0.669,10 4.66}
{0 CHEMBL1980684,1 385.41,2 0.122,3 12.8,4 8.2,5 40.4,6 40.4,7 1.028,8 1.129,9 0.656,10 4.956}
{0 CHEMBL1980848,1 341.4,2 0.133,3 9.1,4 7.759,5 40.9,6 43.2,7 1.016,8 1.129,9 0.657,10 4.638}
{0 CHEMBL1983220,1 320.37,2 0.095,3 7.5,4 8.009,5 47.5,6 40,7 1.009,8 1.113,9 0.693,10 4.4}
{0 CHEMBL1983374,1 346.39,2 0.068,3 2.4,4 8.449,5 48.8,6 36.6,7 1.013,8 1.123,9 0.707,10 4.445}
{0 CHEMBL1983418,1 391.46,2 0.135,3 8,4 7.829,5 44,6 42,7 1.011,8 1.121,9 0.674,10 5.065}
{0 CHEMBL1985010,1 347.32,2 0.077,3 5.4,4 9.387,5 45.9,6 32.4,7 1.049,8 1.147,9 0.684,10 4.446}
{0 CHEMBL1985459,1 197.2,3 9.1,4 8.964,5 54.5,6 31.8,7 1.019,8 1.098,9 0.736,10 4.743}
{0 CHEMBL1985479,1 390.26,2 0.146,3 7.5,4 9.756,5 42.5,6 40,7 1.018,8 1.122,9 0.702,10 5.31}
{0 CHEMBL1987516,1 419.31,2 0.106,3 6.7,4 9.318,5 40,6 42.2,7 1.015,8 1.129,9 0.685,10 5.399}
{0 CHEMBL1992109,1 368.38,2 0.111,3 11.6,4 8.567,5 41.9,6 37.2,7 1.031,8 1.129,9 0.671,10 4.738}
{0 CHEMBL1992293,1 291.39,2 0.073,4 7.472,5 43.6,6 43.6,7 0.995,8 1.128,9 0.682,10 4.539}
{0 CHEMBL1993555,1 288.34,2 0.105,3 8.1,4 7.793,5 37.8,6 43.2,7 1.019,8 1.138,9 0.647,10 4.672}
{0 CHEMBL1993707,1 427.97,2 0.121,3 5.4,4 7.642,5 41.1,6 46.4,7 1.004,8 1.126,9 0.667,10 4.445}
{0 CHEMBL1994151,1 435.54,2 0.091,3 7.7,4 8.376,5 44.2,6 40.4,7 1.012,8 1.115,9 0.699,10 4.445}
{0 CHEMBL1994902,1 410.51,2 0.125,3 3.8,4 7.745,5 47.2,6 41.5,7 1,8 1.116,9 0.694,10 4.701}
{0 CHEMBL1995593,1 349.42,2 0.106,3 6.7,4 7.765,5 44.4,6 42.2,7 1.008,8 1.121,9 0.677,10 4.895}
{0 CHEMBL1995641,1 342.75,2 0.081,3 11.4,4 9.793,5 48.6,6 31.4,7 1.036,8 1.11,9 0.728,10 4.445}
{0 CHEMBL1996281,1 408.52,2 0.118,3 6.1,4 8.337,5 42.9,6 40.8,7 1.011,8 1.12,9 0.696,10 5.277}
{0 CHEMBL1996902,1 267.3,2 0.086,3 9.1,4 8.1,5 48.5,6 39.4,7 1.012,8 1.11,9 0.695,10 5.091}
{0 CHEMBL1997249,1 455.61,2 0.082,3 3.4,4 7.855,5 39.7,6 44.8,7 1.008,8 1.133,9 0.671,10 4.824}
{0 CHEMBL1999862,1 333.4,2 0.179,3 10.5,4 8.774,5 39.5,6 39.5,7 1.026,8 1.125,9 0.686,10 4.445}
{0 CHEMBL2000559,1 306.46,2 0.122,3 4.2,4 6.385,5 33.3,6 54.2,7 0.995,8 1.145,9 0.611,10 4.903}
{0 CHEMBL2000752,1 307.33,2 0.079,3 8.3,4 8.537,5 47.2,6 36.1,7 1.02,8 1.117,9 0.7,10 4.641}
{0 CHEMBL2001316,1 314.38,2 0.14,3 7.3,4 7.668,5 39,6 43.9,7 1.014,8 1.135,9 0.652,10 4.952}
{0 CHEMBL2001670,1 289.38,2 0.167,3 8.6,4 8.268,5 42.9,6 42.9,7 1.01,8 1.113,9 0.696,10 4.445}
{0 CHEMBL2004809,1 310.38,2 0.143,3 7.3,4 7.57,5 43.9,6 43.9,7 1.006,8 1.121,9 0.67,10 5.124}
{0 CHEMBL2005690,1 253.27,2 0.063,3 10,4 8.442,5 50,6 36.7,7 1.017,8 1.107,9 0.706,10 5.312}
{0 CHEMBL2007313,1 521.67,2 0.141,3 11.3,4 8.414,5 37.1,6 43.5,7 1.022,8 1.126,9 0.671,10 5.301}
{0 CHEMBL2028187,1 835.88,2 0.05,3 13.5,4 22.591,5 54.1,6 21.6,7 1.033,8 1.065,9 1.013,10 4.445}
{0 CHEMBL203487,1 451.59,2 0.154,3 4.8,4 7.284,5 37.1,6 46.8,7 1.007,8 1.14,9 0.642,10 4.445}
{0 CHEMBL203695,1 393.52,2 0.1,3 7.1,4 7.027,5 42.9,6 48.2,7 0.998,8 1.12,9 0.656,10 4.937}
{0 CHEMBL2131451,1 423.5,2 0.078,3 6.3,4 8.823,5 45.8,6 37.5,7 1.02,8 1.119,9 0.71,10 4.445}
{0 CHEMBL2133365,1 307.4,2 0.081,3 2.9,4 8.783,5 48.6,6 37.1,7 1.004,8 1.106,9 0.741,10 4.445}
{0 CHEMBL2133534,1 435.33,2 0.096,3 8.2,4 8.884,5 42.9,6 40.8,7 1.02,8 1.12,9 0.697,10 4.445}
{0 CHEMBL2133633,1 325.4,2 0.136,3 7,4 7.567,5 41.9,6 44.2,7 1.008,8 1.127,9 0.662,10 4.445}
{0 CHEMBL2134068,1 395.48,2 0.093,3 7.3,4 9.646,5 43.9,6 36.6,7 1.032,8 1.121,9 0.723,10 4.46}
{0 CHEMBL2135166,1 361.44,2 0.098,3 10.2,4 7.376,5 36.7,6 46.9,7 1.016,8 1.137,9 0.631,10 4.445}
{0 CHEMBL2136104,1 366.4,2 0.128,3 11.1,4 8.142,5 44.4,6 40,7 1.02,8 1.119,9 0.675,10 4.445}
{0 CHEMBL2139275,1 396.32,2 0.106,3 6.5,4 8.616,5 37,6 47.8,7 1.008,8 1.133,9 0.66,10 4.445}
{0 CHEMBL2140561,1 342.4,2 0.205,3 7,4 7.963,5 37.2,6 41.9,7 1.021,8 1.142,9 0.65,10 4.635}
{0 CHEMBL2140660,1 423.5,2 0.078,3 6.3,4 8.823,5 45.8,6 37.5,7 1.02,8 1.119,9 0.71,10 4.445}
{0 CHEMBL2142389,1 409.47,2 0.083,3 6.7,4 9.099,5 46.7,6 35.6,7 1.024,8 1.118,9 0.718,10 4.835}
{0 CHEMBL2142407,1 373.5,2 0.107,3 7.4,4 6.917,5 37,6 50,7 1.004,8 1.135,9 0.629,10 4.445}
{0 CHEMBL2142809,1 436.92,2 0.122,3 8.5,4 9.296,5 42.6,6 38.3,7 1.029,8 1.123,9 0.705,10 4.686}
{0 CHEMBL2143315,1 349.44,2 0.136,3 11.6,4 8.127,5 39.5,6 44.2,7 1.018,8 1.121,9 0.669,10 4.445}
{0 CHEMBL2143712,1 421.52,2 0.115,3 6.1,4 8.602,5 42.9,6 38.8,7 1.015,8 1.121,9 0.701,10 4.445}
{0 CHEMBL2145035,1 423.5,2 0.078,3 6.3,4 8.823,5 45.8,6 37.5,7 1.02,8 1.119,9 0.71,10 4.729}
{0 CHEMBL235504,1 210.2,3 9.1,4 9.555,5 54.5,6 27.3,7 1.028,8 1.102,9 0.747,10 4.882}
{0 CHEMBL258805,1 241.27,2 0.065,3 6.9,4 8.32,5 44.8,6 37.9,7 1.017,8 1.123,9 0.689,10 4.895}
{0 CHEMBL317115,1 214.66,4 9.757,5 54.5,6 31.8,7 1.008,8 1.099,9 0.78,10 4.916}
{0 CHEMBL34259,1 454.5,2 0.158,3 9.1,4 8.264,5 36.4,6 40,7 1.03,8 1.144,9 0.648,10 4.445}
{0 CHEMBL356169,1 224.28,2 0.065,3 3.4,4 7.734,5 48.3,6 41.4,7 0.998,8 1.113,9 0.699,10 5.226}
{0 CHEMBL363151,1 414.63,2 0.029,3 3.1,4 6.379,5 44.6,6 52.3,7 0.98,8 1.115,9 0.659,10 8.155}
{0 CHEMBL426,1 454.5,2 0.158,3 9.1,4 8.264,5 36.4,6 40,7 1.03,8 1.144,9 0.648,10 4.445}
{0 CHEMBL428909,1 352.45,2 0.068,3 4.9,4 8.596,5 43.9,6 39,7 1.011,8 1.118,9 0.711,10 4.846}
{0 CHEMBL44657,1 588.61,2 0.063,3 17.6,4 7.954,5 39.2,6 43.2,7 1.032,8 1.127,9 0.636,10 4.445}
{0 CHEMBL479368,1 367.25,2 0.171,3 7.5,4 9.181,5 42.5,6 40,7 1.023,8 1.121,9 0.705,10 5.321}
{0 CHEMBL485636,1 380.47,2 0.111,3 9.6,4 7.317,5 44.2,6 46.2,7 1.005,8 1.116,9 0.662,10 5.268}
{0 CHEMBL494325,1 264.14,2 0.115,4 10.566,5 44,6 40,7 1.003,8 1.12,9 0.737,10 5.225}
{0 CHEMBL533226,1 331.46,2 0.082,4 7.206,5 43.5,6 45.7,7 0.991,8 1.126,9 0.677,10 4.445}
{0 CHEMBL565657,1 280.42,2 0.079,4 7.789,5 47.2,6 44.4,7 0.985,8 1.106,9 0.722,10 4.703}
{0 CHEMBL576412,1 429.88,2 0.135,3 12,4 8.598,5 44,6 40,7 1.025,8 1.117,9 0.684,10 4.661}
{0 CHEMBL586937,1 386.47,2 0.083,3 8.9,4 8.588,5 40,6 40,7 1.022,8 1.126,9 0.685,10 4.877}
{0 CHEMBL587564,1 428.97,2 0.088,3 3.6,4 7.799,5 38.2,6 45.5,7 1.008,8 1.136,9 0.662,10 4.446}
{0 CHEMBL59530,1 293.74,2 0.091,3 6.3,4 9.179,5 37.5,6 37.5,7 1.032,8 1.141,9 0.683,10 4.446}
{0 CHEMBL597670,1 306.38,2 0.167,3 8.6,4 8.754,5 37.1,6 40,7 1.025,8 1.132,9 0.681,10 4.445}
{0 CHEMBL78,1 243.25,2 0.065,3 16.7,4 8.108,5 30,6 43.3,7 1.045,8 1.154,9 0.603,10 4.664}
{0 CHEMBL803,1 243.25,2 0.065,3 16.7,4 8.108,5 30,6 43.3,7 1.045,8 1.154,9 0.603,10 4.789}
