"molecule_id","FCFP4_1024b20","FCFP4_1024b400","FCFP4_1024b64","FCFP4_1024b438","FCFP4_1024b22","FCFP4_1024b1","FCFP4_1024b10","FCFP4_1024b100","FCFP4_1024b1000","FCFP4_1024b1001","FCFP4_1024b1002","FCFP4_1024b1003","FCFP4_1024b1004","FCFP4_1024b1005","FCFP4_1024b1006","FCFP4_1024b1007","FCFP4_1024b1008","FCFP4_1024b1009","FCFP4_1024b101","FCFP4_1024b1010","FCFP4_1024b1011","FCFP4_1024b1012","FCFP4_1024b1013","FCFP4_1024b1014","FCFP4_1024b1015","FCFP4_1024b1016","FCFP4_1024b1017","FCFP4_1024b1018","FCFP4_1024b1019","FCFP4_1024b102","FCFP4_1024b1020","FCFP4_1024b1021","FCFP4_1024b1022","FCFP4_1024b1023","FCFP4_1024b1024","FCFP4_1024b103","FCFP4_1024b104","FCFP4_1024b105","FCFP4_1024b106","FCFP4_1024b107","FCFP4_1024b108","FCFP4_1024b109","FCFP4_1024b11","FCFP4_1024b110","FCFP4_1024b111","FCFP4_1024b112","FCFP4_1024b113","FCFP4_1024b114","FCFP4_1024b115","FCFP4_1024b116","FCFP4_1024b117","FCFP4_1024b118","FCFP4_1024b119","FCFP4_1024b12","FCFP4_1024b120","FCFP4_1024b121","FCFP4_1024b122","FCFP4_1024b123","FCFP4_1024b124","FCFP4_1024b125","FCFP4_1024b126","FCFP4_1024b127","FCFP4_1024b128","FCFP4_1024b129","FCFP4_1024b13","FCFP4_1024b130","FCFP4_1024b131","FCFP4_1024b132","FCFP4_1024b133","FCFP4_1024b134","FCFP4_1024b135","FCFP4_1024b136","FCFP4_1024b137","FCFP4_1024b138","FCFP4_1024b139","FCFP4_1024b14","FCFP4_1024b140","FCFP4_1024b141","FCFP4_1024b142","FCFP4_1024b143","FCFP4_1024b144","FCFP4_1024b145","FCFP4_1024b146","FCFP4_1024b147","FCFP4_1024b148","FCFP4_1024b149","FCFP4_1024b15","FCFP4_1024b150","FCFP4_1024b151","FCFP4_1024b152","FCFP4_1024b153","FCFP4_1024b154","FCFP4_1024b155","FCFP4_1024b156","FCFP4_1024b157","FCFP4_1024b158","FCFP4_1024b159","FCFP4_1024b16","FCFP4_1024b160","FCFP4_1024b161","FCFP4_1024b162","FCFP4_1024b163","pXC50"
{1 1,6 1,21 1,29 1,55 1,75 1,103 5}
{0 CHEMBL101253,6 1,75 1,95 1,103 5}
{0 CHEMBL103667,6 1,7 1,40 1,103 4.523}
{0 CHEMBL105442,6 1,75 1,103 5}
{0 CHEMBL1082440,1 1,6 1,7 1,35 1,57 1,103 7.1}
{0 CHEMBL1084546,6 1,40 1,54 1,90 1,91 1,103 5.3}
{0 CHEMBL1090356,2 1,3 1,4 1,5 1,6 1,40 1,42 1,69 1,90 1,103 5}
{0 CHEMBL1090360,2 1,3 1,4 1,5 1,6 1,40 1,42 1,69 1,90 1,103 5}
{0 CHEMBL116070,6 1,75 1,103 5}
{0 CHEMBL1173655,4 1,6 1,7 1,40 1,75 1,80 1,90 1,103 5}
{0 CHEMBL117697,6 1,63 1,80 1,103 5}
{0 CHEMBL1190711,2 1,4 1,6 1,63 1,67 1,69 1,103 5}
{0 CHEMBL119385,6 1,12 1,23 1,75 1,96 1,103 5}
{0 CHEMBL1230020,1 1,6 1,40 1,75 1,89 1,103 5}
{0 CHEMBL1230122,6 1,40 1,75 1,91 1,103 5}
{0 CHEMBL1230164,1 1,6 1,11 1,54 1,103 5.1}
{0 CHEMBL1236107,6 1,103 5}
{0 CHEMBL1236126,6 1,40 1,44 1,103 5}
{0 CHEMBL1240703,6 1,13 1,49 1,65 1,103 5}
{0 CHEMBL1241473,6 1,25 1,63 1,103 6.2}
{0 CHEMBL1241674,1 1,6 1,31 1,58 1,80 1,103 7.854}
{0 CHEMBL1242373,6 1,26 1,31 1,32 1,40 1,80 1,103 5.5}
{0 CHEMBL124660,6 1,7 1,40 1,63 1,91 1,103 5}
{0 CHEMBL127898,6 1,7 1,24 1,55 1,73 1,103 5}
{0 CHEMBL1287853,6 1,7 1,62 1,103 5}
{0 CHEMBL1289926,1 1,6 1,9 1,32 1,41 1,55 1,73 1,82 1,103 5}
{0 CHEMBL1336,6 1,40 1,41 1,54 1,73 1,75 1,82 1,103 5}
{0 CHEMBL1375418,6 1,40 1,73 1,103 5}
{0 CHEMBL1375640,6 1,31 1,50 1,75 1,103 5}
{0 CHEMBL1419458,6 1,29 1,31 1,44 1,103 5}
{0 CHEMBL1421,6 1,7 1,21 1,40 1,75 1,91 1,103 5}
{0 CHEMBL1461728,1 1,6 1,9 1,34 1,40 1,58 1,75 1,103 5}
{0 CHEMBL14762,6 1,40 1,103 5}
{0 CHEMBL1516890,6 1,40 1,73 1,90 1,91 1,103 5.3}
{0 CHEMBL1614701,6 1,44 1,75 1,103 5}
{0 CHEMBL1614705,1 1,6 1,9 1,55 1,75 1,92 1,103 5}
{0 CHEMBL162,6 1,41 1,49 1,65 1,103 7.585}
{0 CHEMBL1624529,6 1,16 1,75 1,91 1,103 5}
{0 CHEMBL1682540,1 1,4 1,9 1,34 1,43 1,58 1,103 5}
{0 CHEMBL1682545,1 1,9 1,34 1,43 1,58 1,103 5.2}
{0 CHEMBL1682546,1 1,6 1,9 1,25 1,34 1,40 1,43 1,58 1,103 5.3}
{0 CHEMBL1682552,1 1,4 1,6 1,9 1,34 1,40 1,58 1,103 5}
{0 CHEMBL1682553,1 1,4 1,6 1,9 1,34 1,40 1,58 1,103 5}
{0 CHEMBL1682558,1 1,3 1,6 1,7 1,9 1,34 1,58 1,75 1,103 5}
{0 CHEMBL1721885,1 1,6 1,7 1,40 1,55 1,58 1,75 1,90 1,103 5.301}
{0 CHEMBL1727312,6 1,40 1,103 5}
{0 CHEMBL17370,1 1,6 1,21 1,29 1,63 1,75 1,103 5}
{0 CHEMBL178737,4 1,6 1,36 1,90 1,103 5}
{0 CHEMBL1789941,1 1,6 1,7 1,44 1,77 1,92 1,103 5}
{0 CHEMBL180022,4 1,6 1,7 1,40 1,73 1,90 1,103 5}
{0 CHEMBL1825138,6 1,31 1,57 1,75 1,85 1,103 5}
{0 CHEMBL183844,6 1,11 1,40 1,103 5}
{0 CHEMBL184847,6 1,40 1,103 5}
{0 CHEMBL185569,6 1,40 1,103 5}
{0 CHEMBL1908391,6 1,7 1,40 1,43 1,75 1,103 5}
{0 CHEMBL1908392,1 1,6 1,7 1,13 1,58 1,69 1,103 5}
{0 CHEMBL1908393,6 1,7 1,40 1,63 1,90 1,103 5}
{0 CHEMBL1908394,6 1,7 1,54 1,75 1,103 5}
{0 CHEMBL1908395,1 1,6 1,7 1,29 1,40 1,90 1,98 1,103 5}
{0 CHEMBL1908396,6 1,40 1,63 1,69 1,103 5}
{0 CHEMBL1908397,1 1,6 1,9 1,55 1,103 5.721}
{0 CHEMBL191003,6 1,28 1,31 1,75 1,95 1,103 5.187}
{0 CHEMBL1929238,6 1,7 1,11 1,40 1,75 1,101 1,103 4.523}
{0 CHEMBL1958401,6 1,70 1,75 1,90 1,103 5}
{0 CHEMBL196363,6 1,26 1,31 1,32 1,40 1,80 1,103 5}
{0 CHEMBL1964290,1 1,6 1,31 1,94 1,103 5}
{0 CHEMBL1964413,1 1,6 1,9 1,29 1,34 1,52 1,54 1,58 1,103 5}
{0 CHEMBL1964444,6 1,40 1,54 1,69 1,103 5}
{0 CHEMBL1964644,6 1,40 1,56 1,103 5}
{0 CHEMBL1964687,6 1,26 1,29 1,31 1,32 1,40 1,80 1,103 5.8}
{0 CHEMBL1964692,6 1,31 1,40 1,54 1,69 1,103 5}
{0 CHEMBL1964777,6 1,75 1,103 5}
{0 CHEMBL1964804,6 1,85 1,103 5}
{0 CHEMBL1964937,1 1,6 1,89 1,90 1,103 5.8}
{0 CHEMBL1965131,6 1,40 1,75 1,103 5.4}
{0 CHEMBL1965351,6 1,21 1,29 1,44 1,73 1,75 1,85 1,91 1,103 5}
{0 CHEMBL1965423,2 1,3 1,4 1,6 1,31 1,42 1,44 1,55 1,69 1,75 1,103 5}
{0 CHEMBL1965507,6 1,26 1,31 1,40 1,79 1,80 1,103 7.5}
{0 CHEMBL1965570,6 1,21 1,31 1,40 1,75 1,85 1,103 5.1}
{0 CHEMBL1965589,2 1,3 1,4 1,5 1,6 1,40 1,69 1,73 1,75 1,87 1,99 1,103 5}
{0 CHEMBL1965631,1 1,6 1,7 1,9 1,40 1,45 1,52 1,86 1,90 1,103 5.3}
{0 CHEMBL1965660,1 1,6 1,31 1,75 1,94 1,103 5.2}
{0 CHEMBL1965836,1 1,6 1,9 1,55 1,85 1,103 5.3}
{0 CHEMBL1965845,1 1,6 1,63 1,89 1,90 1,103 5.8}
{0 CHEMBL1965988,6 1,31 1,40 1,101 1,103 5.3}
{0 CHEMBL1966035,6 1,17 1,43 1,103 5.2}
{0 CHEMBL1966068,6 1,12 1,31 1,75 1,93 1,103 5}
{0 CHEMBL1966087,6 1,30 1,57 1,103 5}
{0 CHEMBL1966143,6 1,20 1,44 1,103 5.3}
{0 CHEMBL1966279,6 1,29 1,40 1,57 1,103 5}
{0 CHEMBL1966343,1 1,6 1,9 1,31 1,58 1,103 5.4}
{0 CHEMBL1966425,6 1,7 1,103 5}
{0 CHEMBL1966514,6 1,21 1,31 1,40 1,75 1,85 1,103 5.1}
{0 CHEMBL1966628,1 1,6 1,40 1,70 1,103 5.3}
{0 CHEMBL1966703,1 1,6 1,9 1,55 1,75 1,91 1,103 5}
{0 CHEMBL1966722,6 1,40 1,75 1,76 1,90 1,103 5.8}
{0 CHEMBL1966808,6 1,21 1,40 1,103 5}
{0 CHEMBL1966816,6 1,14 1,40 1,54 1,75 1,103 5}
{0 CHEMBL1967094,1 1,6 1,9 1,45 1,65 1,75 1,103 6.1}
{0 CHEMBL1967116,6 1,31 1,40 1,103 5.4}
{0 CHEMBL1967302,1 1,6 1,11 1,40 1,48 1,58 1,85 1,89 1,90 1,103 5.1}
{0 CHEMBL1967531,6 1,26 1,31 1,32 1,40 1,80 1,103 5.1}
{0 CHEMBL1967544,6 1,85 1,88 1,103 5}
{0 CHEMBL1967560,6 1,7 1,12 1,42 1,63 1,86 1,91 1,103 5}
{0 CHEMBL1967564,1 1,6 1,9 1,40 1,45 1,86 1,90 1,101 1,103 5}
{0 CHEMBL1967720,6 1,31 1,40 1,75 1,90 1,103 5.6}
{0 CHEMBL1967878,6 1,7 1,40 1,90 1,103 7.8}
{0 CHEMBL1967887,1 1,6 1,9 1,55 1,85 1,103 5}
{0 CHEMBL1968127,2 1,3 1,4 1,5 1,6 1,7 1,37 1,40 1,42 1,69 1,75 1,103 5}
{0 CHEMBL1968151,6 1,21 1,40 1,103 5}
{0 CHEMBL1968380,6 1,7 1,22 1,63 1,91 1,103 5}
{0 CHEMBL1968406,6 1,26 1,31 1,32 1,40 1,80 1,103 5.2}
{0 CHEMBL1968590,6 1,31 1,41 1,90 1,103 5}
{0 CHEMBL1968705,1 1,6 1,7 1,9 1,34 1,40 1,43 1,58 1,90 1,101 1,103 5}
{0 CHEMBL1968791,6 1,7 1,31 1,32 1,80 1,103 5.7}
{0 CHEMBL1968926,1 1,6 1,9 1,21 1,87 1,103 5}
{0 CHEMBL1969042,1 1,9 1,86 1,103 5}
{0 CHEMBL1969049,6 1,21 1,29 1,63 1,103 5}
{0 CHEMBL1969126,2 1,3 1,4 1,6 1,42 1,69 1,75 1,103 5}
{0 CHEMBL1969190,6 1,31 1,40 1,63 1,103 5.1}
{0 CHEMBL1969301,6 1,7 1,29 1,40 1,44 1,73 1,77 1,103 5}
{0 CHEMBL1969372,2 1,3 1,4 1,5 1,6 1,22 1,40 1,69 1,75 1,87 1,103 5}
{0 CHEMBL1969502,1 1,6 1,33 1,40 1,44 1,48 1,89 1,90 1,103 7.1}
{0 CHEMBL1969506,6 1,40 1,47 1,103 5}
{0 CHEMBL1969523,6 1,46 1,91 1,103 6.5}
{0 CHEMBL1969537,4 1,6 1,103 5.4}
{0 CHEMBL1969561,1 1,6 1,9 1,13 1,34 1,58 1,103 5}
{0 CHEMBL1969588,1 1,6 1,40 1,70 1,74 1,103 5.7}
{0 CHEMBL1969664,1 1,6 1,7 1,58 1,69 1,73 1,75 1,99 1,103 5.1}
{0 CHEMBL1969735,2 1,3 1,4 1,5 1,6 1,37 1,40 1,69 1,75 1,87 1,103 5}
{0 CHEMBL1969755,6 1,21 1,40 1,103 5}
{0 CHEMBL1969843,1 1,6 1,9 1,15 1,34 1,52 1,58 1,103 5}
{0 CHEMBL1969879,1 1,6 1,15 1,91 1,92 1,103 5}
{0 CHEMBL1970006,1 1,6 1,31 1,40 1,103 5}
{0 CHEMBL1970074,1 1,6 1,9 1,40 1,54 1,55 1,103 5}
{0 CHEMBL1970104,1 1,6 1,8 1,9 1,36 1,58 1,65 1,103 5.3}
{0 CHEMBL1970142,6 1,31 1,40 1,41 1,90 1,103 5}
{0 CHEMBL1970189,1 1,6 1,7 1,9 1,21 1,55 1,75 1,91 1,103 5}
{0 CHEMBL1970203,6 1,26 1,29 1,31 1,40 1,79 1,80 1,103 6.3}
{0 CHEMBL1970217,6 1,21 1,63 1,103 5}
{0 CHEMBL1970314,6 1,11 1,31 1,103 5}
{0 CHEMBL1970340,31 1,103 5.1}
{0 CHEMBL1970369,1 1,6 1,9 1,13 1,34 1,58 1,90 1,103 5}
{0 CHEMBL1970522,6 1,63 1,72 1,90 1,99 1,103 5.3}
{0 CHEMBL1970709,1 1,6 1,9 1,34 1,40 1,58 1,75 1,103 5}
{0 CHEMBL1970735,6 1,7 1,31 1,40 1,73 1,90 1,91 1,96 1,103 5}
{0 CHEMBL1970806,6 1,40 1,103 5}
{0 CHEMBL1970903,1 1,6 1,9 1,48 1,55 1,58 1,85 1,89 1,103 5.4}
{0 CHEMBL1970913,6 1,40 1,90 1,101 1,103 5}
{0 CHEMBL1971021,6 1,29 1,40 1,54 1,103 5}
{0 CHEMBL1971029,6 1,41 1,63 1,73 1,103 6.2}
{0 CHEMBL1971141,6 1,11 1,40 1,103 5}
{0 CHEMBL1971149,2 1,3 1,4 1,5 1,6 1,37 1,40 1,69 1,73 1,75 1,87 1,99 1,103 5}
{0 CHEMBL1971186,2 1,3 1,4 1,5 1,6 1,40 1,42 1,57 1,69 1,75 1,103 5}
{0 CHEMBL1971245,4 1,6 1,7 1,103 5}
{0 CHEMBL1971430,6 1,29 1,75 1,102 1,103 5}
{0 CHEMBL1971649,6 1,12 1,31 1,40 1,69 1,75 1,103 5}
{0 CHEMBL1971694,6 1,40 1,57 1,75 1,90 1,103 5}
{0 CHEMBL1971943,1 1,6 1,24 1,31 1,89 1,103 5}
{0 CHEMBL1972119,6 1,40 1,54 1,91 1,103 5}
{0 CHEMBL1972125,1 1,6 1,11 1,31 1,48 1,58 1,85 1,89 1,103 5}
{0 CHEMBL1972142,1 1,6 1,11 1,85 1,103 5}
{0 CHEMBL1972152,6 1,99 1,103 5}
{0 CHEMBL1972158,1 1,6 1,9 1,31 1,86 1,103 5.9}
{0 CHEMBL1972183,1 1,6 1,7 1,103 5}
{0 CHEMBL1972221,1 1,6 1,9 1,40 1,58 1,73 1,90 1,101 1,103 5}
{0 CHEMBL1972258,6 1,30 1,103 5}
{0 CHEMBL1972276,1 1,6 1,7 1,36 1,40 1,58 1,103 5.1}
{0 CHEMBL1972489,1 1,6 1,9 1,40 1,75 1,103 5}
{0 CHEMBL1972568,6 1,30 1,63 1,103 5}
{0 CHEMBL1972576,6 1,26 1,31 1,40 1,79 1,80 1,103 7.3}
{0 CHEMBL1972584,1 1,6 1,7 1,11 1,31 1,40 1,80 1,103 5}
{0 CHEMBL1972659,2 1,6 1,90 1,103 5}
{0 CHEMBL1972820,6 1,20 1,100 1,103 5}
{0 CHEMBL1972849,2 1,3 1,4 1,5 1,6 1,42 1,69 1,75 1,103 5}
{0 CHEMBL1972937,6 1,63 1,72 1,90 1,99 1,103 5}
{0 CHEMBL1973098,6 1,63 1,90 1,99 1,103 5.1}
{0 CHEMBL1973142,6 1,40 1,75 1,90 1,103 5.6}
{0 CHEMBL1973145,6 1,26 1,31 1,32 1,40 1,103 5}
{0 CHEMBL1973211,6 1,7 1,31 1,40 1,103 5}
{0 CHEMBL1973348,1 1,6 1,11 1,31 1,48 1,58 1,75 1,85 1,89 1,103 5}
{0 CHEMBL1973483,6 1,40 1,54 1,103 5}
{0 CHEMBL1973540,1 1,6 1,40 1,58 1,69 1,103 7.9}
{0 CHEMBL1973808,1 1,6 1,9 1,34 1,40 1,58 1,75 1,103 5}
{0 CHEMBL1973860,6 1,21 1,40 1,85 1,103 5.5}
{0 CHEMBL1973893,1 1,6 1,9 1,40 1,58 1,73 1,90 1,103 5}
{0 CHEMBL1973937,1 1,6 1,9 1,15 1,31 1,40 1,75 1,86 1,103 5.5}
{0 CHEMBL1974157,6 1,7 1,90 1,103 5}
{0 CHEMBL1974254,6 1,31 1,40 1,103 5}
{0 CHEMBL1974288,6 1,21 1,103 5.3}
{0 CHEMBL1974310,6 1,75 1,103 5.1}
{0 CHEMBL1974328,6 1,40 1,73 1,103 5.4}
{0 CHEMBL1974416,1 1,6 1,40 1,70 1,75 1,103 5}
{0 CHEMBL1974664,1 1,6 1,29 1,44 1,58 1,63 1,80 1,85 1,88 1,103 5}
{0 CHEMBL1974702,6 1,14 1,39 1,72 1,75 1,103 5}
{0 CHEMBL1974803,6 1,40 1,75 1,90 1,103 5}
{0 CHEMBL1974870,1 1,6 1,9 1,55 1,75 1,85 1,103 5.8}
{0 CHEMBL1974935,1 1,6 1,30 1,48 1,58 1,89 1,103 5}
{0 CHEMBL1975121,6 1,21 1,63 1,103 5}
{0 CHEMBL1975128,1 1,6 1,9 1,31 1,86 1,103 6.1}
{0 CHEMBL1975138,6 1,40 1,75 1,76 1,90 1,103 5.3}
{0 CHEMBL1975208,6 1,20 1,26 1,47 1,90 1,91 1,103 5}
{0 CHEMBL1975233,6 1,7 1,40 1,63 1,73 1,103 5.5}
{0 CHEMBL1975256,6 1,31 1,73 1,99 1,103 5}
{0 CHEMBL1975357,3 1,6 1,55 1,70 1,103 5}
{0 CHEMBL1975490,6 1,103 5}
{0 CHEMBL1975500,6 1,18 1,40 1,47 1,63 1,90 1,103 6.2}
{0 CHEMBL1975534,6 1,31 1,80 1,103 5}
{0 CHEMBL1975647,6 1,14 1,40 1,69 1,75 1,103 5.3}
{0 CHEMBL1975900,6 1,40 1,75 1,103 5.1}
{0 CHEMBL1976090,26 1,31 1,58 1,80 1,103 5.7}
{0 CHEMBL1976093,2 1,3 1,4 1,5 1,6 1,7 1,22 1,37 1,40 1,69 1,75 1,87 1,103 5}
{0 CHEMBL1976134,1 1,9 1,85 1,103 5.7}
{0 CHEMBL1976220,6 1,31 1,40 1,75 1,103 5}
{0 CHEMBL1976240,6 1,21 1,63 1,103 5}
{0 CHEMBL1976420,1 1,6 1,69 1,103 5.2}
{0 CHEMBL1976455,6 1,40 1,54 1,69 1,103 5}
{0 CHEMBL1976732,2 1,3 1,4 1,5 1,6 1,42 1,69 1,75 1,103 5}
{0 CHEMBL1977135,6 1,21 1,103 5}
{0 CHEMBL1977148,6 1,28 1,31 1,40 1,63 1,103 5}
{0 CHEMBL1977223,1 1,6 1,9 1,40 1,45 1,52 1,86 1,90 1,101 1,103 5.7}
{0 CHEMBL1977346,6 1,40 1,41 1,103 5.8}
{0 CHEMBL1977374,3 1,6 1,75 1,103 5}
{0 CHEMBL1977604,6 1,13 1,80 1,103 5}
{0 CHEMBL1977681,1 1,6 1,9 1,41 1,45 1,65 1,75 1,82 1,103 6.2}
{0 CHEMBL1977713,1 1,6 1,9 1,40 1,58 1,75 1,103 5}
{0 CHEMBL1978014,6 1,7 1,31 1,52 1,103 5}
{0 CHEMBL1978099,6 1,41 1,90 1,103 5.2}
{0 CHEMBL1978200,2 1,3 1,4 1,5 1,6 1,40 1,69 1,73 1,75 1,87 1,99 1,103 5}
{0 CHEMBL1978448,1 1,6 1,7 1,40 1,103 6.7}
{0 CHEMBL1979057,1 1,6 1,36 1,58 1,103 5}
{0 CHEMBL1979093,6 1,31 1,40 1,63 1,75 1,103 5}
{0 CHEMBL1979176,6 1,40 1,54 1,63 1,103 5}
{0 CHEMBL1979252,6 1,29 1,40 1,54 1,103 5}
{0 CHEMBL1979318,1 1,6 1,7 1,9 1,21 1,55 1,75 1,91 1,103 5}
{0 CHEMBL1979357,6 1,29 1,30 1,103 5}
{0 CHEMBL1979516,6 1,31 1,40 1,66 1,75 1,103 5}
{0 CHEMBL1979577,6 1,31 1,40 1,103 5.1}
{0 CHEMBL1979855,6 1,7 1,40 1,103 5}
{0 CHEMBL1979883,6 1,7 1,31 1,40 1,103 5}
{0 CHEMBL1979970,1 1,6 1,9 1,40 1,45 1,75 1,86 1,90 1,101 1,103 5.2}
{0 CHEMBL1980142,6 1,40 1,54 1,103 5}
{0 CHEMBL1980144,6 1,26 1,31 1,40 1,79 1,80 1,103 6.8}
{0 CHEMBL1980163,6 1,80 1,103 5}
{0 CHEMBL1980297,6 1,28 1,31 1,40 1,75 1,103 5.8}
{0 CHEMBL1980391,1 1,6 1,9 1,13 1,63 1,75 1,86 1,103 5.9}
{0 CHEMBL1980489,6 1,40 1,75 1,103 5.1}
{0 CHEMBL1980540,6 1,14 1,40 1,54 1,75 1,103 5}
{0 CHEMBL1980704,4 1,6 1,87 1,103 5}
{0 CHEMBL1980896,6 1,26 1,31 1,32 1,40 1,75 1,80 1,90 1,103 5.3}
{0 CHEMBL1981047,1 1,6 1,7 1,8 1,9 1,34 1,40 1,55 1,103 6.4}
{0 CHEMBL1981079,1 1,6 1,31 1,75 1,94 1,103 5}
{0 CHEMBL1981410,6 1,40 1,41 1,54 1,80 1,103 5}
{0 CHEMBL1981720,6 1,40 1,69 1,103 5}
{0 CHEMBL1981725,3 1,4 1,5 1,6 1,7 1,11 1,40 1,75 1,87 1,103 5}
{0 CHEMBL1981782,1 1,6 1,9 1,34 1,40 1,58 1,75 1,103 5.4}
{0 CHEMBL1982122,6 1,21 1,40 1,103 5}
{0 CHEMBL1982135,6 1,26 1,31 1,32 1,40 1,80 1,103 5}
{0 CHEMBL1982361,6 1,40 1,75 1,103 5}
{0 CHEMBL1982383,2 1,3 1,4 1,5 1,6 1,37 1,40 1,58 1,69 1,73 1,75 1,87 1,99 1,103 5}
{0 CHEMBL1982465,6 1,7 1,31 1,40 1,103 5}
{0 CHEMBL1982466,6 1,31 1,40 1,103 5}
{0 CHEMBL1982506,6 1,63 1,73 1,86 1,103 5.5}
{0 CHEMBL1982563,2 1,3 1,4 1,5 1,6 1,37 1,40 1,69 1,73 1,75 1,87 1,99 1,103 5}
{0 CHEMBL1982610,6 1,43 1,75 1,103 5}
{0 CHEMBL1982660,6 1,40 1,54 1,63 1,103 5.2}
{0 CHEMBL1982711,1 1,6 1,39 1,40 1,70 1,103 6.8}
{0 CHEMBL1982866,6 1,22 1,55 1,75 1,103 5}
{0 CHEMBL1982874,2 1,3 1,4 1,6 1,31 1,42 1,44 1,55 1,69 1,75 1,103 5}
{0 CHEMBL1982924,1 1,6 1,40 1,63 1,70 1,103 5.2}
{0 CHEMBL1982957,1 1,6 1,11 1,70 1,85 1,103 5.9}
{0 CHEMBL1982980,1 1,6 1,55 1,75 1,103 5}
{0 CHEMBL1982992,26 1,80 1,103 5.2}
{0 CHEMBL1983025,6 1,31 1,40 1,103 5}
{0 CHEMBL1983111,6 1,40 1,47 1,54 1,90 1,103 7.1}
{0 CHEMBL1983195,6 1,40 1,99 1,103 5}
{0 CHEMBL1983309,6 1,16 1,40 1,63 1,75 1,103 5}
{0 CHEMBL1983449,6 1,17 1,29 1,79 1,103 5}
{0 CHEMBL1983534,6 1,21 1,25 1,40 1,103 5}
{0 CHEMBL1983923,1 1,6 1,7 1,9 1,21 1,55 1,91 1,103 5.3}
{0 CHEMBL1983932,6 1,40 1,63 1,103 5}
{0 CHEMBL1983945,1 1,6 1,30 1,40 1,48 1,58 1,89 1,90 1,103 5}
{0 CHEMBL1983963,6 1,26 1,31 1,32 1,40 1,80 1,103 5}
{0 CHEMBL1984038,6 1,25 1,40 1,63 1,103 5}
{0 CHEMBL1984039,1 1,6 1,55 1,103 5}
{0 CHEMBL1984044,1 1,6 1,7 1,36 1,58 1,103 5}
{0 CHEMBL1984162,6 1,29 1,31 1,80 1,103 5}
{0 CHEMBL1984191,1 1,9 1,55 1,65 1,75 1,103 5}
{0 CHEMBL1984274,6 1,7 1,53 1,75 1,103 5}
{0 CHEMBL1984363,1 1,6 1,9 1,31 1,40 1,58 1,75 1,90 1,103 5}
{0 CHEMBL1984367,1 1,6 1,9 1,45 1,65 1,103 5}
{0 CHEMBL1984586,6 1,26 1,31 1,32 1,40 1,80 1,103 5}
{0 CHEMBL1984633,6 1,21 1,63 1,103 5}
{0 CHEMBL1984700,2 1,3 1,4 1,5 1,6 1,40 1,69 1,75 1,87 1,91 1,103 5}
{0 CHEMBL1984711,6 1,25 1,63 1,103 5}
{0 CHEMBL1984788,1 1,6 1,36 1,57 1,103 5}
{0 CHEMBL1985074,6 1,63 1,86 1,103 5.4}
{0 CHEMBL1985092,1 1,9 1,65 1,75 1,103 5}
{0 CHEMBL1985095,1 1,6 1,9 1,31 1,34 1,90 1,103 5.7}
{0 CHEMBL1985309,1 1,6 1,7 1,36 1,40 1,58 1,103 5.3}
{0 CHEMBL1985406,1 1,6 1,9 1,40 1,45 1,75 1,86 1,90 1,101 1,103 5}
{0 CHEMBL1986139,26 1,80 1,103 5}
{0 CHEMBL1986186,6 1,17 1,46 1,103 5}
{0 CHEMBL1986263,6 1,63 1,75 1,103 6.3}
{0 CHEMBL1986328,6 1,40 1,99 1,103 5}
{0 CHEMBL1986499,1 1,6 1,9 1,31 1,75 1,86 1,103 5.7}
{0 CHEMBL1986530,6 1,29 1,44 1,75 1,90 1,93 1,103 5}
{0 CHEMBL1986597,1 1,6 1,7 1,23 1,29 1,36 1,40 1,58 1,103 5}
{0 CHEMBL1986603,6 1,40 1,57 1,58 1,90 1,101 1,103 5}
{0 CHEMBL1986781,2 1,3 1,4 1,5 1,6 1,40 1,42 1,69 1,75 1,103 5}
{0 CHEMBL1986869,6 1,21 1,26 1,31 1,40 1,87 1,103 5}
{0 CHEMBL1986943,1 1,6 1,40 1,70 1,103 6}
{0 CHEMBL1986970,1 1,6 1,9 1,34 1,58 1,103 5}
{0 CHEMBL1987007,1 1,6 1,7 1,9 1,45 1,65 1,103 6.7}
{0 CHEMBL1987009,1 1,6 1,9 1,45 1,63 1,65 1,103 5.6}
{0 CHEMBL1987034,6 1,7 1,103 5.9}
{0 CHEMBL1987359,6 1,18 1,35 1,40 1,103 5}
{0 CHEMBL1987533,1 1,6 1,9 1,40 1,75 1,90 1,103 5}
{0 CHEMBL1987679,1 1,6 1,40 1,48 1,58 1,85 1,89 1,103 5.1}
{0 CHEMBL1987793,6 1,103 5.3}
{0 CHEMBL1987910,6 1,31 1,40 1,54 1,103 5}
{0 CHEMBL1987982,1 1,6 1,48 1,57 1,58 1,89 1,90 1,103 5.1}
{0 CHEMBL1988075,6 1,31 1,40 1,73 1,75 1,85 1,103 5}
{0 CHEMBL1988153,6 1,54 1,73 1,103 5}
{0 CHEMBL1988163,6 1,41 1,103 6.7}
{0 CHEMBL1988173,6 1,40 1,75 1,76 1,90 1,103 5.5}
{0 CHEMBL1988300,1 1,6 1,31 1,36 1,58 1,103 5.1}
{0 CHEMBL1988387,6 1,31 1,40 1,103 5}
{0 CHEMBL1988437,1 1,6 1,9 1,32 1,41 1,55 1,73 1,82 1,103 6.6}
{0 CHEMBL1988537,6 1,63 1,103 5.8}
{0 CHEMBL1988594,6 1,26 1,31 1,40 1,79 1,80 1,103 7.1}
{0 CHEMBL1988608,1 1,6 1,9 1,17 1,34 1,40 1,58 1,79 1,90 1,103 6.2}
{0 CHEMBL1988717,6 1,31 1,40 1,54 1,75 1,103 5}
{0 CHEMBL1988838,6 1,90 1,103 5.2}
{0 CHEMBL1988995,2 1,3 1,4 1,5 1,6 1,42 1,69 1,75 1,103 5}
{0 CHEMBL1989029,1 1,6 1,9 1,21 1,38 1,91 1,96 1,103 5}
{0 CHEMBL1989265,6 1,80 1,103 5}
{0 CHEMBL1989474,6 1,22 1,55 1,75 1,103 5}
{0 CHEMBL1989518,6 1,30 1,103 5}
{0 CHEMBL1989569,1 1,6 1,7 1,36 1,58 1,103 5.2}
{0 CHEMBL1989646,1 1,6 1,9 1,31 1,58 1,103 6.3}
{0 CHEMBL1989708,6 1,31 1,40 1,103 5.05}
{0 CHEMBL1989805,6 1,7 1,32 1,73 1,90 1,103 5.3}
{0 CHEMBL1989957,6 1,40 1,103 5}
{0 CHEMBL1990254,6 1,21 1,103 6.2}
{0 CHEMBL1990288,2 1,3 1,4 1,5 1,6 1,40 1,42 1,69 1,75 1,103 5}
{0 CHEMBL1990415,1 1,6 1,9 1,40 1,45 1,86 1,103 5}
{0 CHEMBL1990482,1 1,6 1,21 1,36 1,58 1,103 7.6}
{0 CHEMBL1990496,6 1,69 1,75 1,102 1,103 5}
{0 CHEMBL1990821,1 1,6 1,29 1,55 1,103 5}
{0 CHEMBL1990884,6 1,29 1,31 1,103 5}
{0 CHEMBL1990885,1 1,6 1,7 1,40 1,55 1,58 1,75 1,90 1,103 6.8}
{0 CHEMBL1990904,2 1,3 1,4 1,5 1,6 1,22 1,40 1,69 1,75 1,87 1,103 5}
{0 CHEMBL1990912,6 1,40 1,85 1,103 5}
{0 CHEMBL1991063,1 1,6 1,9 1,55 1,75 1,85 1,103 5.5}
{0 CHEMBL1991078,1 1,6 1,9 1,40 1,52 1,63 1,86 1,103 5.9}
{0 CHEMBL1991138,2 1,4 1,6 1,7 1,31 1,69 1,103 5}
{0 CHEMBL1991143,6 1,75 1,91 1,103 5.3}
{0 CHEMBL1991188,6 1,21 1,63 1,103 5}
{0 CHEMBL1991285,6 1,7 1,40 1,73 1,103 5.2}
{0 CHEMBL1991356,6 1,40 1,63 1,85 1,103 5}
{0 CHEMBL1991395,2 1,3 1,4 1,5 1,6 1,22 1,37 1,40 1,69 1,75 1,87 1,103 5}
{0 CHEMBL1991429,2 1,3 1,4 1,5 1,6 1,28 1,40 1,42 1,69 1,90 1,103 5}
{0 CHEMBL1991434,6 1,12 1,31 1,63 1,75 1,103 5}
{0 CHEMBL1991674,1 1,6 1,19 1,40 1,45 1,70 1,103 5.9}
{0 CHEMBL1991678,2 1,3 1,4 1,5 1,6 1,37 1,40 1,69 1,73 1,75 1,87 1,99 1,103 5}
{0 CHEMBL1991725,1 1,6 1,7 1,48 1,58 1,85 1,89 1,90 1,103 5}
{0 CHEMBL1991800,2 1,3 1,4 1,5 1,6 1,37 1,40 1,69 1,73 1,75 1,87 1,99 1,103 5}
{0 CHEMBL1992242,6 1,29 1,40 1,47 1,103 5}
{0 CHEMBL1992306,6 1,40 1,41 1,54 1,73 1,82 1,103 5}
{0 CHEMBL1992323,6 1,75 1,103 5}
{0 CHEMBL1992342,1 1,6 1,9 1,31 1,40 1,58 1,103 5.2}
{0 CHEMBL1992536,1 1,6 1,9 1,17 1,34 1,58 1,63 1,79 1,103 5}
{0 CHEMBL1992555,1 1,6 1,36 1,53 1,58 1,91 1,103 5}
{0 CHEMBL1992634,1 1,70 1,103 5}
{0 CHEMBL1992740,1 1,6 1,7 1,9 1,40 1,45 1,75 1,86 1,90 1,101 1,103 5}
{0 CHEMBL1992922,1 1,6 1,40 1,69 1,70 1,80 1,103 6.1}
{0 CHEMBL1992937,1 1,6 1,36 1,58 1,103 5}
{0 CHEMBL1993243,6 1,31 1,41 1,90 1,93 1,103 5.3}
{0 CHEMBL1993424,6 1,103 6.4}
{0 CHEMBL1993548,6 1,103 5}
{0 CHEMBL1993584,1 1,6 1,30 1,48 1,58 1,89 1,103 5.1}
{0 CHEMBL1993661,6 1,25 1,41 1,63 1,73 1,103 7.4}
{0 CHEMBL1993722,1 1,6 1,9 1,20 1,31 1,40 1,75 1,86 1,103 5.1}
{0 CHEMBL1993781,6 1,30 1,103 5}
{0 CHEMBL1993941,6 1,31 1,40 1,67 1,75 1,103 5.2}
{0 CHEMBL1994040,2 1,3 1,4 1,5 1,6 1,40 1,69 1,73 1,75 1,87 1,99 1,103 5}
{0 CHEMBL1994074,1 1,9 1,58 1,75 1,103 5.3}
{0 CHEMBL1994241,1 1,6 1,7 1,36 1,58 1,63 1,103 5.5}
{0 CHEMBL1994321,6 1,31 1,39 1,40 1,103 5}
{0 CHEMBL1994526,6 1,39 1,40 1,88 1,90 1,103 5.4}
{0 CHEMBL1994538,6 1,40 1,54 1,69 1,103 5.6}
{0 CHEMBL1994693,6 1,26 1,31 1,32 1,40 1,80 1,103 5.4}
{0 CHEMBL1994830,31 1,73 1,75 1,103 5}
{0 CHEMBL1994864,6 1,17 1,79 1,103 5}
{0 CHEMBL1994938,6 1,31 1,41 1,55 1,57 1,69 1,75 1,90 1,103 6.2}
{0 CHEMBL1995172,1 1,6 1,9 1,75 1,103 5}
{0 CHEMBL1995736,1 1,6 1,36 1,58 1,103 5}
{0 CHEMBL1995740,6 1,40 1,63 1,103 5}
{0 CHEMBL1995813,1 1,6 1,40 1,70 1,103 5.3}
{0 CHEMBL1995832,2 1,3 1,4 1,5 1,6 1,37 1,40 1,69 1,75 1,87 1,91 1,103 5}
{0 CHEMBL1995927,6 1,16 1,40 1,63 1,103 5}
{0 CHEMBL1996066,6 1,7 1,31 1,43 1,73 1,103 5}
{0 CHEMBL1996111,1 1,6 1,9 1,34 1,58 1,103 5.8}
{0 CHEMBL1996208,6 1,11 1,21 1,73 1,75 1,91 1,103 5.1}
{0 CHEMBL1996234,2 1,4 1,6 1,31 1,69 1,103 5}
{0 CHEMBL1996500,2 1,3 1,4 1,5 1,6 1,40 1,69 1,73 1,75 1,87 1,99 1,103 5}
{0 CHEMBL1996587,3 1,6 1,75 1,103 5}
{0 CHEMBL1996604,6 1,63 1,72 1,90 1,99 1,103 5}
{0 CHEMBL1996791,6 1,31 1,80 1,103 5}
{0 CHEMBL1996817,1 1,6 1,70 1,91 1,103 6.2}
{0 CHEMBL1996831,6 1,20 1,44 1,103 5.6}
{0 CHEMBL1996923,1 1,16 1,92 1,103 5}
{0 CHEMBL1996931,6 1,21 1,40 1,75 1,103 5}
{0 CHEMBL1996979,1 1,6 1,40 1,70 1,75 1,103 5.3}
{0 CHEMBL1997023,6 1,40 1,47 1,90 1,103 6.2}
{0 CHEMBL1997025,1 1,6 1,36 1,57 1,58 1,103 5}
{0 CHEMBL1997129,1 1,6 1,21 1,32 1,55 1,73 1,103 7.4}
{0 CHEMBL1997340,1 1,6 1,9 1,34 1,58 1,103 5}
{0 CHEMBL1997349,6 1,7 1,44 1,75 1,103 5}
{0 CHEMBL1997503,6 1,40 1,73 1,103 5}
{0 CHEMBL1997534,1 1,6 1,9 1,58 1,63 1,101 1,103 5}
{0 CHEMBL1997597,1 1,6 1,9 1,31 1,40 1,58 1,103 5}
{0 CHEMBL1997617,1 1,6 1,7 1,31 1,32 1,80 1,103 5.5}
{0 CHEMBL1997764,1 1,6 1,40 1,63 1,70 1,103 5}
{0 CHEMBL1997822,1 1,6 1,11 1,31 1,55 1,58 1,103 5}
{0 CHEMBL1997846,1 1,6 1,19 1,40 1,45 1,70 1,103 5.7}
{0 CHEMBL1997872,1 1,6 1,11 1,85 1,103 5}
{0 CHEMBL1998112,2 1,4 1,6 1,63 1,67 1,69 1,103 5}
{0 CHEMBL1998121,1 1,6 1,9 1,34 1,40 1,58 1,75 1,79 1,90 1,103 6.4}
{0 CHEMBL1998159,1 1,6 1,9 1,25 1,29 1,54 1,55 1,99 1,103 5.7}
{0 CHEMBL1998193,6 1,40 1,57 1,103 5}
{0 CHEMBL1998414,1 1,6 1,9 1,45 1,55 1,75 1,103 5.1}
{0 CHEMBL1998435,6 1,21 1,40 1,103 5}
{0 CHEMBL1998545,6 1,21 1,40 1,103 5}
{0 CHEMBL1998551,3 1,6 1,75 1,103 5}
{0 CHEMBL1998585,6 1,26 1,31 1,32 1,40 1,54 1,75 1,80 1,103 6}
{0 CHEMBL1998611,6 1,14 1,31 1,39 1,75 1,103 5.2}
{0 CHEMBL1998829,1 1,6 1,40 1,70 1,75 1,103 5}
{0 CHEMBL1999112,6 1,7 1,32 1,73 1,103 5}
{0 CHEMBL1999126,6 1,7 1,44 1,103 5}
{0 CHEMBL1999321,6 1,40 1,103 5}
{0 CHEMBL1999428,6 1,21 1,103 5}
{0 CHEMBL1999496,6 1,29 1,40 1,90 1,103 5}
{0 CHEMBL1999590,6 1,73 1,80 1,85 1,103 5}
{0 CHEMBL1999714,6 1,40 1,103 5}
{0 CHEMBL1999718,6 1,7 1,40 1,54 1,73 1,103 5}
{0 CHEMBL1999811,6 1,40 1,44 1,93 1,103 5.6}
{0 CHEMBL1999931,1 1,6 1,9 1,40 1,52 1,86 1,103 5.9}
{0 CHEMBL2000071,1 1,6 1,40 1,69 1,70 1,80 1,103 5.7}
{0 CHEMBL2000114,1 1,6 1,40 1,63 1,80 1,103 5.2}
{0 CHEMBL2000335,6 1,26 1,31 1,32 1,40 1,80 1,103 5}
{0 CHEMBL2000345,1 1,6 1,7 1,36 1,58 1,63 1,103 5.5}
{0 CHEMBL2000354,6 1,63 1,72 1,90 1,99 1,103 5.3}
{0 CHEMBL2000393,6 1,16 1,40 1,75 1,91 1,103 5.6}
{0 CHEMBL2000408,3 1,4 1,5 1,6 1,37 1,40 1,75 1,87 1,99 1,103 5}
{0 CHEMBL2000429,2 1,3 1,4 1,5 1,6 1,37 1,40 1,69 1,75 1,87 1,91 1,103 5}
{0 CHEMBL2000481,6 1,18 1,29 1,40 1,103 5}
{0 CHEMBL2000508,2 1,3 1,4 1,21 1,42 1,69 1,75 1,103 5}
{0 CHEMBL2000568,1 1,6 1,11 1,55 1,85 1,103 5}
{0 CHEMBL2000801,6 1,40 1,47 1,54 1,75 1,103 5}
{0 CHEMBL2000832,6 1,40 1,63 1,75 1,103 6}
{0 CHEMBL2000894,6 1,21 1,39 1,90 1,103 5}
{0 CHEMBL2001224,6 1,7 1,40 1,73 1,103 5}
{0 CHEMBL2001239,6 1,31 1,75 1,90 1,103 5.2}
{0 CHEMBL2001257,6 1,7 1,31 1,40 1,103 5.3}
{0 CHEMBL2001288,6 1,31 1,34 1,80 1,103 5}
{0 CHEMBL2001485,6 1,31 1,40 1,103 5}
{0 CHEMBL2001547,2 1,3 1,4 1,5 1,6 1,40 1,69 1,73 1,75 1,87 1,99 1,103 5}
{0 CHEMBL2001668,6 1,43 1,103 5}
{0 CHEMBL2001751,1 1,6 1,11 1,32 1,40 1,48 1,58 1,73 1,85 1,89 1,90 1,103 6.8}
{0 CHEMBL2001920,6 1,40 1,75 1,90 1,99 1,103 5}
{0 CHEMBL2001957,2 1,3 1,4 1,5 1,6 1,37 1,40 1,69 1,75 1,87 1,91 1,103 5}
{0 CHEMBL2002165,6 1,31 1,40 1,75 1,103 5.6}
{0 CHEMBL2002240,6 1,7 1,31 1,40 1,73 1,90 1,103 5}
{0 CHEMBL2002373,3 1,6 1,21 1,103 5}
{0 CHEMBL2002446,1 1,6 1,7 1,9 1,29 1,65 1,73 1,75 1,103 5.1}
{0 CHEMBL2002479,6 1,16 1,75 1,103 5}
{0 CHEMBL2002553,6 1,19 1,20 1,103 5}
{0 CHEMBL2002649,1 1,6 1,40 1,63 1,90 1,103 6.2}
{0 CHEMBL2002682,1 1,6 1,55 1,75 1,103 5}
{0 CHEMBL2002702,1 1,6 1,40 1,55 1,90 1,103 5.6}
{0 CHEMBL2002726,1 1,6 1,9 1,55 1,85 1,103 5.9}
{0 CHEMBL2002992,1 1,6 1,39 1,40 1,88 1,90 1,103 5.4}
{0 CHEMBL2003271,6 1,40 1,75 1,103 5.3}
{0 CHEMBL2003286,6 1,63 1,90 1,99 1,103 5.1}
{0 CHEMBL2003341,6 1,21 1,103 5}
{0 CHEMBL2003420,6 1,57 1,103 5}
{0 CHEMBL2003456,6 1,40 1,85 1,103 5.1}
{0 CHEMBL2003482,1 1,6 1,9 1,40 1,45 1,75 1,86 1,90 1,103 5}
{0 CHEMBL2003638,1 1,6 1,9 1,40 1,52 1,75 1,86 1,103 5.7}
{0 CHEMBL2003768,6 1,17 1,63 1,79 1,103 5}
{0 CHEMBL2003817,6 1,40 1,54 1,69 1,103 5}
{0 CHEMBL2003871,6 1,7 1,30 1,75 1,103 5.7}
{0 CHEMBL2004290,6 1,31 1,40 1,63 1,103 5}
{0 CHEMBL2004311,6 1,29 1,40 1,103 5}
{0 CHEMBL2004365,6 1,32 1,73 1,90 1,103 5}
{0 CHEMBL2004419,2 1,3 1,4 1,6 1,14 1,31 1,42 1,44 1,55 1,69 1,75 1,103 5}
{0 CHEMBL2004447,1 1,6 1,7 1,9 1,21 1,55 1,75 1,91 1,103 5}
{0 CHEMBL2004513,6 1,40 1,103 5}
{0 CHEMBL2004544,6 1,40 1,93 1,103 5}
{0 CHEMBL2004615,6 1,19 1,31 1,91 1,103 5.1}
{0 CHEMBL2004647,6 1,20 1,26 1,41 1,91 1,103 5}
{0 CHEMBL2004692,6 1,31 1,73 1,103 5}
{0 CHEMBL2004716,6 1,7 1,31 1,40 1,41 1,90 1,103 5.3}
{0 CHEMBL2004771,6 1,103 5.8}
{0 CHEMBL2004871,3 1,6 1,21 1,75 1,103 5}
{0 CHEMBL2004872,6 1,55 1,63 1,103 5}
{0 CHEMBL2004892,1 1,6 1,9 1,31 1,40 1,58 1,103 5.1}
{0 CHEMBL2004934,6 1,21 1,63 1,103 5}
{0 CHEMBL2005112,6 1,7 1,44 1,75 1,103 5}
{0 CHEMBL2005186,1 1,6 1,9 1,34 1,43 1,58 1,90 1,103 5}
{0 CHEMBL2005375,6 1,22 1,63 1,91 1,103 5}
{0 CHEMBL2005475,1 1,6 1,9 1,45 1,65 1,103 6.2}
{0 CHEMBL2005528,1 1,6 1,55 1,58 1,69 1,103 5}
{0 CHEMBL2005631,6 1,31 1,40 1,41 1,75 1,82 1,103 5.6}
{0 CHEMBL2005828,6 1,26 1,31 1,32 1,40 1,80 1,103 5}
{0 CHEMBL2005886,1 1,6 1,7 1,33 1,36 1,75 1,90 1,103 5.7}
{0 CHEMBL2005899,6 1,46 1,103 5}
{0 CHEMBL2005936,1 1,6 1,9 1,40 1,45 1,86 1,90 1,101 1,103 5.7}
{0 CHEMBL2006010,6 1,40 1,54 1,75 1,103 5}
{0 CHEMBL2006156,6 1,40 1,99 1,103 5}
{0 CHEMBL2006188,6 1,21 1,40 1,63 1,103 5}
{0 CHEMBL2006237,1 1,6 1,7 1,36 1,40 1,58 1,103 5}
{0 CHEMBL2006263,6 1,31 1,40 1,103 5.6}
{0 CHEMBL2006276,6 1,40 1,63 1,103 5}
{0 CHEMBL2006439,1 1,6 1,40 1,70 1,103 5}
{0 CHEMBL2006481,1 1,6 1,9 1,34 1,58 1,103 5}
{0 CHEMBL2006493,5 1,6 1,54 1,103 5}
{0 CHEMBL2006580,26 1,80 1,103 5.3}
{0 CHEMBL2006631,6 1,7 1,40 1,103 5}
{0 CHEMBL2006715,2 1,3 1,4 1,5 1,6 1,28 1,40 1,42 1,69 1,75 1,103 5}
{0 CHEMBL2006778,1 1,6 1,31 1,41 1,55 1,90 1,103 5.8}
{0 CHEMBL2006785,6 1,7 1,40 1,75 1,103 5}
{0 CHEMBL2006836,6 1,7 1,20 1,44 1,103 5}
{0 CHEMBL2007002,1 1,6 1,9 1,40 1,58 1,63 1,103 5.2}
{0 CHEMBL2007044,1 1,6 1,7 1,9 1,11 1,65 1,73 1,103 5}
{0 CHEMBL2007064,1 1,6 1,40 1,55 1,58 1,90 1,103 6.3}
{0 CHEMBL2007296,6 1,21 1,103 5}
{0 CHEMBL2007372,2 1,3 1,4 1,5 1,6 1,37 1,40 1,41 1,69 1,75 1,87 1,91 1,103 5}
{0 CHEMBL2007592,6 1,40 1,103 5}
{0 CHEMBL207253,6 1,31 1,43 1,75 1,91 1,103 5}
{0 CHEMBL207400,6 1,54 1,75 1,91 1,103 5}
{0 CHEMBL208637,6 1,7 1,31 1,40 1,73 1,90 1,91 1,96 1,103 5}
{0 CHEMBL210032,6 1,7 1,31 1,40 1,73 1,90 1,103 5}
{0 CHEMBL210618,6 1,7 1,31 1,40 1,63 1,73 1,90 1,91 1,96 1,103 5}
{0 CHEMBL210887,6 1,40 1,44 1,103 5}
{0 CHEMBL210928,6 1,31 1,40 1,63 1,90 1,91 1,103 5}
{0 CHEMBL210963,6 1,7 1,31 1,40 1,63 1,73 1,90 1,91 1,96 1,103 5}
{0 CHEMBL211378,6 1,31 1,40 1,80 1,103 5}
{0 CHEMBL213505,6 1,31 1,40 1,54 1,80 1,103 5.1}
{0 CHEMBL215152,1 1,6 1,7 1,9 1,40 1,55 1,75 1,80 1,90 1,103 5}
{0 CHEMBL220057,1 1,6 1,9 1,31 1,40 1,58 1,103 5.4}
{0 CHEMBL220241,6 1,7 1,31 1,40 1,43 1,44 1,70 1,91 1,103 5}
{0 CHEMBL221959,1 1,6 1,7 1,15 1,91 1,92 1,103 5}
{0 CHEMBL223360,1 1,6 1,9 1,31 1,40 1,58 1,75 1,103 5.2}
{0 CHEMBL223367,6 1,7 1,40 1,73 1,91 1,103 6.3}
{0 CHEMBL223460,6 1,7 1,40 1,73 1,91 1,103 6.4}
{0 CHEMBL225519,1 1,6 1,21 1,55 1,103 6}
{0 CHEMBL226403,1 1,6 1,21 1,55 1,99 1,103 5.6}
{0 CHEMBL226471,1 1,6 1,21 1,55 1,75 1,99 1,103 5.9}
{0 CHEMBL230011,3 1,31 1,87 1,103 6.137}
{0 CHEMBL2309006,6 1,12 1,49 1,65 1,103 7.602}
{0 CHEMBL2309609,6 1,13 1,49 1,65 1,103 5.921}
{0 CHEMBL231209,6 1,31 1,40 1,75 1,103 5}
{0 CHEMBL2333365,6 1,11 1,13 1,31 1,85 1,103 5}
{0 CHEMBL234085,1 1,6 1,7 1,15 1,91 1,92 1,103 5}
{0 CHEMBL243088,6 1,20 1,103 5.4}
{0 CHEMBL244378,1 1,6 1,9 1,20 1,103 6.2}
{0 CHEMBL246970,6 1,25 1,40 1,75 1,103 5}
{0 CHEMBL24828,6 1,7 1,63 1,75 1,80 1,103 5}
{0 CHEMBL248757,5 1,6 1,7 1,8 1,40 1,55 1,73 1,91 1,103 6.9}
{0 CHEMBL249282,1 1,6 1,7 1,9 1,64 1,65 1,73 1,103 5.2}
{0 CHEMBL249697,4 1,6 1,40 1,91 1,103 5}
{0 CHEMBL253969,6 1,7 1,40 1,57 1,91 1,103 5.2}
{0 CHEMBL255863,5 1,6 1,40 1,54 1,103 5}
{0 CHEMBL256835,3 1,6 1,75 1,103 5}
{0 CHEMBL259084,6 1,20 1,75 1,79 1,99 1,103 5}
{0 CHEMBL259922,6 1,40 1,47 1,80 1,89 1,103 5}
{0 CHEMBL260135,1 1,9 1,31 1,45 1,86 1,103 5}
{0 CHEMBL261849,6 1,31 1,63 1,103 5}
{0 CHEMBL262433,6 1,31 1,40 1,75 1,80 1,103 5}
{0 CHEMBL271381,6 1,31 1,40 1,63 1,75 1,103 5}
{0 CHEMBL272453,6 1,31 1,40 1,63 1,103 5}
{0 CHEMBL274064,3 1,6 1,31 1,57 1,75 1,103 5}
{0 CHEMBL278041,1 1,21 1,29 1,75 1,103 5}
{0 CHEMBL288441,6 1,7 1,63 1,73 1,103 5}
{0 CHEMBL296468,6 1,40 1,50 1,57 1,88 1,90 1,91 1,103 5}
{0 CHEMBL300138,6 1,7 1,73 1,75 1,90 1,103 5}
{0 CHEMBL306380,6 1,31 1,80 1,103 5}
{0 CHEMBL316264,1 1,21 1,29 1,75 1,103 5}
{0 CHEMBL31965,6 1,7 1,40 1,75 1,80 1,90 1,103 5}
{0 CHEMBL340384,6 1,21 1,39 1,90 1,103 5}
{0 CHEMBL340921,6 1,21 1,39 1,90 1,103 5}
{0 CHEMBL362558,4 1,6 1,36 1,90 1,103 5}
{0 CHEMBL363648,3 1,6 1,11 1,21 1,40 1,74 1,103 5}
{0 CHEMBL371206,6 1,26 1,29 1,31 1,32 1,40 1,80 1,103 5}
{0 CHEMBL377300,1 1,6 1,55 1,58 1,70 1,91 1,94 1,103 5}
{0 CHEMBL377383,6 1,31 1,91 1,103 5}
{0 CHEMBL377408,6 1,7 1,31 1,73 1,91 1,96 1,103 5}
{0 CHEMBL378627,6 1,7 1,31 1,40 1,63 1,73 1,90 1,91 1,96 1,103 5}
{0 CHEMBL379218,1 1,6 1,9 1,55 1,85 1,103 5}
{0 CHEMBL379835,6 1,75 1,91 1,103 5}
{0 CHEMBL384304,6 1,7 1,31 1,40 1,63 1,75 1,103 5}
{0 CHEMBL386051,6 1,63 1,75 1,91 1,103 5.469}
{0 CHEMBL387971,1 1,6 1,7 1,9 1,29 1,64 1,65 1,73 1,75 1,103 5}
{0 CHEMBL392642,6 1,25 1,40 1,63 1,103 5}
{0 CHEMBL394619,6 1,31 1,40 1,103 5}
{0 CHEMBL394790,6 1,31 1,40 1,75 1,103 5}
{0 CHEMBL396523,1 1,6 1,9 1,20 1,34 1,58 1,103 6.1}
{0 CHEMBL398951,1 1,6 1,7 1,9 1,64 1,65 1,73 1,103 5.2}
{0 CHEMBL402846,6 1,31 1,40 1,69 1,75 1,103 5}
{0 CHEMBL404367,6 1,31 1,40 1,69 1,103 5}
{0 CHEMBL411903,6 1,31 1,40 1,54 1,75 1,80 1,103 5.1}
{0 CHEMBL412142,1 1,6 1,7 1,40 1,73 1,75 1,103 5}
{0 CHEMBL41783,1 1,6 1,7 1,9 1,40 1,45 1,75 1,86 1,90 1,101 1,103 5.1}
{0 CHEMBL422897,6 1,7 1,75 1,93 1,103 5}
{0 CHEMBL424872,6 1,7 1,31 1,73 1,91 1,96 1,103 5}
{0 CHEMBL428690,6 1,7 1,75 1,93 1,103 5}
{0 CHEMBL440084,1 1,6 1,93 1,99 1,103 5}
{0 CHEMBL443962,6 1,63 1,103 5.1}
{0 CHEMBL445813,1 1,6 1,9 1,40 1,57 1,75 1,103 5}
{0 CHEMBL450786,1 1,6 1,7 1,29 1,40 1,55 1,58 1,75 1,77 1,90 1,103 5}
{0 CHEMBL458997,6 1,41 1,63 1,82 1,103 6.1}
{0 CHEMBL462120,6 1,40 1,75 1,90 1,103 5}
{0 CHEMBL464552,1 1,6 1,7 1,41 1,63 1,75 1,82 1,103 5}
{0 CHEMBL468280,6 1,91 1,103 5}
{0 CHEMBL474432,6 1,54 1,63 1,103 6.6}
{0 CHEMBL475251,6 1,25 1,40 1,52 1,63 1,90 1,103 5}
{0 CHEMBL477772,6 1,91 1,103 5}
{0 CHEMBL481491,6 1,54 1,103 5.3}
{0 CHEMBL482767,6 1,40 1,58 1,75 1,80 1,103 5.7}
{0 CHEMBL482967,6 1,31 1,103 7.1}
{0 CHEMBL483158,6 1,20 1,63 1,75 1,79 1,99 1,103 5.7}
{0 CHEMBL483321,6 1,41 1,69 1,73 1,80 1,90 1,103 5}
{0 CHEMBL484390,6 1,7 1,40 1,44 1,73 1,77 1,103 5}
{0 CHEMBL491473,1 1,6 1,7 1,55 1,58 1,63 1,70 1,91 1,103 5}
{0 CHEMBL491758,103 5}
{0 CHEMBL494089,6 1,31 1,43 1,57 1,66 1,73 1,103 5}
{0 CHEMBL497151,73 1,75 1,103 5}
{0 CHEMBL508928,6 1,31 1,40 1,75 1,103 5}
{0 CHEMBL50894,1 1,6 1,40 1,58 1,90 1,103 6.8}
{0 CHEMBL509032,1 1,6 1,7 1,63 1,103 6.509}
{0 CHEMBL513846,4 1,6 1,103 5}
{0 CHEMBL513909,6 1,7 1,22 1,63 1,91 1,103 5}
{0 CHEMBL514499,6 1,54 1,63 1,103 6.6}
{0 CHEMBL519697,6 1,7 1,40 1,44 1,73 1,77 1,103 5}
{0 CHEMBL521851,1 1,6 1,7 1,9 1,43 1,58 1,75 1,91 1,103 5}
{0 CHEMBL522892,1 1,6 1,7 1,36 1,40 1,58 1,75 1,87 1,90 1,103 5}
{0 CHEMBL52387,6 1,40 1,103 5}
{0 CHEMBL525191,6 1,11 1,21 1,28 1,103 5}
{0 CHEMBL526133,1 1,6 1,9 1,34 1,58 1,69 1,103 5}
{0 CHEMBL535,1 1,6 1,7 1,40 1,55 1,58 1,75 1,90 1,103 5.456}
{0 CHEMBL535331,1 1,6 1,33 1,36 1,44 1,48 1,58 1,85 1,89 1,103 5}
{0 CHEMBL539474,6 1,28 1,40 1,103 5.7}
{0 CHEMBL553,6 1,13 1,80 1,103 5}
{0 CHEMBL554,6 1,36 1,57 1,75 1,80 1,103 5}
{0 CHEMBL558752,1 1,6 1,40 1,44 1,54 1,82 1,99 1,103 5}
{0 CHEMBL560813,6 1,7 1,20 1,40 1,69 1,73 1,103 5.3}
{0 CHEMBL565612,1 1,6 1,7 1,48 1,58 1,89 1,90 1,103 5.6}
{0 CHEMBL572878,1 1,6 1,7 1,9 1,21 1,40 1,55 1,75 1,88 1,90 1,91 1,103 5.076}
{0 CHEMBL572881,6 1,40 1,103 5}
{0 CHEMBL573339,6 1,26 1,43 1,91 1,103 5}
{0 CHEMBL574738,6 1,7 1,21 1,40 1,41 1,54 1,70 1,75 1,80 1,91 1,103 5}
{0 CHEMBL576982,4 1,6 1,7 1,40 1,43 1,103 5}
{0 CHEMBL583144,6 1,14 1,39 1,75 1,103 5}
{0 CHEMBL592030,1 1,6 1,9 1,31 1,34 1,103 7.1}
{0 CHEMBL601719,6 1,31 1,57 1,75 1,85 1,103 5}
{0 CHEMBL607707,4 1,6 1,7 1,40 1,73 1,75 1,90 1,103 5}
{0 CHEMBL608154,1 1,6 1,40 1,63 1,73 1,103 5}
{0 CHEMBL7064,1 1,6 1,9 1,45 1,65 1,103 6.1}
{0 CHEMBL91829,6 1,7 1,36 1,90 1,103 5}
{0 CHEMBL939,6 1,7 1,63 1,75 1,80 1,103 5.5}
{0 CHEMBL941,6 1,7 1,40 1,75 1,103 5}
{0 CHEMBL95692,3 1,6 1,57 1,75 1,103 5}
