{
  "data_set_description": {
    "collection_date": "November 2013",
    "creator": "Dr Jeremy Besnard, Dr Ivan Olier, Dr Noureddin Sadawi, Dr Larisa Soldatova, Dr Crina Grosan, Prof Ross King, Dr Richard Bickerton, Prof Andrew Hopkins and Dr Willem van Hoorn",
    "default_target_attribute": "pXC50",
    "description": "This dataset contains QSAR data (from ChEMBL version 17) showing activity values (unit is pseudo-pCI50) of several compounds on drug target ChEMBL_ID: CHEMBL3234 (TID: 11785), and it has 413 rows and 43 features (not including molecule IDs and class feature: molecule_id and pXC50). The features represent Basic Molecular Descriptors which were generated from SMILES strings.  Missing value imputation was applied to this dataset (By choosing the Median).",
    "description_version": "1",
    "file_id": "3479480",
    "format": "ARFF",
    "id": "32404",
    "licence": "Public",
    "md5_checksum": "6d06e37e53c95b88a627df6ce6b18778",
    "minio_url": "https://data.openml.org/datasets/0003/32404/dataset_32404.pq",
    "name": "QSAR-DATASET-FOR-DRUG-TARGET-CHEMBL3234",
    "original_data_url": "https://www.ebi.ac.uk/chembl/target/inspect/CHEMBL3234",
    "parquet_url": "https://data.openml.org/datasets/0003/32404/dataset_32404.pq",
    "processing_date": "2018-10-04 02:54:11",
    "row_id_attribute": "molecule_id",
    "status": "deactivated",
    "tag": [
      "MetaQSAR",
      "study_13"
    ],
    "upload_date": "2016-07-15T10:06:27",
    "url": "https://api.openml.org/data/v1/download/3479480/QSAR-DATASET-FOR-DRUG-TARGET-CHEMBL3234.arff",
    "version": "11",
    "visibility": "public"
  }
}