{
  "data_set_description": {
    "collection_date": "November 2013",
    "creator": "Dr Jeremy Besnard, Dr Ivan Olier, Dr Noureddin Sadawi, Dr Larisa Soldatova, Dr Crina Grosan, Prof Ross King, Dr Richard Bickerton, Prof Andrew Hopkins and Dr Willem van Hoorn",
    "default_target_attribute": "pXC50",
    "description": "This dataset contains QSAR data (from ChEMBL version 17) showing activity values (unit is pseudo-pCI50) of several compounds on drug target ChEMBL_ID: CHEMBL3773 (TID: 12732), and it has 10 rows and 43 features (not including molecule IDs and class feature: molecule_id and pXC50). The features represent Basic Molecular Descriptors which were generated from SMILES strings.  Missing value imputation was applied to this dataset (By choosing the Median).",
    "description_version": "1",
    "file_id": "3479445",
    "format": "ARFF",
    "id": "32391",
    "licence": "Public",
    "md5_checksum": "976f20388859150f826e419b0937c415",
    "minio_url": "https://data.openml.org/datasets/0003/32391/dataset_32391.pq",
    "name": "QSAR-DATASET-FOR-DRUG-TARGET-CHEMBL3773",
    "original_data_url": "https://www.ebi.ac.uk/chembl/target/inspect/CHEMBL3773",
    "parquet_url": "https://data.openml.org/datasets/0003/32391/dataset_32391.pq",
    "processing_date": "2018-10-04 02:58:12",
    "row_id_attribute": "molecule_id",
    "status": "deactivated",
    "tag": [
      "MetaQSAR",
      "study_13"
    ],
    "upload_date": "2016-07-15T10:04:40",
    "url": "https://api.openml.org/data/v1/download/3479445/QSAR-DATASET-FOR-DRUG-TARGET-CHEMBL3773.arff",
    "version": "5",
    "visibility": "public"
  }
}