"molecule_id","FCFP4_1024b471","FCFP4_1024b143","FCFP4_1024b31","FCFP4_1024b434","FCFP4_1024b604","FCFP4_1024b635","FCFP4_1024b846","FCFP4_1024b855","FCFP4_1024b858","FCFP4_1024b957","FCFP4_1024b1","FCFP4_1024b10","FCFP4_1024b100","FCFP4_1024b1000","FCFP4_1024b1001","FCFP4_1024b1002","FCFP4_1024b1003","FCFP4_1024b1004","FCFP4_1024b1005","FCFP4_1024b1006","FCFP4_1024b1007","FCFP4_1024b1008","FCFP4_1024b1009","FCFP4_1024b101","FCFP4_1024b1010","FCFP4_1024b1011","FCFP4_1024b1012","FCFP4_1024b1013","FCFP4_1024b1014","FCFP4_1024b1015","FCFP4_1024b1016","FCFP4_1024b1017","FCFP4_1024b1018","FCFP4_1024b1019","FCFP4_1024b102","FCFP4_1024b1020","FCFP4_1024b1021","FCFP4_1024b1022","FCFP4_1024b1023","FCFP4_1024b1024","FCFP4_1024b103","FCFP4_1024b104","FCFP4_1024b105","FCFP4_1024b106","FCFP4_1024b107","FCFP4_1024b108","FCFP4_1024b109","FCFP4_1024b11","FCFP4_1024b110","FCFP4_1024b111","FCFP4_1024b112","pXC50"
{7 1,10 1,11 1,45 1,46 1,52 5.585}
{0 CHEMBL2331570,1 1,7 1,10 1,11 1,14 1,41 1,45 1,52 5.979}
{0 CHEMBL2332840,1 1,7 1,10 1,11 1,14 1,41 1,45 1,52 5.648}
{0 CHEMBL2332841,2 1,3 1,4 1,5 1,6 1,8 1,9 1,11 1,14 1,41 1,45 1,52 4}
{0 CHEMBL2332842,2 1,3 1,4 1,5 1,6 1,8 1,9 1,11 1,14 1,41 1,45 1,52 4}
{0 CHEMBL2332843,2 1,3 1,4 1,5 1,6 1,8 1,9 1,11 1,14 1,41 1,45 1,52 4}
{0 CHEMBL2332844,2 1,3 1,4 1,5 1,6 1,8 1,9 1,11 1,14 1,41 1,45 1,52 4}
{0 CHEMBL2332845,2 1,3 1,4 1,5 1,6 1,8 1,9 1,11 1,14 1,41 1,45 1,52 4}
{0 CHEMBL2332846,1 1,7 1,10 1,11 1,14 1,41 1,45 1,52 4.086}
{0 CHEMBL2332847,1 1,7 1,10 1,11 1,14 1,41 1,45 1,52 4.127}
{0 CHEMBL2332848,1 1,7 1,10 1,11 1,14 1,41 1,45 1,52 4.005}
{0 CHEMBL2332849,1 1,7 1,10 1,11 1,14 1,41 1,45 1,52 5.921}
{0 CHEMBL2332850,7 1,10 1,11 1,45 1,52 4}
{0 CHEMBL2332851,7 1,10 1,11 1,45 1,52 4}
{0 CHEMBL2332852,1 1,7 1,10 1,11 1,14 1,41 1,45 1,52 4}
{0 CHEMBL2332853,1 1,7 1,10 1,11 1,14 1,41 1,45 1,52 4}
{0 CHEMBL2332854,1 1,7 1,10 1,11 1,14 1,41 1,45 1,52 4}
{0 CHEMBL2332855,1 1,7 1,10 1,11 1,14 1,41 1,45 1,52 4}
{0 CHEMBL2332856,1 1,7 1,10 1,11 1,14 1,41 1,45 1,52 4}
{0 CHEMBL2332857,1 1,7 1,10 1,11 1,14 1,41 1,45 1,52 4}
{0 CHEMBL2332858,1 1,7 1,10 1,11 1,14 1,41 1,45 1,52 4.127}
{0 CHEMBL2332859,1 1,7 1,10 1,11 1,14 1,41 1,45 1,52 4.127}
{0 CHEMBL2332860,1 1,7 1,10 1,11 1,14 1,41 1,45 1,52 4.694}
{0 CHEMBL2332861,1 1,7 1,10 1,11 1,14 1,41 1,45 1,52 4}
{0 CHEMBL2332862,1 1,7 1,10 1,11 1,14 1,41 1,45 1,52 4.008}
{0 CHEMBL2332863,1 1,7 1,10 1,11 1,14 1,41 1,45 1,52 4}
{0 CHEMBL2332864,1 1,7 1,10 1,11 1,14 1,41 1,45 1,52 4}
{0 CHEMBL2332865,1 1,7 1,10 1,11 1,14 1,41 1,45 1,52 4.049}
{0 CHEMBL2332866,1 1,7 1,10 1,11 1,14 1,41 1,45 1,52 4}
{0 CHEMBL2332867,1 1,7 1,10 1,11 1,14 1,41 1,45 1,52 5.112}
{0 CHEMBL2332868,1 1,7 1,10 1,11 1,14 1,41 1,45 1,52 4.78}
{0 CHEMBL2332869,1 1,7 1,10 1,11 1,14 1,41 1,45 1,52 4.751}
{0 CHEMBL2332870,1 1,7 1,10 1,11 1,14 1,34 1,41 1,45 1,52 5.286}
{0 CHEMBL2332871,1 1,7 1,10 1,11 1,14 1,41 1,45 1,52 5.073}
