"molecule_id","AMW","C.","pXC50"
{1 8.233,2 32.7,3 4.523}
{0 CHEMBL207912,1 6.843,2 37.5,3 4.523}
{0 CHEMBL207980,1 6.648,2 38.3,3 4.523}
{0 CHEMBL209191,1 6.618,2 34.8,3 4.523}
{0 CHEMBL209994,1 6.394,2 34.6,3 4.523}
{0 CHEMBL237786,1 8.541,2 42.6,3 4.523}
{0 CHEMBL379086,1 6.754,2 34.9,3 4.523}
{0 CHEMBL379522,1 6.909,2 35,3 4.523}
{0 CHEMBL383488,1 6.782,2 38.6,3 4.523}
{0 CHEMBL515387,1 7.329,2 34,3 4.523}
