{
  "data_set_description": {
    "collection_date": "November 2013",
    "creator": "Dr Jeremy Besnard, Dr Ivan Olier, Dr Noureddin Sadawi, Dr Larisa Soldatova, Dr Crina Grosan, Prof Ross King, Dr Richard Bickerton, Prof Andrew Hopkins and Dr Willem van Hoorn",
    "default_target_attribute": "pXC50",
    "description": "This dataset contains QSAR data (from ChEMBL version 17) showing activity values (unit is pseudo-pCI50) of several compounds on drug target ChEMBL_ID: CHEMBL5256 (TID: 30029), and it has 82 rows and 1304 features (not including molecule IDs and class feature: molecule_id and pXC50). The features represent Molecular Descriptors which were generated from SMILES strings. Missing value imputation was applied to this dataset (By choosing the Median).",
    "description_version": "1",
    "file_id": "3478950",
    "format": "ARFF",
    "id": "32378",
    "licence": "Public",
    "md5_checksum": "e2e48dfe2a3c2277a118a11d37533772",
    "minio_url": "https://data.openml.org/datasets/0003/32378/dataset_32378.pq",
    "name": "QSAR-DATASET-FOR-DRUG-TARGET-CHEMBL5256",
    "original_data_url": "https://www.ebi.ac.uk/chembl/target/inspect/CHEMBL5256",
    "parquet_url": "https://data.openml.org/datasets/0003/32378/dataset_32378.pq",
    "processing_date": "2018-10-04 02:54:20",
    "row_id_attribute": "molecule_id",
    "status": "deactivated",
    "tag": [
      "MetaQSAR",
      "study_13"
    ],
    "upload_date": "2016-07-15T10:02:37",
    "url": "https://api.openml.org/data/v1/download/3478950/QSAR-DATASET-FOR-DRUG-TARGET-CHEMBL5256.arff",
    "version": "9",
    "visibility": "public"
  }
}