{
  "data_features": {
    "feature": [
      {
        "data_type": "nominal",
        "index": "0",
        "is_ignore": "false",
        "is_row_identifier": "true",
        "is_target": "false",
        "name": "molecule_id",
        "nominal_value": [
          "CHEMBL1668626",
          "CHEMBL1668627",
          "CHEMBL1821974",
          "CHEMBL1821975",
          "CHEMBL1821976",
          "CHEMBL1821977",
          "CHEMBL1821978",
          "CHEMBL1821979",
          "CHEMBL1821980",
          "CHEMBL1821981",
          "CHEMBL1821982",
          "CHEMBL1821983",
          "CHEMBL1821984",
          "CHEMBL2179972",
          "CHEMBL2179973",
          "CHEMBL2179977",
          "CHEMBL2179978",
          "CHEMBL2179979",
          "CHEMBL2179981",
          "CHEMBL29292"
        ],
        "number_of_missing_values": "0"
      },
      {
        "data_type": "numeric",
        "index": "1",
        "is_ignore": "false",
        "is_row_identifier": "false",
        "is_target": "false",
        "name": "MW",
        "number_of_missing_values": "0"
      },
      {
        "data_type": "numeric",
        "index": "2",
        "is_ignore": "false",
        "is_row_identifier": "false",
        "is_target": "false",
        "name": "SCBO",
        "number_of_missing_values": "0"
      },
      {
        "data_type": "numeric",
        "index": "3",
        "is_ignore": "false",
        "is_row_identifier": "false",
        "is_target": "false",
        "name": "RBF",
        "number_of_missing_values": "0"
      },
      {
        "data_type": "numeric",
        "index": "4",
        "is_ignore": "false",
        "is_row_identifier": "false",
        "is_target": "false",
        "name": "nAT",
        "number_of_missing_values": "0"
      },
      {
        "data_type": "numeric",
        "index": "5",
        "is_ignore": "false",
        "is_row_identifier": "false",
        "is_target": "true",
        "name": "pXC50",
        "number_of_missing_values": "0"
      }
    ]
  }
}