{
  "data_features": {
    "feature": [
      {
        "data_type": "nominal",
        "index": "0",
        "is_ignore": "false",
        "is_row_identifier": "true",
        "is_target": "false",
        "name": "molecule_id",
        "nominal_value": [
          "CHEMBL1083652",
          "CHEMBL1171987",
          "CHEMBL1171991",
          "CHEMBL1172779",
          "CHEMBL1172842",
          "CHEMBL1172847",
          "CHEMBL1172882",
          "CHEMBL1173259",
          "CHEMBL1173260",
          "CHEMBL1173326",
          "CHEMBL1173327",
          "CHEMBL1173335",
          "CHEMBL1208801",
          "CHEMBL1209476",
          "CHEMBL1209553",
          "CHEMBL1209554",
          "CHEMBL1209555",
          "CHEMBL1209556",
          "CHEMBL1209557",
          "CHEMBL1209558",
          "CHEMBL1209623",
          "CHEMBL1209624",
          "CHEMBL1209625",
          "CHEMBL1209626",
          "CHEMBL1209627",
          "CHEMBL1209628",
          "CHEMBL1209693",
          "CHEMBL1209694",
          "CHEMBL1209695",
          "CHEMBL1209696",
          "CHEMBL1209775",
          "CHEMBL1214660",
          "CHEMBL1214735",
          "CHEMBL1214736",
          "CHEMBL1214737",
          "CHEMBL1214739",
          "CHEMBL1215664",
          "CHEMBL1215665",
          "CHEMBL1215730",
          "CHEMBL1215732",
          "CHEMBL1235146",
          "CHEMBL1328035",
          "CHEMBL14192",
          "CHEMBL1428763",
          "CHEMBL1440486",
          "CHEMBL1444",
          "CHEMBL1444873",
          "CHEMBL1450329",
          "CHEMBL1507088",
          "CHEMBL1556445",
          "CHEMBL158635",
          "CHEMBL162496",
          "CHEMBL163922",
          "CHEMBL1645407",
          "CHEMBL1645408",
          "CHEMBL1645409",
          "CHEMBL1645412",
          "CHEMBL1645413",
          "CHEMBL1645416",
          "CHEMBL1645418",
          "CHEMBL1649605",
          "CHEMBL1651492",
          "CHEMBL1651493",
          "CHEMBL1651494",
          "CHEMBL1651495",
          "CHEMBL1651496",
          "CHEMBL1651497",
          "CHEMBL1651498",
          "CHEMBL1651499",
          "CHEMBL1651500",
          "CHEMBL1651501",
          "CHEMBL1651502",
          "CHEMBL1651503",
          "CHEMBL1651504",
          "CHEMBL1651505",
          "CHEMBL1651506",
          "CHEMBL1651507",
          "CHEMBL1651508",
          "CHEMBL1651509",
          "CHEMBL1651510",
          "CHEMBL1651511",
          "CHEMBL1651512",
          "CHEMBL1651513",
          "CHEMBL1651514",
          "CHEMBL1688911",
          "CHEMBL174579",
          "CHEMBL175091",
          "CHEMBL175144",
          "CHEMBL175554",
          "CHEMBL175688",
          "CHEMBL175791",
          "CHEMBL175799",
          "CHEMBL176098",
          "CHEMBL176101",
          "CHEMBL176118",
          "CHEMBL176287",
          "CHEMBL1765205",
          "CHEMBL1765206",
          "CHEMBL1765207",
          "CHEMBL1765208",
          "CHEMBL1765209",
          "CHEMBL1765210",
          "CHEMBL1765211",
          "CHEMBL1765212",
          "CHEMBL1765213",
          "CHEMBL1765214",
          "CHEMBL1765215",
          "CHEMBL1765217",
          "CHEMBL1765218",
          "CHEMBL1765219",
          "CHEMBL1765220",
          "CHEMBL1765221",
          "CHEMBL1765222",
          "CHEMBL1765223",
          "CHEMBL1765224",
          "CHEMBL1765225",
          "CHEMBL1765226",
          "CHEMBL1765227",
          "CHEMBL1765228",
          "CHEMBL1765229",
          "CHEMBL1765230",
          "CHEMBL1765231",
          "CHEMBL1765232",
          "CHEMBL176609",
          "CHEMBL176886",
          "CHEMBL177293",
          "CHEMBL177468",
          "CHEMBL177692",
          "CHEMBL177921",
          "CHEMBL178036",
          "CHEMBL179144",
          "CHEMBL179149",
          "CHEMBL179222",
          "CHEMBL179247",
          "CHEMBL193343",
          "CHEMBL193534",
          "CHEMBL193556",
          "CHEMBL193606",
          "CHEMBL193652",
          "CHEMBL193653",
          "CHEMBL193997",
          "CHEMBL194047",
          "CHEMBL194277",
          "CHEMBL194440",
          "CHEMBL194472",
          "CHEMBL195248",
          "CHEMBL195571",
          "CHEMBL195629",
          "CHEMBL195996",
          "CHEMBL196328",
          "CHEMBL196796",
          "CHEMBL197576",
          "CHEMBL199683",
          "CHEMBL2010808",
          "CHEMBL2011240",
          "CHEMBL2011241",
          "CHEMBL2011242",
          "CHEMBL2011243",
          "CHEMBL2011244",
          "CHEMBL2011245",
          "CHEMBL2011246",
          "CHEMBL2011247",
          "CHEMBL2011248",
          "CHEMBL2011249",
          "CHEMBL2011250",
          "CHEMBL2011251",
          "CHEMBL2011252",
          "CHEMBL2011253",
          "CHEMBL2011254",
          "CHEMBL2011255",
          "CHEMBL2011256",
          "CHEMBL2011257",
          "CHEMBL2011258",
          "CHEMBL2011259",
          "CHEMBL2011260",
          "CHEMBL2011261",
          "CHEMBL2011262",
          "CHEMBL2011263",
          "CHEMBL2011264",
          "CHEMBL2011430",
          "CHEMBL2011431",
          "CHEMBL2011432",
          "CHEMBL2011433",
          "CHEMBL2011434",
          "CHEMBL2011435",
          "CHEMBL2011436",
          "CHEMBL2011437",
          "CHEMBL205250",
          "CHEMBL205503",
          "CHEMBL205782",
          "CHEMBL205881",
          "CHEMBL206070",
          "CHEMBL206125",
          "CHEMBL206283",
          "CHEMBL206300",
          "CHEMBL206351",
          "CHEMBL206550",
          "CHEMBL207751",
          "CHEMBL208471",
          "CHEMBL211207",
          "CHEMBL212473",
          "CHEMBL212741",
          "CHEMBL213587",
          "CHEMBL213588",
          "CHEMBL2163636",
          "CHEMBL2163637",
          "CHEMBL2163638",
          "CHEMBL2163639",
          "CHEMBL2163640",
          "CHEMBL2163641",
          "CHEMBL2163642",
          "CHEMBL2163643",
          "CHEMBL2163644",
          "CHEMBL2163645",
          "CHEMBL2163646",
          "CHEMBL2163647",
          "CHEMBL2163648",
          "CHEMBL2163649",
          "CHEMBL2163650",
          "CHEMBL2163651",
          "CHEMBL2163652",
          "CHEMBL2165313",
          "CHEMBL2165314",
          "CHEMBL2165315",
          "CHEMBL2165316",
          "CHEMBL2165317",
          "CHEMBL2165318",
          "CHEMBL2165319",
          "CHEMBL2165320",
          "CHEMBL2165321",
          "CHEMBL2165322",
          "CHEMBL2165323",
          "CHEMBL2165324",
          "CHEMBL2165325",
          "CHEMBL224060",
          "CHEMBL225499",
          "CHEMBL2311553",
          "CHEMBL2312948",
          "CHEMBL2312949",
          "CHEMBL2312950",
          "CHEMBL2312951",
          "CHEMBL2312952",
          "CHEMBL2312953",
          "CHEMBL2312954",
          "CHEMBL2312955",
          "CHEMBL2312956",
          "CHEMBL2312957",
          "CHEMBL2312958",
          "CHEMBL2312959",
          "CHEMBL2312960",
          "CHEMBL2312961",
          "CHEMBL2312962",
          "CHEMBL2312963",
          "CHEMBL2312964",
          "CHEMBL2312965",
          "CHEMBL2312966",
          "CHEMBL2312967",
          "CHEMBL2312968",
          "CHEMBL2312969",
          "CHEMBL2312970",
          "CHEMBL2312971",
          "CHEMBL2312972",
          "CHEMBL2331699",
          "CHEMBL2331700",
          "CHEMBL2331701",
          "CHEMBL2331702",
          "CHEMBL2331703",
          "CHEMBL2331704",
          "CHEMBL2331705",
          "CHEMBL2331706",
          "CHEMBL2331707",
          "CHEMBL2333326",
          "CHEMBL2333327",
          "CHEMBL2333328",
          "CHEMBL2333329",
          "CHEMBL2333330",
          "CHEMBL2333331",
          "CHEMBL2333332",
          "CHEMBL2333333",
          "CHEMBL2333334",
          "CHEMBL2333335",
          "CHEMBL2333336",
          "CHEMBL2333337",
          "CHEMBL254328",
          "CHEMBL255759",
          "CHEMBL258097",
          "CHEMBL272749",
          "CHEMBL273205",
          "CHEMBL287677",
          "CHEMBL294361",
          "CHEMBL295698",
          "CHEMBL304583",
          "CHEMBL305220",
          "CHEMBL307160",
          "CHEMBL31215",
          "CHEMBL347547",
          "CHEMBL349822",
          "CHEMBL359817",
          "CHEMBL360026",
          "CHEMBL362187",
          "CHEMBL362441",
          "CHEMBL362968",
          "CHEMBL363621",
          "CHEMBL363849",
          "CHEMBL364080",
          "CHEMBL365120",
          "CHEMBL365735",
          "CHEMBL366490",
          "CHEMBL366773",
          "CHEMBL367483",
          "CHEMBL367719",
          "CHEMBL368305",
          "CHEMBL369623",
          "CHEMBL370530",
          "CHEMBL370822",
          "CHEMBL371430",
          "CHEMBL372747",
          "CHEMBL377766",
          "CHEMBL377770",
          "CHEMBL381014",
          "CHEMBL383806",
          "CHEMBL383807",
          "CHEMBL402298",
          "CHEMBL402522",
          "CHEMBL403598",
          "CHEMBL424960",
          "CHEMBL425054",
          "CHEMBL425323",
          "CHEMBL428780",
          "CHEMBL438802",
          "CHEMBL441367",
          "CHEMBL442373",
          "CHEMBL445259",
          "CHEMBL446083",
          "CHEMBL446775",
          "CHEMBL447591",
          "CHEMBL448064",
          "CHEMBL448743",
          "CHEMBL449894",
          "CHEMBL451505",
          "CHEMBL453169",
          "CHEMBL456390",
          "CHEMBL457425",
          "CHEMBL457640",
          "CHEMBL457646",
          "CHEMBL457856",
          "CHEMBL457858",
          "CHEMBL459071",
          "CHEMBL459969",
          "CHEMBL459970",
          "CHEMBL460178",
          "CHEMBL461457",
          "CHEMBL461458",
          "CHEMBL461884",
          "CHEMBL461885",
          "CHEMBL462092",
          "CHEMBL462093",
          "CHEMBL463582",
          "CHEMBL492891",
          "CHEMBL492892",
          "CHEMBL493082",
          "CHEMBL493089",
          "CHEMBL493485",
          "CHEMBL494315",
          "CHEMBL494515",
          "CHEMBL494712",
          "CHEMBL494713",
          "CHEMBL495333",
          "CHEMBL496262",
          "CHEMBL496263",
          "CHEMBL496286",
          "CHEMBL496288",
          "CHEMBL496289",
          "CHEMBL496456",
          "CHEMBL496469",
          "CHEMBL497480",
          "CHEMBL497481",
          "CHEMBL498472",
          "CHEMBL498652",
          "CHEMBL499007",
          "CHEMBL499044",
          "CHEMBL499871",
          "CHEMBL500145",
          "CHEMBL500146",
          "CHEMBL500392",
          "CHEMBL500393",
          "CHEMBL500394",
          "CHEMBL500395",
          "CHEMBL500421",
          "CHEMBL500636",
          "CHEMBL500663",
          "CHEMBL500664",
          "CHEMBL500665",
          "CHEMBL500676",
          "CHEMBL501740",
          "CHEMBL501779",
          "CHEMBL502266",
          "CHEMBL502818",
          "CHEMBL502823",
          "CHEMBL502824",
          "CHEMBL508155",
          "CHEMBL509971",
          "CHEMBL511329",
          "CHEMBL516643",
          "CHEMBL522228",
          "CHEMBL522860",
          "CHEMBL523196",
          "CHEMBL524011",
          "CHEMBL525785",
          "CHEMBL526081",
          "CHEMBL526339",
          "CHEMBL539168",
          "CHEMBL590987",
          "CHEMBL591229",
          "CHEMBL591465",
          "CHEMBL591697",
          "CHEMBL591698",
          "CHEMBL592614",
          "CHEMBL597101",
          "CHEMBL597173",
          "CHEMBL597368",
          "CHEMBL597369",
          "CHEMBL597577",
          "CHEMBL597578",
          "CHEMBL598389",
          "CHEMBL598390",
          "CHEMBL598391",
          "CHEMBL598399",
          "CHEMBL598606",
          "CHEMBL598789",
          "CHEMBL598790",
          "CHEMBL598810",
          "CHEMBL599222",
          "CHEMBL599223",
          "CHEMBL599601",
          "CHEMBL599602",
          "CHEMBL599603",
          "CHEMBL599622",
          "CHEMBL599623",
          "CHEMBL599624",
          "CHEMBL607567",
          "CHEMBL607862",
          "CHEMBL608140",
          "CHEMBL608437",
          "CHEMBL610501",
          "CHEMBL610513",
          "CHEMBL610794",
          "CHEMBL611680",
          "CHEMBL62811",
          "CHEMBL681",
          "CHEMBL70611",
          "CHEMBL78322",
          "CHEMBL9298",
          "CHEMBL934"
        ],
        "number_of_missing_values": "0"
      },
      {
        "data_type": "numeric",
        "index": "1",
        "is_ignore": "false",
        "is_row_identifier": "false",
        "is_target": "false",
        "name": "AMW",
        "number_of_missing_values": "0"
      },
      {
        "data_type": "numeric",
        "index": "2",
        "is_ignore": "false",
        "is_row_identifier": "false",
        "is_target": "false",
        "name": "C.",
        "number_of_missing_values": "0"
      },
      {
        "data_type": "numeric",
        "index": "3",
        "is_ignore": "false",
        "is_row_identifier": "false",
        "is_target": "false",
        "name": "H.",
        "number_of_missing_values": "0"
      },
      {
        "data_type": "numeric",
        "index": "4",
        "is_ignore": "false",
        "is_row_identifier": "false",
        "is_target": "false",
        "name": "Me",
        "number_of_missing_values": "0"
      },
      {
        "data_type": "numeric",
        "index": "5",
        "is_ignore": "false",
        "is_row_identifier": "false",
        "is_target": "false",
        "name": "Mi",
        "number_of_missing_values": "0"
      },
      {
        "data_type": "numeric",
        "index": "6",
        "is_ignore": "false",
        "is_row_identifier": "false",
        "is_target": "false",
        "name": "Mp",
        "number_of_missing_values": "0"
      },
      {
        "data_type": "numeric",
        "index": "7",
        "is_ignore": "false",
        "is_row_identifier": "false",
        "is_target": "false",
        "name": "Mv",
        "number_of_missing_values": "0"
      },
      {
        "data_type": "numeric",
        "index": "8",
        "is_ignore": "false",
        "is_row_identifier": "false",
        "is_target": "false",
        "name": "MW",
        "number_of_missing_values": "0"
      },
      {
        "data_type": "numeric",
        "index": "9",
        "is_ignore": "false",
        "is_row_identifier": "false",
        "is_target": "false",
        "name": "N.",
        "number_of_missing_values": "0"
      },
      {
        "data_type": "numeric",
        "index": "10",
        "is_ignore": "false",
        "is_row_identifier": "false",
        "is_target": "false",
        "name": "nAB",
        "number_of_missing_values": "0"
      },
      {
        "data_type": "numeric",
        "index": "11",
        "is_ignore": "false",
        "is_row_identifier": "false",
        "is_target": "false",
        "name": "nAT",
        "number_of_missing_values": "0"
      },
      {
        "data_type": "numeric",
        "index": "12",
        "is_ignore": "false",
        "is_row_identifier": "false",
        "is_target": "false",
        "name": "nB",
        "number_of_missing_values": "0"
      },
      {
        "data_type": "numeric",
        "index": "13",
        "is_ignore": "false",
        "is_row_identifier": "false",
        "is_target": "false",
        "name": "nBM",
        "number_of_missing_values": "0"
      },
      {
        "data_type": "numeric",
        "index": "14",
        "is_ignore": "false",
        "is_row_identifier": "false",
        "is_target": "false",
        "name": "nBO",
        "number_of_missing_values": "0"
      },
      {
        "data_type": "numeric",
        "index": "15",
        "is_ignore": "false",
        "is_row_identifier": "false",
        "is_target": "false",
        "name": "nBR",
        "number_of_missing_values": "0"
      },
      {
        "data_type": "numeric",
        "index": "16",
        "is_ignore": "false",
        "is_row_identifier": "false",
        "is_target": "false",
        "name": "nBT",
        "number_of_missing_values": "0"
      },
      {
        "data_type": "numeric",
        "index": "17",
        "is_ignore": "false",
        "is_row_identifier": "false",
        "is_target": "false",
        "name": "nC",
        "number_of_missing_values": "0"
      },
      {
        "data_type": "numeric",
        "index": "18",
        "is_ignore": "false",
        "is_row_identifier": "false",
        "is_target": "false",
        "name": "nCL",
        "number_of_missing_values": "0"
      },
      {
        "data_type": "numeric",
        "index": "19",
        "is_ignore": "false",
        "is_row_identifier": "false",
        "is_target": "false",
        "name": "nCsp",
        "number_of_missing_values": "0"
      },
      {
        "data_type": "numeric",
        "index": "20",
        "is_ignore": "false",
        "is_row_identifier": "false",
        "is_target": "false",
        "name": "nCsp2",
        "number_of_missing_values": "0"
      },
      {
        "data_type": "numeric",
        "index": "21",
        "is_ignore": "false",
        "is_row_identifier": "false",
        "is_target": "false",
        "name": "nCsp3",
        "number_of_missing_values": "0"
      },
      {
        "data_type": "numeric",
        "index": "22",
        "is_ignore": "false",
        "is_row_identifier": "false",
        "is_target": "false",
        "name": "nDB",
        "number_of_missing_values": "0"
      },
      {
        "data_type": "numeric",
        "index": "23",
        "is_ignore": "false",
        "is_row_identifier": "false",
        "is_target": "false",
        "name": "nF",
        "number_of_missing_values": "0"
      },
      {
        "data_type": "numeric",
        "index": "24",
        "is_ignore": "false",
        "is_row_identifier": "false",
        "is_target": "false",
        "name": "nH",
        "number_of_missing_values": "0"
      },
      {
        "data_type": "numeric",
        "index": "25",
        "is_ignore": "false",
        "is_row_identifier": "false",
        "is_target": "false",
        "name": "nHet",
        "number_of_missing_values": "0"
      },
      {
        "data_type": "numeric",
        "index": "26",
        "is_ignore": "false",
        "is_row_identifier": "false",
        "is_target": "false",
        "name": "nHM",
        "number_of_missing_values": "0"
      },
      {
        "data_type": "numeric",
        "index": "27",
        "is_ignore": "false",
        "is_row_identifier": "false",
        "is_target": "false",
        "name": "nI",
        "number_of_missing_values": "0"
      },
      {
        "data_type": "numeric",
        "index": "28",
        "is_ignore": "false",
        "is_row_identifier": "false",
        "is_target": "false",
        "name": "nN",
        "number_of_missing_values": "0"
      },
      {
        "data_type": "numeric",
        "index": "29",
        "is_ignore": "false",
        "is_row_identifier": "false",
        "is_target": "false",
        "name": "nO",
        "number_of_missing_values": "0"
      },
      {
        "data_type": "numeric",
        "index": "30",
        "is_ignore": "false",
        "is_row_identifier": "false",
        "is_target": "false",
        "name": "nP",
        "number_of_missing_values": "0"
      },
      {
        "data_type": "numeric",
        "index": "31",
        "is_ignore": "false",
        "is_row_identifier": "false",
        "is_target": "false",
        "name": "nS",
        "number_of_missing_values": "0"
      },
      {
        "data_type": "numeric",
        "index": "32",
        "is_ignore": "false",
        "is_row_identifier": "false",
        "is_target": "false",
        "name": "nSK",
        "number_of_missing_values": "0"
      },
      {
        "data_type": "numeric",
        "index": "33",
        "is_ignore": "false",
        "is_row_identifier": "false",
        "is_target": "false",
        "name": "nTB",
        "number_of_missing_values": "0"
      },
      {
        "data_type": "numeric",
        "index": "34",
        "is_ignore": "false",
        "is_row_identifier": "false",
        "is_target": "false",
        "name": "nX",
        "number_of_missing_values": "0"
      },
      {
        "data_type": "numeric",
        "index": "35",
        "is_ignore": "false",
        "is_row_identifier": "false",
        "is_target": "false",
        "name": "O.",
        "number_of_missing_values": "0"
      },
      {
        "data_type": "numeric",
        "index": "36",
        "is_ignore": "false",
        "is_row_identifier": "false",
        "is_target": "false",
        "name": "RBF",
        "number_of_missing_values": "0"
      },
      {
        "data_type": "numeric",
        "index": "37",
        "is_ignore": "false",
        "is_row_identifier": "false",
        "is_target": "false",
        "name": "RBN",
        "number_of_missing_values": "0"
      },
      {
        "data_type": "numeric",
        "index": "38",
        "is_ignore": "false",
        "is_row_identifier": "false",
        "is_target": "false",
        "name": "SCBO",
        "number_of_missing_values": "0"
      },
      {
        "data_type": "numeric",
        "index": "39",
        "is_ignore": "false",
        "is_row_identifier": "false",
        "is_target": "false",
        "name": "Se",
        "number_of_missing_values": "0"
      },
      {
        "data_type": "numeric",
        "index": "40",
        "is_ignore": "false",
        "is_row_identifier": "false",
        "is_target": "false",
        "name": "Si",
        "number_of_missing_values": "0"
      },
      {
        "data_type": "numeric",
        "index": "41",
        "is_ignore": "false",
        "is_row_identifier": "false",
        "is_target": "false",
        "name": "Sp",
        "number_of_missing_values": "0"
      },
      {
        "data_type": "numeric",
        "index": "42",
        "is_ignore": "false",
        "is_row_identifier": "false",
        "is_target": "false",
        "name": "Sv",
        "number_of_missing_values": "0"
      },
      {
        "data_type": "numeric",
        "index": "43",
        "is_ignore": "false",
        "is_row_identifier": "false",
        "is_target": "false",
        "name": "X.",
        "number_of_missing_values": "0"
      },
      {
        "data_type": "numeric",
        "index": "44",
        "is_ignore": "false",
        "is_row_identifier": "false",
        "is_target": "true",
        "name": "pXC50",
        "number_of_missing_values": "0"
      }
    ]
  }
}