"molecule_id","AMW","C.","H.","Me","Mi","Mp","Mv","MW","N.","nAB","nAT","nB","nBM","nBO","nBR","nBT","nC","nCL","nCsp","nCsp2","nCsp3","nDB","nF","nH","nHet","nHM","nI","nN","nO","nP","nS","nSK","nTB","nX","O.","RBF","RBN","SCBO","Se","Si","Sp","Sv","X.","pXC50"
{1 7.651,2 43.4,3 43.4,4 1.009,5 1.122,6 0.669,7 0.645,8 405.49,9 5.7,10 16,11 53,13 18,14 34,16 57,17 23,20 15,21 8,22 2,24 23,25 7,28 3,29 4,32 30,35 7.5,36 0.035,37 2,38 44,39 53.451,40 59.485,41 35.449,42 34.191,44 6.178}
{0 CHEMBL1088893,1 7.721,2 44.1,3 42.4,4 1.006,5 1.123,6 0.678,7 0.653,8 455.56,9 8.5,10 21,11 59,13 23,14 39,16 64,17 26,20 18,21 8,22 2,24 25,25 8,28 5,29 3,32 34,35 5.1,36 0.031,37 2,38 51.5,39 59.327,40 66.272,41 40.006,42 38.519,44 7.509}
{0 CHEMBL1088894,1 7.721,2 44.1,3 42.4,4 1.006,5 1.123,6 0.678,7 0.653,8 455.56,9 8.5,10 21,11 59,13 23,14 39,16 64,17 26,20 18,21 8,22 2,24 25,25 8,28 5,29 3,32 34,35 5.1,36 0.031,37 2,38 51.5,39 59.327,40 66.272,41 40.006,42 38.519,44 7.745}
{0 CHEMBL1088921,1 7.942,2 45.8,3 40.7,4 1.009,5 1.118,6 0.686,7 0.665,8 468.55,9 6.8,10 22,11 59,13 24,14 40,16 64,17 27,20 20,21 7,22 2,24 24,25 8,28 4,29 4,32 35,35 6.8,36 0.047,37 3,38 53,39 59.552,40 65.983,41 40.455,42 39.213,44 7.585}
{0 CHEMBL1089096,1 7.256,2 49.2,3 44.6,4 0.986,5 1.109,6 0.698,7 0.656,8 471.64,9 4.6,10 28,11 65,13 29,14 41,16 70,17 32,20 25,21 7,22 1,24 29,25 4,28 3,29 1,32 36,35 1.5,36 0.057,37 4,38 56,39 64.12,40 72.102,41 45.37,42 42.627,44 6.075}
{0 CHEMBL1089138,1 7.49,2 44.2,3 44.2,4 1.002,5 1.121,6 0.673,7 0.644,8 389.49,9 5.8,10 16,11 52,13 18,14 33,16 56,17 23,20 15,21 8,22 2,24 23,25 6,28 3,29 3,32 29,35 5.8,36 0.018,37 1,38 43,39 52.123,40 58.275,41 34.995,42 33.477,44 5.879}
{0 CHEMBL1089139,1 7.829,2 44,3 42,4 1.011,5 1.121,6 0.674,7 0.653,8 391.46,9 6,10 16,11 50,13 18,14 33,16 54,17 22,20 15,21 7,22 2,24 21,25 7,28 3,29 4,32 29,35 8,36 0.037,37 2,38 43,39 50.567,40 56.069,41 33.688,42 32.665,44 5.79}
{0 CHEMBL1089180,1 7.829,2 42,3 42,4 1.011,5 1.129,6 0.67,7 0.649,8 391.47,9 10,10 16,11 50,13 18,14 33,16 54,17 21,20 14,21 7,22 2,24 21,25 8,28 5,29 3,32 29,35 6,36 0.019,37 1,38 43,39 50.56,40 56.441,41 33.483,42 32.466,44 5.87}
{0 CHEMBL1089181,1 7.492,2 41.4,3 44.8,4 1.008,5 1.128,6 0.659,7 0.633,8 434.54,9 6.9,10 16,11 58,13 18,14 36,16 62,17 24,20 14,21 10,22 2,24 26,25 8,28 4,29 4,32 32,35 6.9,36 0.048,37 3,38 46,39 58.436,40 65.398,41 38.216,42 36.74,44 7.523}
{0 CHEMBL1089206,1 8.009,2 42.9,3 40.8,4 1.016,5 1.126,6 0.672,7 0.656,8 392.45,9 8.2,10 16,11 49,13 18,14 33,16 53,17 21,20 14,21 7,22 2,24 20,25 8,28 4,29 4,32 29,35 8.2,36 0.038,37 2,38 43,39 49.785,40 55.152,41 32.932,42 32.159,44 5.527}
{0 CHEMBL1089430,1 7.255,2 45.3,3 45.3,4 0.992,5 1.12,6 0.681,7 0.643,8 384.52,9 7.5,10 21,11 53,13 22,14 33,16 57,17 24,20 17,21 7,22 1,24 24,25 5,28 4,29 1,32 29,35 1.9,36 0.053,37 3,38 44.5,39 52.571,40 59.355,41 36.091,42 34.068,44 5.471}
{0 CHEMBL1089431,1 7.203,2 45.6,3 45.6,4 0.99,5 1.119,6 0.682,7 0.642,8 410.56,9 7,10 22,11 57,13 23,14 35,16 61,17 26,20 19,21 7,22 1,24 26,25 5,28 4,29 1,32 31,35 1.8,36 0.066,37 4,38 47,39 56.454,40 63.77,41 38.853,42 36.595,44 5.896}
{0 CHEMBL1089432,1 7.203,2 45.6,3 45.6,4 0.99,5 1.119,6 0.682,7 0.642,8 410.56,9 7,10 22,11 57,13 23,14 35,16 61,17 26,20 19,21 7,22 1,24 26,25 5,28 4,29 1,32 31,35 1.8,36 0.066,37 4,38 47,39 56.454,40 63.77,41 38.853,42 36.595,44 5.521}
{0 CHEMBL1089472,1 8.518,2 44,3 40,4 1.018,5 1.12,6 0.691,7 0.67,8 425.9,9 6,10 16,11 50,13 18,14 34,16 54,17 22,18 1,20 15,21 7,22 2,24 20,25 8,26 1,28 3,29 4,32 30,34 1,35 8,36 0.037,37 2,38 44,39 50.891,40 56.013,41 34.546,42 33.492,43 2,44 5.738}
{0 CHEMBL1089473,1 7.829,2 44,3 42,4 1.011,5 1.121,6 0.674,7 0.653,8 391.46,9 6,10 16,11 50,13 18,14 33,16 54,17 22,20 15,21 7,22 2,24 21,25 7,28 3,29 4,32 29,35 8,36 0.037,37 2,38 43,39 50.567,40 56.069,41 33.688,42 32.665,44 5.597}
{0 CHEMBL1089529,1 7.716,2 43.1,3 43.1,4 1.011,5 1.123,6 0.667,7 0.645,8 447.53,9 5.2,10 16,11 58,13 19,14 37,16 62,17 25,20 17,21 8,22 3,24 25,25 8,28 3,29 5,32 33,35 8.6,36 0.048,37 3,38 48,39 58.662,40 65.109,41 38.665,42 37.433,44 7.367}
{0 CHEMBL1089547,1 7.871,2 44.8,3 41.4,4 1.01,5 1.12,6 0.68,7 0.659,8 456.54,9 6.9,10 21,11 58,13 23,14 39,16 63,17 26,20 18,21 8,22 2,24 24,25 8,28 4,29 4,32 34,35 6.9,36 0.032,37 2,38 51.5,39 58.552,40 64.983,41 39.455,42 38.213,44 7.77}
{0 CHEMBL1089872,1 7.817,2 42.3,3 42.3,4 1.013,5 1.126,6 0.667,7 0.648,8 406.48,9 7.7,10 16,11 52,13 18,14 34,16 56,17 22,20 14,21 8,22 2,24 22,25 8,28 4,29 4,32 30,35 7.7,36 0.036,37 2,38 44,39 52.669,40 58.568,41 34.693,42 33.686,44 7.066}
{0 CHEMBL1089877,1 7.714,2 44.3,3 42.6,4 1.007,5 1.121,6 0.676,7 0.651,8 470.57,9 6.6,10 21,11 61,13 23,14 40,16 66,17 27,20 18,21 9,22 2,24 26,25 8,28 4,29 4,32 35,35 6.6,36 0.03,37 2,38 52.5,39 61.436,40 68.398,41 41.216,42 39.74,44 7.886}
{0 CHEMBL1089882,1 8.04,2 43.1,3 40,4 1.012,5 1.128,6 0.681,7 0.662,8 522.62,9 12.3,10 26,11 65,13 28,14 45,16 71,17 28,20 20,21 8,22 2,24 26,25 11,28 8,29 3,32 39,35 4.6,36 0.042,37 3,38 60,39 65.749,40 73.351,41 44.262,42 43.057,44 6.011}
{0 CHEMBL1089883,1 7.872,2 43.1,3 41.4,4 1.009,5 1.127,6 0.677,7 0.655,8 456.55,9 10.3,10 21,11 58,13 23,14 39,16 63,17 25,20 17,21 8,22 2,24 24,25 9,28 6,29 3,32 34,35 5.2,36 0.032,37 2,38 51.5,39 58.545,40 65.355,41 39.25,42 38.014,44 7.609}
{0 CHEMBL1090120,1 7.49,2 44.2,3 44.2,4 1.002,5 1.121,6 0.673,7 0.644,8 389.49,9 5.8,10 16,11 52,13 18,14 33,16 56,17 23,20 15,21 8,22 2,24 23,25 6,28 3,29 3,32 29,35 5.8,36 0.018,37 1,38 43,39 52.123,40 58.275,41 34.995,42 33.477,44 6.788}
{0 CHEMBL1090121,1 7.662,2 44.9,3 42.9,4 1.005,5 1.12,6 0.678,7 0.652,8 375.46,9 6.1,10 16,11 49,13 18,14 32,16 53,17 22,20 15,21 7,22 2,24 21,25 6,28 3,29 3,32 28,35 6.1,36 0.019,37 1,38 42,39 49.24,40 54.86,41 33.233,42 31.95,44 6.198}
{0 CHEMBL1090122,1 7.662,2 44.9,3 42.9,4 1.005,5 1.12,6 0.678,7 0.652,8 375.46,9 6.1,10 16,11 49,13 18,14 32,16 53,17 22,20 15,21 7,22 2,24 21,25 6,28 3,29 3,32 28,35 6.1,36 0.019,37 1,38 42,39 49.24,40 54.86,41 33.233,42 31.95,44 6.071}
{0 CHEMBL1090179,1 7.646,2 41.8,3 43.6,4 1.01,5 1.127,6 0.663,7 0.64,8 420.51,9 7.3,10 16,11 55,13 18,14 35,16 59,17 23,20 14,21 9,22 2,24 24,25 8,28 4,29 4,32 31,35 7.3,36 0.034,37 2,38 45,39 55.552,40 61.983,41 36.455,42 35.213,44 7.469}
{0 CHEMBL1090180,1 7.354,2 41,3 45.9,4 1.005,5 1.128,6 0.655,7 0.627,8 448.57,9 6.6,10 16,11 61,13 18,14 37,16 65,17 25,20 14,21 11,22 2,24 28,25 8,28 4,29 4,32 33,35 6.6,36 0.062,37 4,38 47,39 61.32,40 68.813,41 39.978,42 38.266,44 7.638}
{0 CHEMBL1090193,1 7.871,2 44.8,3 41.4,4 1.01,5 1.12,6 0.68,7 0.659,8 456.54,9 6.9,10 21,11 58,13 23,14 39,16 63,17 26,20 18,21 8,22 2,24 24,25 8,28 4,29 4,32 34,35 6.9,36 0.032,37 2,38 51.5,39 58.552,40 64.983,41 39.455,42 38.213,44 7.721}
{0 CHEMBL1090199,1 7.646,2 41.8,3 43.6,4 1.01,5 1.127,6 0.663,7 0.64,8 420.51,9 7.3,10 16,11 55,13 18,14 35,16 59,17 23,20 14,21 9,22 2,24 24,25 8,28 4,29 4,32 31,35 7.3,36 0.051,37 3,38 45,39 55.552,40 61.983,41 36.455,42 35.213,44 7.215}
{0 CHEMBL1090200,1 7.354,2 41,3 45.9,4 1.005,5 1.128,6 0.655,7 0.627,8 448.57,9 6.6,10 16,11 61,13 18,14 37,16 65,17 25,20 14,21 11,22 2,24 28,25 8,28 4,29 4,32 33,35 6.6,36 0.046,37 3,38 47,39 61.32,40 68.813,41 39.978,42 38.266,44 7.921}
{0 CHEMBL1090474,1 7.829,2 44,3 42,4 1.011,5 1.121,6 0.674,7 0.653,8 391.46,9 6,10 16,11 50,13 18,14 33,16 54,17 22,20 15,21 7,22 2,24 21,25 7,28 3,29 4,32 29,35 8,36 0.037,37 2,38 43,39 50.567,40 56.069,41 33.688,42 32.665,44 6.25}
{0 CHEMBL1090854,1 7.884,2 44.6,3 41.1,4 1.008,5 1.122,6 0.683,7 0.661,8 441.53,9 8.9,10 21,11 56,13 23,14 38,16 61,17 25,20 18,21 7,22 2,24 23,25 8,28 5,29 3,32 33,35 5.4,36 0.033,37 2,38 50.5,39 56.443,40 62.857,41 38.245,42 36.993,44 7.745}
{0 CHEMBL1090862,1 7.716,2 43.1,3 43.1,4 1.011,5 1.123,6 0.667,7 0.645,8 447.53,9 5.2,10 16,11 58,13 19,14 37,16 62,17 25,20 17,21 8,22 3,24 25,25 8,28 3,29 5,32 33,35 8.6,36 0.048,37 3,38 48,39 58.662,40 65.109,41 38.665,42 37.433,44 7.187}
{0 CHEMBL1090863,1 7.793,2 46.7,3 41.7,4 1.006,5 1.115,6 0.687,7 0.662,8 467.56,9 5,10 22,11 60,13 24,14 40,16 65,17 28,20 21,21 7,22 2,24 25,25 7,28 3,29 4,32 35,35 6.7,36 0.046,37 3,38 53,39 60.334,40 66.9,41 41.21,42 39.718,44 7.796}
{0 CHEMBL1091186,1 8.046,2 42.6,3 40.7,4 1.018,5 1.126,6 0.669,7 0.656,8 434.49,9 7.4,10 16,11 54,13 19,14 36,16 58,17 23,20 16,21 7,22 3,24 22,25 9,28 4,29 5,32 32,35 9.3,36 0.052,37 3,38 47,39 54.996,40 60.777,41 36.148,42 35.401,44 7.456}
{0 CHEMBL1091187,1 7.829,2 44,3 42,4 1.011,5 1.121,6 0.674,7 0.653,8 391.46,9 6,10 16,11 50,13 18,14 33,16 54,17 22,20 15,21 7,22 2,24 21,25 7,28 3,29 4,32 29,35 8,36 0.037,37 2,38 43,39 50.567,40 56.069,41 33.688,42 32.665,44 6.666}
{0 CHEMBL1091217,1 7.813,2 48.2,3 41.1,4 1.002,5 1.112,6 0.696,7 0.669,8 437.53,9 5.4,10 22,11 56,13 24,14 38,16 61,17 27,20 21,21 6,22 2,24 23,25 6,28 3,29 3,32 33,35 5.4,36 0.033,37 2,38 51,39 56.123,40 62.275,41 38.995,42 37.477,44 5.656}
{0 CHEMBL1091570,1 7.192,2 47.3,3 45.5,4 0.988,5 1.114,6 0.688,7 0.647,8 395.54,9 5.5,10 22,11 55,13 23,14 34,16 59,17 26,20 19,21 7,22 1,24 25,25 4,28 3,29 1,32 30,35 1.8,36 0.051,37 3,38 46,39 54.352,40 61.272,41 37.847,42 35.574,44 5.05}
{0 CHEMBL1091588,1 7.337,2 43.6,3 45.5,4 1,5 1.122,6 0.668,7 0.636,8 403.52,9 5.5,10 16,11 55,13 18,14 34,16 59,17 24,20 15,21 9,22 2,24 25,25 6,28 3,29 3,32 30,35 5.5,36 0.017,37 1,38 44,39 55.007,40 61.69,41 36.756,42 35.003,44 7.658}
{0 CHEMBL1091589,1 7.651,2 43.4,3 43.4,4 1.009,5 1.122,6 0.669,7 0.645,8 405.49,9 5.7,10 16,11 53,13 18,14 34,16 57,17 23,20 15,21 8,22 2,24 23,25 7,28 3,29 4,32 30,35 7.5,36 0.035,37 2,38 44,39 53.451,40 59.485,41 35.449,42 34.191,44 6.983}
{0 CHEMBL1091590,1 7.337,2 43.6,3 45.5,4 1,5 1.122,6 0.668,7 0.636,8 403.52,9 5.5,10 16,11 55,13 18,14 34,16 59,17 24,20 15,21 9,22 2,24 25,25 6,28 3,29 3,32 30,35 5.5,36 0.017,37 1,38 44,39 55.007,40 61.69,41 36.756,42 35.003,44 7.444}
{0 CHEMBL1091996,1 7.817,2 42.3,3 42.3,4 1.013,5 1.126,6 0.667,7 0.648,8 406.48,9 7.7,10 16,11 52,13 18,14 34,16 56,17 22,20 14,21 8,22 2,24 22,25 8,28 4,29 4,32 30,35 7.7,36 0.036,37 2,38 44,39 52.669,40 58.568,41 34.693,42 33.686,44 6.74}
{0 CHEMBL1092006,1 7.656,2 43.1,3 43.1,4 1.007,5 1.125,6 0.671,7 0.646,8 390.48,9 7.8,10 16,11 51,13 18,14 33,16 55,17 22,20 14,21 8,22 2,24 22,25 7,28 4,29 3,32 29,35 5.9,36 0.018,37 1,38 43,39 51.342,40 57.358,41 34.239,42 32.971,44 6.437}
{0 CHEMBL1092007,1 7.843,2 43.8,3 41.7,4 1.01,5 1.124,6 0.677,7 0.655,8 376.45,9 8.3,10 16,11 48,13 18,14 32,16 52,17 21,20 14,21 7,22 2,24 20,25 7,28 4,29 3,32 28,35 6.3,36 0.019,37 1,38 42,39 48.458,40 53.943,41 32.478,42 31.444,44 6.116}
{0 CHEMBL1092296,1 7.651,2 43.4,3 43.4,4 1.009,5 1.122,6 0.669,7 0.645,8 405.49,9 5.7,10 16,11 53,13 18,14 34,16 57,17 23,20 15,21 8,22 2,24 23,25 7,28 3,29 4,32 30,35 7.5,36 0.035,37 2,38 44,39 53.451,40 59.485,41 35.449,42 34.191,44 6.658}
{0 CHEMBL1092307,1 7.199,2 43.1,3 46.6,4 0.998,5 1.123,6 0.664,7 0.63,8 417.55,9 5.2,10 16,11 58,13 18,14 35,16 62,17 25,20 15,21 10,22 2,24 27,25 6,28 3,29 3,32 31,35 5.2,36 0.032,37 2,38 45,39 57.891,40 65.106,41 38.517,42 36.53,44 7.757}
{0 CHEMBL1092308,1 7.491,2 42.9,3 44.6,4 1.006,5 1.123,6 0.664,7 0.638,8 419.52,9 5.4,10 16,11 56,13 18,14 35,16 60,17 24,20 15,21 9,22 2,24 25,25 7,28 3,29 4,32 31,35 7.1,36 0.033,37 2,38 45,39 56.334,40 62.9,41 37.21,42 35.718,44 7.377}
{0 CHEMBL1092380,1 7.491,2 42.9,3 44.6,4 1.006,5 1.123,6 0.664,7 0.638,8 419.52,9 5.4,10 16,11 56,13 18,14 35,16 60,17 24,20 15,21 9,22 2,24 25,25 7,28 3,29 4,32 31,35 7.1,36 0.05,37 3,38 45,39 56.334,40 62.9,41 37.21,42 35.718,44 6.991}
{0 CHEMBL1092580,1 7.721,2 44.1,3 42.4,4 1.006,5 1.123,6 0.678,7 0.653,8 455.56,9 8.5,10 21,11 59,13 23,14 39,16 64,17 26,20 18,21 8,22 2,24 25,25 8,28 5,29 3,32 34,35 5.1,36 0.031,37 2,38 51.5,39 59.327,40 66.272,41 40.006,42 38.519,44 8.125}
{0 CHEMBL1092584,1 7.171,2 50,3 45.2,4 0.984,5 1.107,6 0.699,7 0.655,8 444.61,9 3.2,10 27,11 62,13 28,14 39,16 67,17 31,20 24,21 7,22 1,24 28,25 3,28 2,29 1,32 34,35 1.6,36 0.045,37 3,38 53.5,39 61.018,40 68.604,41 43.364,42 40.606,44 6.488}
{0 CHEMBL1092605,1 7.942,2 45.8,3 40.7,4 1.009,5 1.118,6 0.686,7 0.665,8 468.55,9 6.8,10 22,11 59,13 24,14 40,16 64,17 27,20 20,21 7,22 2,24 24,25 8,28 4,29 4,32 35,35 6.8,36 0.047,37 3,38 53,39 59.552,40 65.983,41 40.455,42 39.213,44 7.585}
{0 CHEMBL1092606,1 7.942,2 45.8,3 40.7,4 1.009,5 1.118,6 0.686,7 0.665,8 468.55,9 6.8,10 22,11 59,13 24,14 40,16 64,17 27,20 20,21 7,22 2,24 24,25 8,28 4,29 4,32 35,35 6.8,36 0.047,37 3,38 53,39 59.552,40 65.983,41 40.455,42 39.213,44 7.222}
{0 CHEMBL1092888,1 8.096,2 44.8,3 39.7,4 1.013,5 1.122,6 0.684,7 0.667,8 469.54,9 8.6,10 22,11 58,13 24,14 40,16 63,17 26,20 19,21 7,22 2,24 23,25 9,28 5,29 4,32 35,35 6.9,36 0.048,37 3,38 53,39 58.771,40 65.066,41 39.699,42 38.707,44 6.996}
{0 CHEMBL1093165,1 7.843,2 43.8,3 41.7,4 1.01,5 1.124,6 0.677,7 0.655,8 376.45,9 8.3,10 16,11 48,13 18,14 32,16 52,17 21,20 14,21 7,22 2,24 20,25 7,28 4,29 3,32 28,35 6.3,36 0.019,37 1,38 42,39 48.458,40 53.943,41 32.478,42 31.444,44 6.812}
{0 CHEMBL1093166,1 7.656,2 43.1,3 43.1,4 1.007,5 1.125,6 0.671,7 0.646,8 390.48,9 7.8,10 16,11 51,13 18,14 33,16 55,17 22,20 14,21 8,22 2,24 22,25 7,28 4,29 3,32 29,35 5.9,36 0.018,37 1,38 43,39 51.342,40 57.358,41 34.239,42 32.971,44 6.604}
{0 CHEMBL1093185,1 7.859,2 43.3,3 41.7,4 1.011,5 1.125,6 0.674,7 0.654,8 471.56,9 8.3,10 21,11 60,13 23,14 40,16 65,17 26,20 18,21 8,22 2,24 25,25 9,28 5,29 4,32 35,35 6.7,36 0.046,37 3,38 52.5,39 60.654,40 67.481,41 40.46,42 39.234,44 7.721}
{0 CHEMBL1093186,1 8.067,2 44.2,3 40.4,4 1.017,5 1.121,6 0.676,7 0.661,8 419.47,9 5.8,10 16,11 52,13 19,14 35,16 56,17 23,20 16,21 7,22 3,24 21,25 8,28 3,29 5,32 31,35 9.6,36 0.036,37 2,38 46,39 52.894,40 58.279,41 35.142,42 34.379,44 6.519}
{0 CHEMBL1093187,1 7.884,2 44.6,3 41.1,4 1.008,5 1.122,6 0.683,7 0.661,8 441.53,9 8.9,10 21,11 56,13 23,14 38,16 61,17 25,20 18,21 7,22 2,24 23,25 8,28 5,29 3,32 33,35 5.4,36 0.033,37 2,38 50.5,39 56.443,40 62.857,41 38.245,42 36.993,44 8.131}
{0 CHEMBL1093803,1 8.606,2 45.7,3 39.1,4 1.015,5 1.117,6 0.703,7 0.679,8 395.87,9 6.5,10 16,11 46,13 18,14 32,16 50,17 21,18 1,20 15,21 6,22 2,24 18,25 7,26 1,28 3,29 3,32 28,34 1,35 6.5,36 0.02,37 1,38 42,39 46.68,40 51.389,41 32.33,42 31.251,43 2.2,44 5.857}
{0 CHEMBL1093809,1 7.651,2 43.4,3 43.4,4 1.009,5 1.122,6 0.669,7 0.645,8 405.49,9 5.7,10 16,11 53,13 18,14 34,16 57,17 23,20 15,21 8,22 2,24 23,25 7,28 3,29 4,32 30,35 7.5,36 0.035,37 2,38 44,39 53.451,40 59.485,41 35.449,42 34.191,44 6.764}
{0 CHEMBL109653,1 7.274,2 36.2,3 51.1,4 1.007,5 1.133,6 0.634,7 0.596,8 341.87,9 2.1,11 47,13 4,14 24,16 48,17 17,18 1,20 6,21 11,22 4,24 24,25 6,26 1,28 1,29 4,32 23,34 1,35 8.5,36 0.125,37 6,38 28,39 47.338,40 53.262,41 29.818,42 28.03,43 2.1,44 4.398}
{0 CHEMBL111058,1 7.346,2 34.7,3 53.1,4 0.999,5 1.13,6 0.648,7 0.592,8 359.96,9 2,11 49,13 4,14 23,16 49,17 17,18 1,20 6,21 11,22 4,24 26,25 6,26 2,28 1,29 3,31 1,32 23,34 1,35 6.1,36 0.184,37 9,38 27,39 48.971,40 55.388,41 31.773,42 29.029,43 2,44 4.398}
{0 CHEMBL111617,1 6.738,2 35.4,3 52.1,4 1.007,5 1.136,6 0.613,7 0.582,8 323.43,9 2.1,11 48,13 5,14 23,16 48,17 17,20 7,21 10,22 5,24 25,25 6,28 1,29 5,32 23,35 10.4,36 0.167,37 8,38 28,39 48.342,40 54.528,41 29.415,42 27.917,44 4}
{0 CHEMBL113137,1 6.643,2 34.7,3 55.1,4 0.993,5 1.132,6 0.631,7 0.576,8 325.52,9 2,11 49,13 3,14 23,16 50,17 17,20 4,21 13,22 3,24 27,25 5,26 1,28 1,29 3,31 1,32 22,35 6.1,36 0.12,37 6,38 26,39 48.647,40 55.444,41 30.915,42 28.201,44 4.398}
{0 CHEMBL1629723,1 6.894,2 38.5,3 50,4 1.002,5 1.131,6 0.634,7 0.6,8 358.48,9 3.8,10 12,11 52,13 13,14 27,16 53,17 20,20 12,21 8,22 1,24 26,25 6,28 2,29 4,32 26,35 7.7,36 0.17,37 9,38 34,39 52.116,40 58.817,41 32.966,42 31.224,44 5.538}
{0 CHEMBL1630515,1 6.184,2 36.5,3 55.6,4 0.991,5 1.133,6 0.615,7 0.569,8 389.59,9 1.6,10 6,11 63,13 7,14 30,16 65,17 23,20 7,21 16,22 1,24 35,25 5,28 1,29 4,32 28,35 6.3,36 0.154,37 10,38 34,39 62.432,40 71.394,41 38.767,42 35.836,44 4.602}
{0 CHEMBL1630516,1 7.829,2 40.9,3 45.5,4 1.005,5 1.12,6 0.679,7 0.639,8 344.47,9 4.5,10 11,11 44,13 13,14 25,16 45,17 18,19 2,20 10,21 6,22 1,24 20,25 6,26 1,28 2,29 3,31 1,32 24,33 1,35 6.8,36 0.111,37 5,38 33.5,39 44.214,40 49.282,41 29.875,42 28.116,44 5}
{0 CHEMBL1630517,1 6.626,2 40,3 51.7,4 0.994,5 1.126,6 0.637,7 0.596,8 397.56,9 1.7,10 11,11 60,13 12,14 32,16 63,17 24,20 11,21 13,22 1,24 31,25 5,28 1,29 4,32 29,35 6.7,36 0.111,37 7,38 38.5,39 59.665,40 67.564,41 38.245,42 35.783,44 4.523}
{0 CHEMBL1630518,1 6.343,2 36.8,3 54.4,4 0.994,5 1.133,6 0.618,7 0.575,8 361.53,9 1.8,10 6,11 57,13 7,14 28,16 59,17 21,20 7,21 14,22 1,24 31,25 5,28 1,29 4,32 26,35 7,36 0.169,37 10,38 32,39 56.665,40 64.564,41 35.245,42 32.783,44 4.523}
{0 CHEMBL1630519,1 6.626,2 40,3 51.7,4 0.994,5 1.126,6 0.637,7 0.596,8 397.56,9 1.7,10 12,11 60,13 13,14 31,16 62,17 24,20 13,21 11,22 1,24 31,25 5,28 1,29 4,32 29,35 6.7,36 0.161,37 10,38 38,39 59.665,40 67.564,41 38.245,42 35.783,44 4.523}
{0 CHEMBL1630520,1 6.343,2 36.8,3 54.4,4 0.994,5 1.133,6 0.618,7 0.575,8 361.53,9 1.8,10 6,11 57,13 7,14 28,16 59,17 21,20 7,21 14,22 1,24 31,25 5,28 1,29 4,32 26,35 7,36 0.153,37 9,38 32,39 56.665,40 64.564,41 35.245,42 32.783,44 4.523}
{0 CHEMBL1630700,1 6.7,2 40,3 50.9,4 0.994,5 1.128,6 0.641,7 0.601,8 368.52,9 3.6,10 12,11 55,13 13,14 29,16 57,17 22,20 12,21 10,22 1,24 28,25 5,28 2,29 3,32 27,35 5.5,36 0.158,37 9,38 36,39 54.672,40 62.022,41 35.273,42 33.036,44 5.495}
{0 CHEMBL1630701,1 6.7,2 40,3 50.9,4 0.994,5 1.128,6 0.641,7 0.601,8 368.52,9 3.6,10 12,11 55,13 13,14 29,16 57,17 22,20 12,21 10,22 1,24 28,25 5,28 2,29 3,32 27,35 5.5,36 0.158,37 9,38 36,39 54.672,40 62.022,41 35.273,42 33.036,44 6.097}
{0 CHEMBL1630702,1 6.869,2 38,3 50,4 1,5 1.134,6 0.635,7 0.6,8 343.47,9 6,10 12,11 50,13 13,14 26,16 51,17 19,20 12,21 7,22 1,24 25,25 6,28 3,29 3,32 25,35 6,36 0.157,37 8,38 33,39 50.007,40 56.69,41 31.756,42 30.003,44 5.538}
{0 CHEMBL1630703,1 6.373,2 34.5,3 54.5,4 0.998,5 1.139,6 0.609,7 0.569,8 350.51,9 3.6,10 6,11 55,13 7,14 26,16 56,17 19,20 6,21 13,22 1,24 30,25 6,28 2,29 4,32 25,35 7.3,36 0.143,37 8,38 30,39 54.883,40 62.647,41 33.489,42 31.277,44 4.979}
{0 CHEMBL1630704,1 7.009,2 40,3 49.1,4 1.004,5 1.126,6 0.64,7 0.608,8 385.5,9 1.8,10 12,11 55,13 13,14 30,16 57,17 22,20 13,21 9,22 1,24 27,25 6,28 1,29 5,32 28,35 9.1,36 0.158,37 9,38 37,39 55.225,40 61.943,41 35.176,42 33.444,44 4.523}
{0 CHEMBL1630705,1 6.609,2 36.4,3 52.7,4 1.002,5 1.134,6 0.617,7 0.581,8 363.5,9 1.8,10 6,11 55,13 7,14 28,16 57,17 20,20 7,21 13,22 1,24 29,25 6,28 1,29 5,32 26,35 9.1,36 0.14,37 8,38 32,39 55.109,40 62.358,41 33.938,42 31.971,44 4.886}
{0 CHEMBL1630706,1 7.157,2 38.9,3 48.1,4 1.008,5 1.13,6 0.637,7 0.61,8 386.49,9 3.7,10 12,11 54,13 13,14 30,16 56,17 21,20 12,21 9,22 1,24 26,25 7,28 2,29 5,32 28,35 9.3,36 0.161,37 9,38 37,39 54.443,40 61.026,41 34.421,42 32.938,44 4.854}
{0 CHEMBL1630707,1 6.817,2 40.4,3 50,4 0.996,5 1.127,6 0.644,7 0.606,8 354.49,9 3.8,10 12,11 52,13 13,14 28,16 54,17 21,20 12,21 9,22 1,24 26,25 5,28 2,29 3,32 26,35 5.8,36 0.148,37 8,38 35,39 51.789,40 58.607,41 33.512,42 31.509,44 4.523}
{0 CHEMBL1630708,1 6.7,2 40,3 50.9,4 0.994,5 1.128,6 0.641,7 0.601,8 368.52,9 3.6,10 12,11 55,13 13,14 29,16 57,17 22,20 12,21 10,22 1,24 28,25 5,28 2,29 3,32 27,35 5.5,36 0.14,37 8,38 36,39 54.672,40 62.022,41 35.273,42 33.036,44 5.538}
{0 CHEMBL1630709,1 7.1,2 43.6,3 47.3,4 0.996,5 1.12,6 0.664,7 0.627,8 390.52,9 3.6,10 18,11 55,13 19,14 31,16 57,17 24,20 18,21 6,22 1,24 26,25 5,28 2,29 3,32 29,35 5.5,36 0.158,37 9,38 41,39 54.789,40 61.607,41 36.512,42 34.509,44 5.678}
{0 CHEMBL1630710,1 7.1,2 43.6,3 47.3,4 0.996,5 1.12,6 0.664,7 0.627,8 390.52,9 3.6,10 18,11 55,13 19,14 31,16 57,17 24,20 18,21 6,22 1,24 26,25 5,28 2,29 3,32 29,35 5.5,36 0.158,37 9,38 41,39 54.789,40 61.607,41 36.512,42 34.509,44 5.921}
{0 CHEMBL1630712,1 7.1,2 43.6,3 47.3,4 0.996,5 1.12,6 0.664,7 0.627,8 390.52,9 3.6,10 18,11 55,13 19,14 31,16 57,17 24,20 18,21 6,22 1,24 26,25 5,28 2,29 3,32 29,35 5.5,36 0.158,37 9,38 41,39 54.789,40 61.607,41 36.512,42 34.509,44 6.155}
{0 CHEMBL1630713,1 6.715,2 39.2,3 51,4 0.996,5 1.13,6 0.637,7 0.598,8 342.48,9 3.9,10 12,11 51,13 13,14 26,16 52,17 20,20 12,21 8,22 1,24 26,25 5,28 2,29 3,32 25,35 5.9,36 0.154,37 8,38 33,39 50.789,40 57.607,41 32.512,42 30.509,44 5.585}
{0 CHEMBL1630714,1 6.715,2 39.2,3 51,4 0.996,5 1.13,6 0.637,7 0.598,8 342.48,9 3.9,10 12,11 51,13 13,14 26,16 52,17 20,20 12,21 8,22 1,24 26,25 5,28 2,29 3,32 25,35 5.9,36 0.154,37 8,38 33,39 50.789,40 57.607,41 32.512,42 30.509,44 5.585}
{0 CHEMBL1630715,1 6.715,2 39.2,3 51,4 0.996,5 1.13,6 0.637,7 0.598,8 342.48,9 3.9,10 12,11 51,13 13,14 26,16 52,17 20,20 12,21 8,22 1,24 26,25 5,28 2,29 3,32 25,35 5.9,36 0.154,37 8,38 33,39 50.789,40 57.607,41 32.512,42 30.509,44 6.77}
{0 CHEMBL1630716,1 6.715,2 39.2,3 51,4 0.996,5 1.13,6 0.637,7 0.598,8 342.48,9 3.9,10 12,11 51,13 13,14 26,16 52,17 20,20 12,21 8,22 1,24 26,25 5,28 2,29 3,32 25,35 5.9,36 0.154,37 8,38 33,39 50.789,40 57.607,41 32.512,42 30.509,44 4.523}
{0 CHEMBL1630717,1 6.869,2 38,3 50,4 1,5 1.134,6 0.635,7 0.6,8 343.47,9 6,10 12,11 50,13 13,14 26,16 51,17 19,20 11,21 8,22 1,24 25,25 6,28 3,29 3,32 25,35 6,36 0.157,37 8,38 33,39 50.007,40 56.69,41 31.756,42 30.003,44 5.131}
{0 CHEMBL1630718,1 6.869,2 38,3 50,4 1,5 1.134,6 0.635,7 0.6,8 343.47,9 6,10 12,11 50,13 13,14 26,16 51,17 19,20 11,21 8,22 1,24 25,25 6,28 3,29 3,32 25,35 6,36 0.157,37 8,38 33,39 50.007,40 56.69,41 31.756,42 30.003,44 4.523}
{0 CHEMBL1630719,1 6.644,2 36.5,3 51.9,4 0.998,5 1.137,6 0.625,7 0.587,8 345.49,9 5.8,10 6,11 52,13 9,14 26,16 53,17 19,20 9,21 10,22 3,24 27,25 6,28 3,29 3,32 25,35 5.8,36 0.151,37 8,38 32,39 51.891,40 59.106,41 32.517,42 30.53,44 4.523}
{0 CHEMBL1630720,1 6.843,2 39.6,3 50,4 0.998,5 1.129,6 0.641,7 0.604,8 328.45,9 4.2,10 12,11 48,13 13,14 25,16 49,17 19,20 12,21 7,22 1,24 24,25 5,28 2,29 3,32 24,35 6.3,36 0.163,37 8,38 32,39 47.905,40 54.192,41 30.75,42 28.982,44 4.959}
{0 CHEMBL1630721,1 6.115,2 35.1,3 56.1,4 0.99,5 1.138,6 0.61,7 0.563,8 348.54,9 3.5,10 6,11 57,13 7,14 26,16 58,17 20,20 6,21 14,22 1,24 32,25 5,28 2,29 3,32 25,35 5.3,36 0.138,37 8,38 30,39 56.44,40 64.853,41 34.796,42 32.089,44 5.943}
{0 CHEMBL1818296,1 6.201,2 36,3 55.1,4 0.988,5 1.138,6 0.62,7 0.571,8 551.86,9 5.6,10 11,11 89,13 13,14 43,16 92,17 32,20 11,21 21,22 2,24 49,25 8,28 5,29 3,32 40,35 3.4,36 0.12,37 11,38 50.5,39 87.93,40 101.254,41 55.143,42 50.841,44 6.337}
{0 CHEMBL1818300,1 6.372,2 36.3,3 53.8,4 0.992,5 1.137,6 0.622,7 0.578,8 579.87,9 5.5,10 11,11 91,13 13,14 46,16 95,17 33,20 11,21 22,22 2,24 49,25 9,28 5,29 4,32 42,35 4.4,36 0.116,37 11,38 53.5,39 90.257,40 103.464,41 56.597,42 52.556,44 6.602}
{0 CHEMBL1955891,1 7.219,2 40.3,3 46.8,4 1.002,5 1.131,6 0.654,7 0.622,8 447.59,9 8.1,10 15,11 62,13 17,14 38,16 67,17 25,20 12,21 13,22 2,24 29,25 8,28 5,29 3,32 33,35 4.8,36 0.03,37 2,38 47.5,39 62.094,40 70.102,41 40.529,42 38.573,44 7.337}
{0 CHEMBL1955895,1 7.268,2 39.7,3 46.6,4 1.004,5 1.133,6 0.651,7 0.621,8 421.55,9 8.6,10 15,11 58,13 17,14 35,16 62,17 23,20 12,21 11,22 2,24 27,25 8,28 5,29 3,32 31,35 5.2,36 0.032,37 2,38 44.5,39 58.211,40 65.687,41 37.767,42 36.046,44 7.886}
{0 CHEMBL1955896,1 7.409,2 40,3 45.5,4 1.006,5 1.132,6 0.655,7 0.628,8 407.52,9 9.1,10 15,11 55,13 17,14 34,16 59,17 22,20 12,21 10,22 2,24 25,25 8,28 5,29 3,32 30,35 5.5,36 0.034,37 2,38 43.5,39 55.327,40 62.272,41 36.006,42 34.519,44 7.77}
{0 CHEMBL1958351,1 7.744,2 40.8,3 42.9,4 1.011,5 1.131,6 0.663,7 0.642,8 379.46,9 10.2,10 15,11 49,13 17,14 32,16 53,17 20,20 12,21 8,22 2,24 21,25 8,28 5,29 3,32 28,35 6.1,36 0.019,37 1,38 41.5,39 49.56,40 55.441,41 32.483,42 31.466,44 6.432}
{0 CHEMBL1958352,1 7.567,2 40.4,3 44.2,4 1.009,5 1.132,6 0.659,7 0.634,8 393.49,9 9.6,10 15,11 52,13 17,14 33,16 56,17 21,20 12,21 9,22 2,24 23,25 8,28 5,29 3,32 29,35 5.8,36 0.018,37 1,38 42.5,39 52.443,40 58.857,41 34.245,42 32.993,44 6.553}
{0 CHEMBL1958353,1 7.567,2 40.4,3 44.2,4 1.009,5 1.132,6 0.659,7 0.634,8 393.49,9 9.6,10 15,11 52,13 17,14 33,16 56,17 21,20 12,21 9,22 2,24 23,25 8,28 5,29 3,32 29,35 5.8,36 0.036,37 2,38 42.5,39 52.443,40 58.857,41 34.245,42 32.993,44 7.208}
{0 CHEMBL1958354,1 7.409,2 40,3 45.5,4 1.006,5 1.132,6 0.655,7 0.628,8 407.52,9 9.1,10 15,11 55,13 17,14 34,16 59,17 22,20 12,21 10,22 2,24 25,25 8,28 5,29 3,32 30,35 5.5,36 0.034,37 2,38 43.5,39 55.327,40 62.272,41 36.006,42 34.519,44 7.553}
{0 CHEMBL1958355,1 7.409,2 40,3 45.5,4 1.006,5 1.132,6 0.655,7 0.628,8 407.52,9 9.1,10 15,11 55,13 17,14 34,16 59,17 22,20 12,21 10,22 2,24 25,25 8,28 5,29 3,32 30,35 5.5,36 0.051,37 3,38 43.5,39 55.327,40 62.272,41 36.006,42 34.519,44 7.319}
{0 CHEMBL1958356,1 7.409,2 40,3 45.5,4 1.006,5 1.132,6 0.655,7 0.628,8 407.52,9 9.1,10 15,11 55,13 17,14 34,16 59,17 22,20 12,21 10,22 2,24 25,25 8,28 5,29 3,32 30,35 5.5,36 0.034,37 2,38 43.5,39 55.327,40 62.272,41 36.006,42 34.519,44 7.658}
{0 CHEMBL1958357,1 7.721,2 44.1,3 42.4,4 1.006,5 1.123,6 0.678,7 0.653,8 455.56,9 8.5,10 21,11 59,13 23,14 39,16 64,17 26,20 18,21 8,22 2,24 25,25 8,28 5,29 3,32 34,35 5.1,36 0.047,37 3,38 51.5,39 59.327,40 66.272,41 40.006,42 38.519,44 6.585}
{0 CHEMBL1958358,1 7.492,2 41.1,3 44.6,4 1.006,5 1.13,6 0.661,7 0.634,8 419.53,9 8.9,10 15,11 56,13 17,14 36,16 61,17 23,20 12,21 11,22 2,24 25,25 8,28 5,29 3,32 31,35 5.4,36 0.033,37 2,38 45.5,39 56.327,40 63.272,41 37.006,42 35.519,44 7.824}
{0 CHEMBL1958359,1 7.348,2 40.7,3 45.8,4 1.004,5 1.13,6 0.657,7 0.628,8 433.56,9 8.5,10 15,11 59,13 17,14 37,16 64,17 24,20 12,21 12,22 2,24 27,25 8,28 5,29 3,32 32,35 5.1,36 0.031,37 2,38 46.5,39 59.211,40 66.687,41 38.767,42 37.046,44 7.854}
{0 CHEMBL1958360,1 7.268,2 39.7,3 46.6,4 1.004,5 1.133,6 0.651,7 0.621,8 421.55,9 8.6,10 15,11 58,13 17,14 35,16 62,17 23,20 12,21 11,22 2,24 27,25 8,28 5,29 3,32 31,35 5.2,36 0.032,37 2,38 44.5,39 58.211,40 65.687,41 37.767,42 36.046,44 8.155}
{0 CHEMBL1958361,1 7.409,2 40,3 45.5,4 1.006,5 1.132,6 0.655,7 0.628,8 407.52,9 9.1,10 15,11 55,13 17,14 34,16 59,17 22,20 12,21 10,22 2,24 25,25 8,28 5,29 3,32 30,35 5.5,36 0.034,37 2,38 43.5,39 55.327,40 62.272,41 36.006,42 34.519,44 7.538}
{0 CHEMBL1958362,1 7.268,2 39.7,3 46.6,4 1.004,5 1.133,6 0.651,7 0.621,8 421.55,9 8.6,10 15,11 58,13 17,14 35,16 62,17 23,20 12,21 11,22 2,24 27,25 8,28 5,29 3,32 31,35 5.2,36 0.032,37 2,38 44.5,39 58.211,40 65.687,41 37.767,42 36.046,44 7.921}
{0 CHEMBL1958363,1 7.268,2 39.7,3 46.6,4 1.004,5 1.133,6 0.651,7 0.621,8 421.55,9 8.6,10 15,11 58,13 17,14 35,16 62,17 23,20 12,21 11,22 2,24 27,25 8,28 5,29 3,32 31,35 5.2,36 0.048,37 3,38 44.5,39 58.211,40 65.687,41 37.767,42 36.046,44 7.444}
{0 CHEMBL1958364,1 7.268,2 39.7,3 46.6,4 1.004,5 1.133,6 0.651,7 0.621,8 421.55,9 8.6,10 15,11 58,13 17,14 35,16 62,17 23,20 12,21 11,22 2,24 27,25 8,28 5,29 3,32 31,35 5.2,36 0.048,37 3,38 44.5,39 58.211,40 65.687,41 37.767,42 36.046,44 7.509}
{0 CHEMBL1958365,1 7.284,2 38.7,3 46.8,4 1.007,5 1.134,6 0.645,7 0.618,8 451.58,9 8.1,10 15,11 62,13 17,14 37,16 66,17 24,20 12,21 12,22 2,24 29,25 9,28 5,29 4,32 33,35 6.5,36 0.061,37 4,38 46.5,39 62.421,40 70.312,41 39.983,42 38.288,44 7.939}
{0 CHEMBL1958366,1 7.163,2 38.5,3 47.7,4 1.005,5 1.134,6 0.642,7 0.613,8 465.61,9 7.7,10 15,11 65,13 17,14 38,16 69,17 25,20 12,21 13,22 2,24 31,25 9,28 5,29 4,32 34,35 6.2,36 0.072,37 5,38 47.5,39 65.305,40 73.727,41 41.745,42 39.815,44 7.886}
{0 CHEMBL1958367,1 7.567,2 40.4,3 44.2,4 1.009,5 1.132,6 0.659,7 0.634,8 393.49,9 9.6,10 15,11 52,13 17,14 33,16 56,17 21,20 12,21 9,22 2,24 23,25 8,28 5,29 3,32 29,35 5.8,36 0.036,37 2,38 42.5,39 52.443,40 58.857,41 34.245,42 32.993,44 7}
{0 CHEMBL1958368,1 7.128,2 40.7,3 47.5,4 1,5 1.129,6 0.653,7 0.62,8 420.56,9 6.8,10 15,11 59,13 17,14 35,16 63,17 24,20 13,21 11,22 2,24 28,25 7,28 4,29 3,32 31,35 5.1,36 0.032,37 2,38 44.5,39 58.992,40 66.604,41 38.523,42 36.552,44 8.041}
{0 CHEMBL1958369,1 7.409,2 40,3 45.5,4 1.006,5 1.132,6 0.655,7 0.628,8 407.52,9 9.1,10 15,11 55,13 17,14 34,16 59,17 22,20 12,21 10,22 2,24 25,25 8,28 5,29 3,32 30,35 5.5,36 0.034,37 2,38 43.5,39 55.327,40 62.272,41 36.006,42 34.519,44 7.31}
{0 CHEMBL1958370,1 7.268,2 39.7,3 46.6,4 1.004,5 1.133,6 0.651,7 0.621,8 421.55,9 8.6,10 15,11 58,13 17,14 35,16 62,17 23,20 12,21 11,22 2,24 27,25 8,28 5,29 3,32 31,35 5.2,36 0.032,37 2,38 44.5,39 58.211,40 65.687,41 37.767,42 36.046,44 7.469}
{0 CHEMBL1958371,1 7.268,2 39.7,3 46.6,4 1.004,5 1.133,6 0.651,7 0.621,8 421.55,9 8.6,10 15,11 58,13 17,14 35,16 62,17 23,20 12,21 11,22 2,24 27,25 8,28 5,29 3,32 31,35 5.2,36 0.032,37 2,38 44.5,39 58.211,40 65.687,41 37.767,42 36.046,44 7.921}
{0 CHEMBL1958372,1 7.359,2 39.7,3 46,4 1.007,5 1.132,6 0.651,7 0.624,8 463.59,9 7.9,10 15,11 63,13 17,14 39,16 68,17 25,20 12,21 13,22 2,24 29,25 9,28 5,29 4,32 34,35 6.3,36 0.029,37 2,38 48.5,39 63.421,40 71.312,41 40.983,42 39.288,44 7.678}
{0 CHEMBL1958373,1 7.268,2 39.7,3 46.6,4 1.004,5 1.133,6 0.651,7 0.621,8 421.55,9 8.6,10 15,11 58,13 17,14 35,16 62,17 23,20 12,21 11,22 2,24 27,25 8,28 5,29 3,32 31,35 5.2,36 0.032,37 2,38 44.5,39 58.211,40 65.687,41 37.767,42 36.046,44 8.018}
{0 CHEMBL1958374,1 7.141,2 39.3,3 47.5,4 1.002,5 1.133,6 0.648,7 0.616,8 435.58,9 8.2,10 15,11 61,13 17,14 36,16 65,17 24,20 12,21 12,22 2,24 29,25 8,28 5,29 3,32 32,35 4.9,36 0.031,37 2,38 45.5,39 61.094,40 69.102,41 39.529,42 37.573,44 8}
{0 CHEMBL2059303,1 7.377,2 36.7,3 48.1,4 1.006,5 1.134,6 0.647,7 0.612,8 582.8,9 7.6,10 10,11 79,13 14,14 46,16 84,17 29,20 12,21 17,22 4,24 38,25 12,26 1,28 6,29 5,31 1,32 41,35 6.3,36 0.06,37 5,38 55,39 79.461,40 89.6,41 51.137,42 48.318,44 7.553}
{0 CHEMBL208943,1 6.841,2 42.3,3 49.3,4 0.992,5 1.123,6 0.656,7 0.615,8 485.68,9 4.2,10 16,11 71,13 18,14 41,16 76,17 30,20 16,21 14,22 2,24 35,25 6,28 3,29 3,32 36,35 4.2,36 0.039,37 3,38 51,39 70.425,40 79.766,41 46.563,42 43.637,44 7.26}
{0 CHEMBL326563,1 6.422,2 33.3,3 56.9,4 0.991,5 1.134,6 0.621,7 0.563,8 327.54,9 2,11 51,13 3,14 22,16 51,17 17,20 4,21 13,22 3,24 29,25 5,26 1,28 1,29 3,31 1,32 22,35 5.9,36 0.176,37 9,38 25,39 50.531,40 57.859,41 31.677,42 28.728,44 4.398}
{0 CHEMBL60556,1 6.46,2 39.2,3 52.9,4 0.992,5 1.128,6 0.633,7 0.589,8 329.48,9 2,10 6,11 51,13 9,14 25,16 52,17 20,20 10,21 10,22 3,24 27,25 4,28 1,29 3,32 24,35 5.9,36 0.096,37 5,38 31,39 50.571,40 57.524,41 32.267,42 30.014,44 4.398}
