"molecule_id","AMW","C.","H.","Me","Mi","Mp","Mv","MW","N.","nAB","nAT","nB","nBM","nBO","nBR","nBT","nC","nCL","nCsp","nCsp2","nCsp3","nDB","nF","nH","nHet","nHM","nI","nN","nO","nP","nS","nSK","nTB","nX","O.","RBF","RBN","SCBO","Se","Si","Sp","Sv","X.","pXC50"
{1 6.214,2 42.6,3 53.7,4 0.978,5 1.121,6 0.65,7 0.595,8 335.53,9 1.9,10 10,11 54,13 11,14 29,16 58,17 23,20 9,21 14,22 1,24 29,25 2,28 1,29 1,32 25,35 1.9,38 35,39 52.8,40 60.521,41 35.12,42 32.111,44 4.06}
{0 CHEMBL1235112,1 10.004,2 17.6,3 41.2,4 1.087,5 1.155,6 0.615,7 0.607,8 340.14,11 34,13 3,14 19,16 33,17 6,20 1,21 5,22 3,24 14,25 14,26 2,29 12,30 2,32 20,35 35.3,36 0.273,37 9,38 22,39 36.946,40 39.282,41 20.909,42 20.639,44 4.855}
{0 CHEMBL1235276,1 9.972,2 16.1,3 41.9,4 1.081,5 1.16,6 0.621,7 0.603,8 309.13,9 3.2,11 31,13 3,14 17,16 30,17 5,20 1,21 4,22 3,24 13,25 13,26 2,28 1,29 10,30 2,32 18,35 32.3,36 0.267,37 8,38 20,39 33.509,40 35.946,41 19.244,42 18.704,44 3.578}
{0 CHEMBL1236227,1 8.386,2 20.7,3 48.3,4 1.054,5 1.158,6 0.593,7 0.574,8 243.18,9 3.4,11 29,13 2,14 14,16 28,17 6,20 1,21 5,22 2,24 14,25 9,26 1,28 1,29 7,30 1,32 15,35 24.1,36 0.25,37 7,38 16,39 30.553,40 33.594,41 17.199,42 16.636,44 3.398}
{0 CHEMBL1236228,1 9.505,2 17.6,3 44.1,4 1.07,5 1.158,6 0.618,7 0.595,8 323.16,9 2.9,11 34,13 3,14 18,16 33,17 6,20 1,21 5,22 3,24 15,25 13,26 2,28 1,29 10,30 2,32 19,35 29.4,36 0.273,37 9,38 21,39 36.393,40 39.361,41 21.006,42 20.231,44 4.824}
{0 CHEMBL1278173,1 6.649,2 28.1,3 56.3,4 1.009,5 1.146,6 0.594,7 0.549,8 425.52,9 1.6,11 64,13 3,14 27,16 63,17 18,20 2,21 16,22 3,24 36,25 10,26 1,28 1,29 8,30 1,32 28,35 12.5,36 0.302,37 19,38 30,39 64.6,40 73.371,41 38.029,42 35.146,44 4.174}
{0 CHEMBL2017785,1 9.133,2 17.9,3 46.2,4 1.07,5 1.157,6 0.601,7 0.582,8 356.19,11 39,13 2,14 20,16 38,17 7,21 7,22 2,24 18,25 14,26 2,29 12,30 2,32 21,35 30.8,36 0.263,37 10,38 22,39 41.713,40 45.112,41 23.432,42 22.693,44 5.125}
{0 CHEMBL2017786,1 8.815,2 19,3 47.6,4 1.062,5 1.155,6 0.6,7 0.577,8 370.22,11 42,13 2,14 21,16 41,17 8,21 8,22 2,24 20,25 14,26 2,29 12,30 2,32 22,35 28.6,36 0.268,37 11,38 23,39 44.596,40 48.527,41 25.193,42 24.22,44 4.194}
{0 CHEMBL2017788,1 8.37,2 27.3,3 47.3,4 1.041,5 1.141,6 0.627,7 0.596,8 460.35,10 6,11 55,13 8,14 29,16 55,17 15,20 6,21 9,22 2,24 26,25 14,26 2,29 12,30 2,32 29,35 21.8,36 0.255,37 14,38 34,39 57.247,40 62.773,41 34.477,42 32.8,44 4.678}
{0 CHEMBL2017790,1 8.085,2 21.6,3 51,4 1.044,5 1.152,6 0.598,7 0.565,8 412.31,11 51,13 2,14 24,16 50,17 11,21 11,22 2,24 26,25 14,26 2,29 12,30 2,32 25,35 23.5,36 0.26,37 13,38 26,39 53.247,40 58.773,41 30.477,42 28.8,44 4.77}
{0 CHEMBL258208,1 9.504,2 16.7,3 44.4,4 1.079,5 1.158,6 0.602,7 0.588,8 342.16,11 36,13 2,14 19,16 35,17 6,21 6,22 2,24 16,25 14,26 2,29 12,30 2,32 20,35 33.3,36 0.257,37 9,38 21,39 38.829,40 41.697,41 21.67,42 21.166,44 5.097}
{0 CHEMBL371668,1 10.691,2 12.5,3 37.5,4 1.106,5 1.17,6 0.606,7 0.613,8 171.06,9 6.3,11 16,13 2,14 9,16 15,17 2,20 1,21 1,22 2,24 6,25 8,26 1,28 1,29 6,30 1,32 10,35 37.5,36 0.2,37 3,38 11,39 17.691,40 18.724,41 9.699,42 9.814,44 6}
