{
  "data_set_description": {
    "collection_date": "November 2013",
    "creator": "Dr Jeremy Besnard, Dr Ivan Olier, Dr Noureddin Sadawi, Dr Larisa Soldatova, Dr Crina Grosan, Prof Ross King, Dr Richard Bickerton, Prof Andrew Hopkins and Dr Willem van Hoorn",
    "default_target_attribute": "pXC50",
    "description": "This dataset contains QSAR data (from ChEMBL version 17) showing activity values (unit is pseudo-pCI50) of several compounds on drug target ChEMBL_ID: CHEMBL4314 (TID: 100776), and it has 15 rows and 1127 features (not including molecule IDs and class feature: molecule_id and pXC50). The features represent Molecular Descriptors which were generated from SMILES strings. Missing value imputation was applied to this dataset (By choosing the Median).",
    "description_version": "1",
    "file_id": "3475752",
    "format": "ARFF",
    "id": "32284",
    "licence": "Public",
    "md5_checksum": "dfae3fec56c8485c19e2abe6b1afcf40",
    "minio_url": "https://data.openml.org/datasets/0003/32284/dataset_32284.pq",
    "name": "QSAR-DATASET-FOR-DRUG-TARGET-CHEMBL4314",
    "original_data_url": "https://www.ebi.ac.uk/chembl/target/inspect/CHEMBL4314",
    "parquet_url": "https://data.openml.org/datasets/0003/32284/dataset_32284.pq",
    "processing_date": "2018-10-04 02:51:39",
    "row_id_attribute": "molecule_id",
    "status": "deactivated",
    "tag": [
      "MetaQSAR",
      "study_13"
    ],
    "upload_date": "2016-07-15T09:47:43",
    "url": "https://api.openml.org/data/v1/download/3475752/QSAR-DATASET-FOR-DRUG-TARGET-CHEMBL4314.arff",
    "version": "9",
    "visibility": "public"
  }
}