"molecule_id","AMW","C.","H.","Me","Mi","Mp","Mv","MW","N.","nAB","nAT","pXC50"
{1 7.744,2 40.8,3 42.9,4 1.011,5 1.131,6 0.663,7 0.642,8 379.46,9 10.2,10 20,11 49,12 5.637}
{0 CHEMBL1300769,1 10.454,2 50,3 29.4,4 1.024,5 1.104,6 0.787,7 0.754,8 355.44,9 8.8,10 18,11 34,12 4.708}
{0 CHEMBL1302170,1 9.353,2 47.9,3 35.4,4 1.013,5 1.108,6 0.745,7 0.713,8 448.96,9 8.3,10 27,11 48,12 5.218}
{0 CHEMBL1304979,1 8.082,2 41.1,3 42.9,4 1.011,5 1.123,6 0.68,7 0.65,8 452.58,9 7.1,10 21,11 56,12 5.665}
{0 CHEMBL1308195,1 8.339,2 45.3,3 42.2,4 1.006,5 1.106,6 0.71,7 0.669,8 533.71,9 1.6,10 18,11 64,12 5.394}
{0 CHEMBL1308993,1 8.601,2 29.4,3 47.1,4 1.025,5 1.135,6 0.66,7 0.617,8 292.42,9 5.9,11 34,12 4.896}
{0 CHEMBL1310325,1 8.169,2 44.4,3 41.3,4 1.008,5 1.116,6 0.696,7 0.666,8 514.65,9 6.3,10 17,11 63,12 4.95}
{0 CHEMBL1320537,1 8.715,2 47.1,3 35.3,4 1.027,5 1.115,6 0.695,7 0.692,8 296.3,9 5.9,10 16,11 34,12 5.359}
{0 CHEMBL1323252,1 8.112,2 46.9,3 38.8,4 1.007,5 1.119,6 0.699,7 0.678,8 397.47,9 10.2,10 26,11 49,12 5.807}
{0 CHEMBL1323674,1 8.396,2 41.9,3 38.7,4 1.03,5 1.126,6 0.666,7 0.662,8 260.27,9 6.5,10 6,11 31,12 5.807}
{0 CHEMBL1325241,1 7.839,2 42.6,3 42.6,4 1.017,5 1.123,6 0.662,7 0.646,8 368.42,9 4.3,10 12,11 47,12 4.295}
{0 CHEMBL1334149,1 7.24,2 43.6,3 46.2,4 0.998,5 1.121,6 0.667,7 0.633,8 282.37,9 5.1,10 10,11 39,12 5.469}
{0 CHEMBL1334670,1 8.206,2 44.3,3 39.3,4 1.02,5 1.121,6 0.678,7 0.666,8 500.55,9 6.6,10 21,11 61,12 5.321}
{0 CHEMBL1344330,1 7.26,2 45,3 45,4 0.99,5 1.122,6 0.684,7 0.644,8 290.4,9 10,10 11,11 40,12 4.497}
{0 CHEMBL1346753,1 7.209,2 36,3 48,4 1.011,5 1.14,6 0.629,7 0.604,8 180.23,9 8,10 6,11 25,12 4.208}
{0 CHEMBL1348090,1 9.952,2 50,3 29.4,4 1.033,5 1.1,6 0.751,7 0.741,8 338.36,9 5.9,10 16,11 34,12 5.621}
{0 CHEMBL1351543,1 12.107,2 41.7,3 25,4 1.076,5 1.139,6 0.754,7 0.755,8 435.86,9 8.3,10 16,11 36,12 5.116}
{0 CHEMBL1351935,1 9.963,2 46.9,3 34.4,4 1.021,5 1.105,6 0.757,7 0.723,8 318.8,9 6.3,10 16,11 32,12 5.145}
{0 CHEMBL1352903,1 13.394,2 46.4,3 35.7,4 1.025,5 1.115,6 0.774,7 0.726,8 375.04,9 3.6,10 12,11 28,12 4.622}
{0 CHEMBL1354019,1 9.334,2 42.3,3 40.4,4 1.017,5 1.123,6 0.693,7 0.668,8 485.37,9 7.7,10 20,11 52,12 5.69}
{0 CHEMBL1360857,1 7.946,2 46.8,3 40.4,4 1.008,5 1.116,6 0.691,7 0.669,8 373.44,9 6.4,10 17,11 47,12 5.07}
{0 CHEMBL1365210,1 7.538,2 40,3 47.3,4 1.003,5 1.122,6 0.666,7 0.626,8 414.57,9 3.6,10 17,11 55,12 4.766}
{0 CHEMBL1368362,1 10.036,2 45.5,3 34.1,4 1.019,5 1.099,6 0.77,7 0.726,8 441.59,9 6.8,10 16,11 44,12 4.678}
{0 CHEMBL1369492,1 8.741,2 39,3 42.4,4 1.009,5 1.119,6 0.711,7 0.662,8 515.74,9 8.5,10 17,11 59,12 4.718}
{0 CHEMBL1370375,1 8.485,2 45.2,3 38.1,4 1.032,5 1.114,6 0.673,7 0.672,8 356.35,10 5,11 42,12 4.125}
{0 CHEMBL1380232,1 7.467,2 40.4,3 47.4,4 0.999,5 1.123,6 0.67,7 0.627,8 425.6,9 5.3,10 16,11 57,12 4.36}
{0 CHEMBL1389315,1 8.542,2 43.8,3 40.6,4 1.009,5 1.113,6 0.711,7 0.674,8 546.72,9 6.3,10 27,11 64,12 5.679}
{0 CHEMBL1405964,1 8.487,2 42.9,3 41.3,4 1.009,5 1.115,6 0.707,7 0.668,8 534.71,9 6.3,10 27,11 63,12 5.796}
{0 CHEMBL1411702,1 10.623,2 50,3 29.4,4 1.037,5 1.106,6 0.762,7 0.749,8 361.19,9 5.9,10 17,11 34,12 5.149}
{0 CHEMBL1415156,1 10.912,2 52.4,3 28.6,4 1.022,5 1.105,6 0.77,7 0.754,8 458.29,9 11.9,10 26,11 42,12 5.428}
{0 CHEMBL1416302,1 8.229,2 45.8,3 39,4 1.019,5 1.117,6 0.684,7 0.672,8 485.53,9 5.1,10 18,11 59,12 4.94}
{0 CHEMBL1422541,1 7.991,2 49.1,3 39.6,4 1.005,5 1.111,6 0.703,7 0.678,8 423.5,9 5.7,10 23,11 53,12 4.603}
{0 CHEMBL1427763,1 7.677,2 40.9,3 45.5,4 1.004,5 1.123,6 0.673,7 0.636,8 506.68,9 6.1,10 17,11 66,12 4.903}
{0 CHEMBL1433585,1 7.627,2 42.6,3 44.1,4 1.013,5 1.122,6 0.66,7 0.639,8 518.61,9 2.9,10 16,11 68,12 4.859}
{0 CHEMBL1438567,1 6.881,2 45.2,3 48.4,4 0.988,5 1.117,6 0.671,7 0.627,8 213.3,9 3.2,10 12,11 31,12 4.672}
{0 CHEMBL1440277,1 8.661,2 43.9,3 40.4,4 1.011,5 1.111,6 0.715,7 0.677,8 493.65,9 5.3,10 17,11 57,12 5.408}
{0 CHEMBL1445259,1 9.442,2 46.7,3 30,4 1.042,5 1.119,6 0.704,7 0.717,8 283.26,9 10,10 12,11 30,12 4.878}
{0 CHEMBL1447211,1 8.69,2 51.1,3 34,4 1.015,5 1.109,6 0.722,7 0.71,8 408.44,9 8.5,10 17,11 47,12 4.686}
{0 CHEMBL1447803,1 9.666,2 47.7,3 38.6,4 1.011,5 1.109,6 0.723,7 0.692,8 425.3,9 4.5,10 12,11 44,12 4.731}
{0 CHEMBL1451931,1 7.979,2 51.5,3 39.4,4 1.002,5 1.103,6 0.712,7 0.685,8 263.31,9 3,10 12,11 33,12 4.807}
{0 CHEMBL1454269,1 6.952,2 42.9,3 48.6,4 0.995,5 1.121,6 0.657,7 0.619,8 243.33,9 2.9,10 12,11 35,12 4.25}
{0 CHEMBL1455832,1 7.149,2 42,3 48,4 1.004,5 1.129,6 0.649,7 0.617,8 357.46,9 2,10 12,11 50,12 4.592}
{0 CHEMBL1457702,1 8.858,2 43.5,3 37,4 1.019,5 1.12,6 0.709,7 0.687,8 407.49,9 10.9,10 22,11 46,12 5.003}
{0 CHEMBL1462636,1 8.259,2 47.7,3 38.6,4 1.018,5 1.111,6 0.69,7 0.677,8 363.39,9 2.3,10 12,11 44,12 4.762}
{0 CHEMBL1462687,1 8.556,2 50.9,3 35.8,4 1.019,5 1.104,6 0.709,7 0.699,8 453.47,9 1.9,10 24,11 53,12 4.935}
{0 CHEMBL1466913,1 8.034,2 43.2,3 43.2,4 1.002,5 1.117,6 0.697,7 0.657,8 353.48,9 6.8,10 12,11 44,12 4.13}
{0 CHEMBL1469444,1 8.144,2 40.5,3 40.5,4 1.025,5 1.13,6 0.66,7 0.651,8 301.33,9 8.1,10 6,11 37,12 4.987}
{0 CHEMBL1478085,1 7.89,2 47.6,3 40.5,4 1.003,5 1.115,6 0.697,7 0.671,8 331.4,9 7.1,10 17,11 42,12 5.197}
{0 CHEMBL1490463,1 6.878,2 39.5,3 50,4 1.001,5 1.128,6 0.637,7 0.603,8 261.35,9 2.6,10 6,11 38,12 4.317}
{0 CHEMBL1503523,1 7.913,2 46.2,3 40.4,4 1.004,5 1.12,6 0.693,7 0.668,8 411.5,9 9.6,10 26,11 52,12 5.752}
{0 CHEMBL1509401,1 13.174,2 48.3,3 34.5,4 1.014,5 1.102,6 0.792,7 0.739,8 382.06,9 6.9,10 12,11 29,12 5.595}
{0 CHEMBL1511181,1 9.065,2 44.6,3 37.5,4 1.019,5 1.109,6 0.722,7 0.692,8 507.63,9 5.4,10 24,11 56,12 5.807}
{0 CHEMBL1525134,1 9.923,2 51.7,3 34.5,4 1.009,5 1.091,6 0.785,7 0.737,8 287.78,9 3.4,10 16,11 29,12 4.827}
{0 CHEMBL1527903,1 8.587,2 48.5,3 39.4,4 1.004,5 1.101,6 0.731,7 0.691,8 283.37,9 3,10 12,11 33,12 4.144}
{0 CHEMBL1529584,1 7.707,2 46,3 42.9,4 1.009,5 1.114,6 0.677,7 0.653,8 485.57,9 1.6,10 18,11 63,12 4.602}
{0 CHEMBL1532953,1 8.487,2 42.9,3 41.3,4 1.009,5 1.115,6 0.707,7 0.668,8 534.71,9 6.3,10 27,11 63,12 5.468}
{0 CHEMBL1533336,1 10.201,2 35.5,3 32.3,4 1.101,5 1.205,6 0.609,7 0.66,8 316.23,9 6.5,10 6,11 31,12 4.226}
{0 CHEMBL1536144,1 8.388,2 43.2,3 37.8,4 1.022,5 1.127,6 0.681,7 0.672,8 310.34,9 10.8,10 16,11 37,12 4.368}
{0 CHEMBL1545384,1 7.163,2 43.1,3 48.6,4 0.991,5 1.117,6 0.675,7 0.626,8 515.75,9 2.8,10 23,11 72,12 5.174}
{0 CHEMBL1546183,1 9.398,2 45.7,3 41.3,4 1.014,5 1.119,6 0.702,7 0.67,8 432.31,9 2.2,10 18,11 46,12 5.332}
{0 CHEMBL1548333,1 8.913,2 46.3,3 36.6,4 1.016,5 1.111,6 0.722,7 0.697,8 365.44,9 7.3,10 16,11 41,12 5.137}
{0 CHEMBL1559707,1 7.657,2 37.1,3 48.4,4 1,5 1.127,6 0.671,7 0.62,8 474.71,9 6.5,11 62,12 5.247}
{0 CHEMBL1564363,1 7.618,2 37.3,3 47.1,4 1.006,5 1.131,6 0.66,7 0.621,8 388.54,9 7.8,10 6,11 51,12 4.857}
{0 CHEMBL1569997,1 7.569,2 40.7,3 44.1,4 1.007,5 1.132,6 0.661,7 0.636,8 446.56,9 10.2,10 22,11 59,12 4.929}
{0 CHEMBL1572208,1 8.335,2 52.2,3 37,4 1.01,5 1.101,6 0.716,7 0.698,8 383.42,9 2.2,10 24,11 46,12 4.414}
{0 CHEMBL1585746,1 8.653,2 38.1,3 40.5,4 1.029,5 1.128,6 0.673,7 0.655,8 363.43,9 7.1,10 12,11 42,12 4.689}
{0 CHEMBL1602055,1 9.366,2 46.7,3 33.3,4 1.029,5 1.11,6 0.722,7 0.711,8 421.46,9 6.7,10 18,11 45,12 4.975}
{0 CHEMBL1603065,1 8.759,2 50,3 34.1,4 1.021,5 1.11,6 0.714,7 0.706,8 385.4,9 6.8,10 21,11 44,12 5.206}
{0 CHEMBL1605743,1 8.48,2 55.9,3 35.3,4 1.008,5 1.092,6 0.733,7 0.715,8 288.31,10 12,11 34,12 4.954}
{0 CHEMBL1608791,1 7.848,2 44.2,3 44.2,4 0.995,5 1.115,6 0.703,7 0.655,8 337.48,9 7,10 17,11 43,12 4.536}
{0 CHEMBL1612112,1 8.942,2 44.8,3 37.9,4 1.014,5 1.11,6 0.724,7 0.691,8 518.66,9 6.9,10 27,11 58,12 5.807}
{0 CHEMBL1964978,1 10.319,2 44.4,3 33.3,4 1.034,5 1.112,6 0.745,7 0.721,8 464.35,9 6.7,10 12,11 45,12 4.72}
{0 CHEMBL1985649,1 7.581,2 47.6,3 42.9,4 0.998,5 1.113,6 0.691,7 0.659,8 318.4,9 4.8,10 12,11 42,12 4.283}
{0 CHEMBL1990694,1 7.387,2 46.7,3 44.4,4 0.996,5 1.114,6 0.684,7 0.649,8 332.43,9 4.4,10 16,11 45,12 4.636}
{0 CHEMBL1993173,1 9.446,2 48.7,3 33.3,4 1.028,5 1.112,6 0.732,7 0.716,8 368.41,9 5.1,10 17,11 39,12 5.747}
{0 CHEMBL1998038,1 9.745,2 43.3,3 33.3,4 1.035,5 1.142,6 0.72,7 0.705,8 292.34,9 13.3,10 12,11 30,12 4.012}
{0 CHEMBL1999473,1 8.992,2 48.1,3 35.2,4 1.02,5 1.107,6 0.723,7 0.704,8 485.55,9 5.6,10 23,11 54,12 4.739}
{0 CHEMBL2000670,1 7.584,2 50,3 42.5,4 0.996,5 1.106,6 0.7,7 0.667,8 303.38,9 2.5,10 18,11 40,12 4.415}
{0 CHEMBL2028186,1 11.582,2 39,3 26.8,4 1.074,5 1.116,6 0.733,7 0.739,8 474.88,9 4.9,10 17,11 41,12 5.48}
{0 CHEMBL418068,1 9.801,2 51.7,3 27.6,4 1.052,5 1.101,6 0.716,7 0.738,8 284.23,10 12,11 29,12 4.493}
{0 CHEMBL88326,1 8.861,2 51.9,3 33.3,4 1.023,5 1.103,6 0.719,7 0.714,8 239.24,9 3.7,10 12,11 27,12 5.807}
