"molecule_id","AMW","C.","H.","Me","Mi","Mp","Mv","MW","N.","nAB","nAT","nB","nBM","nBO","nBR","nBT","nC","nCL","nCsp","nCsp2","nCsp3","nDB","nF","nH","nHet","nHM","nI","nN","nO","nP","nS","nSK","nTB","nX","O.","RBF","RBN","SCBO","Se","Si","Sp","Sv","X.","pXC50"
{1 6.092,2 27.8,3 58.3,4 1.007,5 1.152,6 0.568,7 0.532,8 219.32,9 2.8,11 36,14 15,16 36,17 10,21 10,24 21,25 5,28 1,29 4,32 15,35 11.1,36 0.111,37 4,38 15,39 36.247,40 41.488,41 20.438,42 19.149,44 6.377}
{0 CHEMBL184028,1 5.676,2 29.4,3 60.8,4 0.993,5 1.148,6 0.573,7 0.525,8 289.47,9 2,11 51,14 20,16 51,17 15,21 15,24 31,25 5,28 1,29 4,32 20,35 7.8,36 0.176,37 9,38 20,39 50.665,40 58.564,41 29.245,42 26.783,44 5.824}
{0 CHEMBL186068,1 5.738,2 29.2,3 60.4,4 0.995,5 1.149,6 0.573,7 0.526,8 275.44,9 2.1,11 48,14 19,16 48,17 14,21 14,24 29,25 5,28 1,29 4,32 19,35 8.3,36 0.167,37 8,38 19,39 47.781,40 55.149,41 27.483,42 25.256,44 7.097}
{0 CHEMBL186150,1 5.89,2 28.6,3 59.5,4 1,5 1.15,6 0.57,7 0.529,8 247.38,9 2.4,11 42,14 17,16 42,17 12,21 12,24 25,25 5,28 1,29 4,32 17,35 9.5,36 0.143,37 6,38 17,39 42.014,40 48.318,41 23.961,42 22.202,44 6.155}
{0 CHEMBL186291,1 5.738,2 29.2,3 60.4,4 0.995,5 1.149,6 0.573,7 0.526,8 275.44,9 2.1,11 48,14 19,16 48,17 14,21 14,24 29,25 5,28 1,29 4,32 19,35 8.3,36 0.167,37 8,38 19,39 47.781,40 55.149,41 27.483,42 25.256,44 6.229}
{0 CHEMBL187158,1 5.676,2 29.4,3 60.8,4 0.993,5 1.148,6 0.573,7 0.525,8 289.47,9 2,11 51,14 20,16 51,17 15,21 15,24 31,25 5,28 1,29 4,32 20,35 7.8,36 0.176,37 9,38 20,39 50.665,40 58.564,41 29.245,42 26.783,44 7.097}
{0 CHEMBL187208,1 6.221,2 27.3,3 57.6,4 1.011,5 1.154,6 0.566,7 0.534,8 205.29,9 3,11 33,14 14,16 33,17 9,21 9,24 19,25 5,28 1,29 4,32 14,35 12.1,36 0.091,37 3,38 14,39 33.363,40 38.073,41 18.676,42 17.622,44 4.824}
{0 CHEMBL307429,1 6.8,2 25,3 54.2,4 1.03,5 1.159,6 0.558,7 0.543,8 163.2,9 4.2,11 24,14 11,16 24,17 6,21 6,24 13,25 5,28 1,29 4,32 11,35 16.7,36 0.042,37 1,38 11,39 24.713,40 27.827,41 13.392,42 13.041,44 7.412}
{0 CHEMBL362754,1 6.221,2 27.3,3 57.6,4 1.011,5 1.154,6 0.566,7 0.534,8 205.29,9 3,11 33,14 14,16 33,17 9,21 9,24 19,25 5,28 1,29 4,32 14,35 12.1,36 0.091,37 3,38 14,39 33.363,40 38.073,41 18.676,42 17.622,44 5.699}
{0 CHEMBL364554,1 5.89,2 28.6,3 59.5,4 1,5 1.15,6 0.57,7 0.529,8 247.38,9 2.4,11 42,14 17,16 42,17 12,21 12,24 25,25 5,28 1,29 4,32 17,35 9.5,36 0.143,37 6,38 17,39 42.014,40 48.318,41 23.961,42 22.202,44 6.097}
{0 CHEMBL365496,1 6.092,2 27.8,3 58.3,4 1.007,5 1.152,6 0.568,7 0.532,8 219.32,9 2.8,11 36,14 15,16 36,17 10,21 10,24 21,25 5,28 1,29 4,32 15,35 11.1,36 0.111,37 4,38 15,39 36.247,40 41.488,41 20.438,42 19.149,44 4.587}
{0 CHEMBL369297,1 6.8,2 25,3 54.2,4 1.03,5 1.159,6 0.558,7 0.543,8 163.2,9 4.2,11 24,14 11,16 24,17 6,21 6,24 13,25 5,28 1,29 4,32 11,35 16.7,36 0.042,37 1,38 11,39 24.713,40 27.827,41 13.392,42 13.041,44 5.367}
