{
  "data_features": {
    "feature": [
      {
        "data_type": "nominal",
        "index": "0",
        "is_ignore": "false",
        "is_row_identifier": "true",
        "is_target": "false",
        "name": "molecule_id",
        "nominal_value": [
          "CHEMBL1301019",
          "CHEMBL1304193",
          "CHEMBL1304974",
          "CHEMBL1305050",
          "CHEMBL1305391",
          "CHEMBL1307459",
          "CHEMBL1313807",
          "CHEMBL1319451",
          "CHEMBL1321933",
          "CHEMBL1322542",
          "CHEMBL1324051",
          "CHEMBL1324382",
          "CHEMBL1325523",
          "CHEMBL1325945",
          "CHEMBL1328061",
          "CHEMBL1328309",
          "CHEMBL1328398",
          "CHEMBL1328729",
          "CHEMBL1328748",
          "CHEMBL1329141",
          "CHEMBL1329983",
          "CHEMBL1331645",
          "CHEMBL1333555",
          "CHEMBL1333592",
          "CHEMBL1333960",
          "CHEMBL1334412",
          "CHEMBL1334633",
          "CHEMBL1334684",
          "CHEMBL1334970",
          "CHEMBL1336605",
          "CHEMBL1337575",
          "CHEMBL1343331",
          "CHEMBL1351507",
          "CHEMBL1353227",
          "CHEMBL1353989",
          "CHEMBL1359394",
          "CHEMBL1363132",
          "CHEMBL1363824",
          "CHEMBL1364583",
          "CHEMBL1368913",
          "CHEMBL1369981",
          "CHEMBL1371777",
          "CHEMBL1371869",
          "CHEMBL1372387",
          "CHEMBL1373046",
          "CHEMBL1373132",
          "CHEMBL1373210",
          "CHEMBL1373495",
          "CHEMBL1373509",
          "CHEMBL1374065",
          "CHEMBL1376711",
          "CHEMBL1376870",
          "CHEMBL1379593",
          "CHEMBL1379677",
          "CHEMBL1381644",
          "CHEMBL1382722",
          "CHEMBL1384172",
          "CHEMBL1384779",
          "CHEMBL1385949",
          "CHEMBL1386069",
          "CHEMBL1387693",
          "CHEMBL1390703",
          "CHEMBL1391196",
          "CHEMBL1392728",
          "CHEMBL1393151",
          "CHEMBL1400895",
          "CHEMBL1402456",
          "CHEMBL1403497",
          "CHEMBL1403754",
          "CHEMBL1407027",
          "CHEMBL1407203",
          "CHEMBL1407368",
          "CHEMBL1408008",
          "CHEMBL1408579",
          "CHEMBL1409373",
          "CHEMBL1410909",
          "CHEMBL1412998",
          "CHEMBL1414350",
          "CHEMBL1414381",
          "CHEMBL1414679",
          "CHEMBL1415156",
          "CHEMBL1418271",
          "CHEMBL1424189",
          "CHEMBL1424694",
          "CHEMBL1425948",
          "CHEMBL1426947",
          "CHEMBL1427609",
          "CHEMBL1430473",
          "CHEMBL1438469",
          "CHEMBL1439815",
          "CHEMBL1441239",
          "CHEMBL1441524",
          "CHEMBL1443006",
          "CHEMBL1443281",
          "CHEMBL1445488",
          "CHEMBL1447034",
          "CHEMBL1447397",
          "CHEMBL1447461",
          "CHEMBL1448320",
          "CHEMBL1448629",
          "CHEMBL1449334",
          "CHEMBL1449836",
          "CHEMBL1451516",
          "CHEMBL1452440",
          "CHEMBL1452974",
          "CHEMBL1453902",
          "CHEMBL1454310",
          "CHEMBL1455226",
          "CHEMBL1456035",
          "CHEMBL1460470",
          "CHEMBL1462768",
          "CHEMBL1463091",
          "CHEMBL1463659",
          "CHEMBL1467028",
          "CHEMBL1467092",
          "CHEMBL1467623",
          "CHEMBL1478587",
          "CHEMBL1478825",
          "CHEMBL1480807",
          "CHEMBL1482473",
          "CHEMBL1483335",
          "CHEMBL1483741",
          "CHEMBL1484942",
          "CHEMBL1488035",
          "CHEMBL1489230",
          "CHEMBL1489619",
          "CHEMBL1489665",
          "CHEMBL1489917",
          "CHEMBL1490321",
          "CHEMBL1490701",
          "CHEMBL1491520",
          "CHEMBL1491672",
          "CHEMBL1491919",
          "CHEMBL1491991",
          "CHEMBL1492035",
          "CHEMBL1492839",
          "CHEMBL1493399",
          "CHEMBL1495142",
          "CHEMBL1504738",
          "CHEMBL1505246",
          "CHEMBL1505300",
          "CHEMBL1505471",
          "CHEMBL1506716",
          "CHEMBL1517389",
          "CHEMBL1517649",
          "CHEMBL1519773",
          "CHEMBL1525859",
          "CHEMBL1526088",
          "CHEMBL1526171",
          "CHEMBL1526353",
          "CHEMBL1526610",
          "CHEMBL1526669",
          "CHEMBL1527023",
          "CHEMBL1527520",
          "CHEMBL1527941",
          "CHEMBL1528227",
          "CHEMBL1528814",
          "CHEMBL1530046",
          "CHEMBL1530080",
          "CHEMBL1530147",
          "CHEMBL1531431",
          "CHEMBL1535445",
          "CHEMBL1536551",
          "CHEMBL1536896",
          "CHEMBL1539325",
          "CHEMBL1554052",
          "CHEMBL1555938",
          "CHEMBL1557930",
          "CHEMBL1565097",
          "CHEMBL1566708",
          "CHEMBL1567279",
          "CHEMBL1568497",
          "CHEMBL1568844",
          "CHEMBL1569076",
          "CHEMBL1570401",
          "CHEMBL1570803",
          "CHEMBL1575586",
          "CHEMBL1578067",
          "CHEMBL1578670",
          "CHEMBL1580684",
          "CHEMBL1583199",
          "CHEMBL1584392",
          "CHEMBL1586",
          "CHEMBL1597781",
          "CHEMBL1599376",
          "CHEMBL1602524",
          "CHEMBL1603381",
          "CHEMBL1605172",
          "CHEMBL1606056",
          "CHEMBL1606543",
          "CHEMBL1606748",
          "CHEMBL1607593",
          "CHEMBL1607735",
          "CHEMBL1608153",
          "CHEMBL1608225",
          "CHEMBL1608642",
          "CHEMBL1608654",
          "CHEMBL1609",
          "CHEMBL1609429",
          "CHEMBL1698303",
          "CHEMBL1701224",
          "CHEMBL1701471",
          "CHEMBL1702283",
          "CHEMBL1702303",
          "CHEMBL1703811",
          "CHEMBL1705741",
          "CHEMBL1708418",
          "CHEMBL1708751",
          "CHEMBL1708762",
          "CHEMBL1708834",
          "CHEMBL1709810",
          "CHEMBL1713322",
          "CHEMBL1713941",
          "CHEMBL1714877",
          "CHEMBL1715328",
          "CHEMBL1715760",
          "CHEMBL1717227",
          "CHEMBL1717901",
          "CHEMBL1717981",
          "CHEMBL1718472",
          "CHEMBL1719276",
          "CHEMBL1719568",
          "CHEMBL1721258",
          "CHEMBL1721385",
          "CHEMBL1721618",
          "CHEMBL1722185",
          "CHEMBL1724311",
          "CHEMBL1724547",
          "CHEMBL1725341",
          "CHEMBL1727280",
          "CHEMBL1727475",
          "CHEMBL1727679",
          "CHEMBL1728483",
          "CHEMBL1729688",
          "CHEMBL1730304",
          "CHEMBL1732016",
          "CHEMBL1732183",
          "CHEMBL1732186",
          "CHEMBL1733670",
          "CHEMBL1734906",
          "CHEMBL1734920",
          "CHEMBL1735040",
          "CHEMBL1735408",
          "CHEMBL1736022",
          "CHEMBL1736524",
          "CHEMBL1966168",
          "CHEMBL1971015",
          "CHEMBL1981446",
          "CHEMBL1988133",
          "CHEMBL1995948",
          "CHEMBL201289",
          "CHEMBL213432",
          "CHEMBL244695",
          "CHEMBL256098",
          "CHEMBL259355",
          "CHEMBL271690",
          "CHEMBL274056",
          "CHEMBL292411",
          "CHEMBL312097",
          "CHEMBL43612",
          "CHEMBL458328",
          "CHEMBL462058",
          "CHEMBL476648",
          "CHEMBL476649",
          "CHEMBL476655",
          "CHEMBL478485",
          "CHEMBL492894",
          "CHEMBL500348",
          "CHEMBL501993",
          "CHEMBL505950",
          "CHEMBL50620",
          "CHEMBL508233",
          "CHEMBL555689",
          "CHEMBL55659",
          "CHEMBL55934",
          "CHEMBL578512",
          "CHEMBL578585",
          "CHEMBL57978",
          "CHEMBL580819",
          "CHEMBL58910",
          "CHEMBL590",
          "CHEMBL599924",
          "CHEMBL601167",
          "CHEMBL6246",
          "CHEMBL66953",
          "CHEMBL8320"
        ],
        "number_of_missing_values": "0"
      },
      {
        "data_type": "numeric",
        "index": "1",
        "is_ignore": "false",
        "is_row_identifier": "false",
        "is_target": "false",
        "name": "C.",
        "number_of_missing_values": "0"
      },
      {
        "data_type": "numeric",
        "index": "2",
        "is_ignore": "false",
        "is_row_identifier": "false",
        "is_target": "false",
        "name": "Mp",
        "number_of_missing_values": "0"
      },
      {
        "data_type": "numeric",
        "index": "3",
        "is_ignore": "false",
        "is_row_identifier": "false",
        "is_target": "false",
        "name": "H.",
        "number_of_missing_values": "0"
      },
      {
        "data_type": "numeric",
        "index": "4",
        "is_ignore": "false",
        "is_row_identifier": "false",
        "is_target": "false",
        "name": "Mv",
        "number_of_missing_values": "0"
      },
      {
        "data_type": "numeric",
        "index": "5",
        "is_ignore": "false",
        "is_row_identifier": "false",
        "is_target": "false",
        "name": "N.",
        "number_of_missing_values": "0"
      },
      {
        "data_type": "numeric",
        "index": "6",
        "is_ignore": "false",
        "is_row_identifier": "false",
        "is_target": "false",
        "name": "RBF",
        "number_of_missing_values": "0"
      },
      {
        "data_type": "numeric",
        "index": "7",
        "is_ignore": "false",
        "is_row_identifier": "false",
        "is_target": "false",
        "name": "RBN",
        "number_of_missing_values": "0"
      },
      {
        "data_type": "numeric",
        "index": "8",
        "is_ignore": "false",
        "is_row_identifier": "false",
        "is_target": "false",
        "name": "AMW",
        "number_of_missing_values": "0"
      },
      {
        "data_type": "numeric",
        "index": "9",
        "is_ignore": "false",
        "is_row_identifier": "false",
        "is_target": "false",
        "name": "Me",
        "number_of_missing_values": "0"
      },
      {
        "data_type": "numeric",
        "index": "10",
        "is_ignore": "false",
        "is_row_identifier": "false",
        "is_target": "false",
        "name": "Mi",
        "number_of_missing_values": "0"
      },
      {
        "data_type": "numeric",
        "index": "11",
        "is_ignore": "false",
        "is_row_identifier": "false",
        "is_target": "false",
        "name": "MW",
        "number_of_missing_values": "0"
      },
      {
        "data_type": "numeric",
        "index": "12",
        "is_ignore": "false",
        "is_row_identifier": "false",
        "is_target": "false",
        "name": "nAB",
        "number_of_missing_values": "0"
      },
      {
        "data_type": "numeric",
        "index": "13",
        "is_ignore": "false",
        "is_row_identifier": "false",
        "is_target": "false",
        "name": "nAT",
        "number_of_missing_values": "0"
      },
      {
        "data_type": "numeric",
        "index": "14",
        "is_ignore": "false",
        "is_row_identifier": "false",
        "is_target": "false",
        "name": "nB",
        "number_of_missing_values": "0"
      },
      {
        "data_type": "numeric",
        "index": "15",
        "is_ignore": "false",
        "is_row_identifier": "false",
        "is_target": "false",
        "name": "nBM",
        "number_of_missing_values": "0"
      },
      {
        "data_type": "numeric",
        "index": "16",
        "is_ignore": "false",
        "is_row_identifier": "false",
        "is_target": "true",
        "name": "pXC50",
        "number_of_missing_values": "0"
      }
    ]
  }
}