"molecule_id","Eig04_EA.dm.","SaaNH","SpMAD_EA.ri.","ATS4e","ATS5v","D.Dtr09","Eig03_EA.dm.","nRCONR2","Eig11_AEA.dm.","ATS2v","ATS3e","ATS5p","ATS6e","ATS6i","ATSC5p","ATSC5v","ATSC6m","Eig08_AEA.ri.","Eig14_EA.ed.","SM09_AEA.ri.","TIC4","TIC5","X5v","nCIC","ATSC4v","SsssN","CATS2D_07_AL","GATS6s","GNar","HNar","X0A","C.008","ATS6v","ATSC3p","ATSC3v","ATSC4p","ATSC5i","ATSC6p","ATSC6v","ATSC7p","Eig08_EA.ri.","Eig10_AEA.ri.","Eig13_AEA.ri.","Eig13_EA","Eig13_EA.ri.","Eig14_AEA.ri.","Eig14_EA","Eig14_EA.ri.","IC5","Psi_i_1","SM02_EA.ri.","SM07_AEA.dm.","SM08_AEA.dm.","SNar","SpAD_EA.ri.","SpMaxA_AEA.dm.","X2sol","X3sol","X3v","Xt","MAXDP","ATSC3i","X2v","pXC50"
{3 1.418,4 4.6,5 3.92,6 70.859,9 0.7,10 3.704,11 4.587,12 3.984,13 4.785,14 4.982,15 7.646,16 9.953,17 30.416,18 2,19 -1.566,20 -1.566,21 208.31,22 208.31,23 2.3,24 3,25 8.966,27 7,28 0.833,29 1.982,30 1.789,31 0.728,33 3.919,34 5.89,35 8.145,36 6.333,37 1.345,38 9.403,39 12.067,40 9.531,41 0.997,42 1.421,43 0.512,44 -0.45,45 -0.431,46 0.349,47 -0.584,48 -0.538,49 4.844,50 13.617,51 4.238,52 -0.45,53 -0.584,54 16.414,55 36.873,56 0.166,57 12.571,58 8.67,59 4.147,60 0.247,61 4.708,62 1.202,63 7.327,64 7.164}
{0 CHEMBL1086110,3 1.416,4 4.475,5 3.691,6 54.726,9 -0.122,10 3.565,11 4.402,12 3.791,13 4.572,14 4.839,15 6.752,16 10.023,17 22.431,18 1.856,19 -2.305,20 -2.305,21 170.402,22 176.402,23 1.775,24 3,25 8.689,27 4,28 0.974,29 2.048,30 1.875,31 0.714,33 3.549,34 5.078,35 7.928,36 5.643,37 1.106,38 7.352,39 11.125,40 6.593,41 0.858,42 0.808,43 0.105,44 -0.85,45 -0.791,46 0.065,47 -0.878,48 -0.835,49 4.642,50 11.486,51 4.055,52 -0.85,53 -0.878,54 14.334,55 31.15,56 0.157,57 8.641,58 7.54,59 3.476,60 0.264,61 1.735,62 1.059,63 4.941,64 6.135}
{0 CHEMBL1221434,3 1.423,4 5.092,5 4.193,7 0.302,9 1.247,10 4.113,11 4.969,12 4.27,13 4.974,14 5.16,15 13.783,16 17.652,17 31.081,18 2.765,19 1.881,20 1.881,21 328.265,22 328.265,23 2.782,24 4,25 19.815,27 3,28 0.787,29 2.052,30 1.915,31 0.71,33 4.173,34 12.904,35 16.047,36 14.819,37 1.915,38 12.928,39 15.98,40 13.319,41 1.61,42 2.386,43 1.858,44 0.907,45 0.856,46 1.748,47 0.771,48 0.75,49 5.381,50 19.408,51 4.571,52 0.907,53 0.771,54 24.444,55 52.633,56 0.094,57 14.474,58 11.018,59 5.489,60 0.202,61 4.691,62 1.708,63 8.87,64 4.022}
{0 CHEMBL1520,3 1.415,4 5.206,5 4.284,6 140.253,7 0.4,9 1.314,10 4.111,11 5.099,12 4.363,13 5.179,14 5.401,15 12.92,16 18.901,17 45.48,18 2.662,19 1.664,20 1.664,21 349.91,22 349.91,23 4.029,24 4,25 18.464,26 3.737,27 8,28 0.742,29 2.018,30 1.846,31 0.719,33 4.255,34 12.96,35 17.161,36 13.702,37 2.003,38 13.858,39 19.406,40 13.586,41 1.609,42 2.352,43 1.967,44 1,45 0.955,46 1.893,47 0.929,48 0.892,49 5.302,50 20.133,51 4.563,52 1,53 0.929,54 23.868,55 52.338,56 0.128,57 16.2,58 14.167,59 7.99,60 0.205,61 6.418,62 1.927,63 10.25,64 6.886}
{0 CHEMBL1650673,1 0.527,2 3.472,3 1.473,4 4.914,5 4.175,6 209.588,7 1.195,9 1.424,10 4.001,11 4.805,12 4.23,13 4.92,14 5.101,15 10.614,16 12.154,17 32.934,18 2.679,19 0.12,20 0.12,21 238.379,22 238.379,23 3.637,24 5,25 11.481,26 2.98,27 9,28 0.911,29 2.133,30 1.953,31 0.699,32 2,33 4.185,34 9.783,35 11.652,36 10.544,37 1.508,38 11.743,39 14.168,40 11.148,41 1.603,42 2.296,43 1.448,44 0.49,45 0.458,46 0.965,47 0.048,48 0.039,49 5.297,50 17.39,51 4.5,52 0.49,53 0.048,54 21.213,55 47.144,56 0.13,57 13.455,58 12.311,59 6.27,60 0.217,61 6.116,62 1.412,63 7.967,64 5.699}
{0 CHEMBL1650676,1 0.527,2 3.472,3 1.473,4 4.914,5 4.175,6 209.588,7 1.195,9 1.424,10 4.001,11 4.805,12 4.23,13 4.92,14 5.101,15 10.614,16 12.154,17 32.934,18 2.679,19 0.12,20 0.12,21 238.379,22 238.379,23 3.637,24 5,25 11.481,26 2.98,27 9,28 0.911,29 2.133,30 1.953,31 0.699,32 2,33 4.185,34 9.783,35 11.652,36 10.544,37 1.508,38 11.743,39 14.168,40 11.148,41 1.603,42 2.296,43 1.448,44 0.49,45 0.458,46 0.965,47 0.048,48 0.039,49 5.297,50 17.39,51 4.5,52 0.49,53 0.048,54 21.213,55 47.144,56 0.13,57 13.455,58 12.311,59 6.27,60 0.217,61 6.116,62 1.412,63 7.967,64 4.886}
{0 CHEMBL1650866,1 0.666,2 3.49,3 1.464,4 5.001,5 4.26,6 141.793,7 1.214,8 2,9 1.424,10 4.039,11 4.886,12 4.325,13 5.021,14 5.209,15 12.71,16 15.457,17 37.097,18 2.705,19 0.374,20 0.374,21 257.323,22 257.323,23 3.839,24 5,25 14.127,26 3.338,27 12,28 1.104,29 2.128,30 1.955,31 0.699,32 2,33 4.261,34 10.627,35 12.921,36 12.177,37 1.711,38 12.95,39 15.66,40 12.495,41 1.605,42 2.296,43 1.45,44 0.492,45 0.461,46 1.178,47 0.181,48 0.174,49 5.361,50 18.052,51 4.525,52 0.492,53 0.181,54 21.907,55 48.322,56 0.123,57 13.905,58 12.481,59 6.544,60 0.214,61 6.188,62 1.544,63 8.348,64 6.983}
{0 CHEMBL1778033,1 0.671,3 1.489,4 5.242,5 4.471,6 359.157,7 0.68,9 1.659,10 4.3,11 5.144,12 4.537,13 5.286,14 5.496,15 14.29,16 19.987,17 42.582,18 2.937,19 2.681,20 2.681,21 350.665,22 364.175,23 4.528,24 7,25 19.731,26 4.08,27 24,28 1.571,29 2.239,30 2.145,31 0.675,33 4.542,34 13.395,35 18.708,36 14.072,37 2.462,38 14.668,39 20.004,40 16.86,41 1.882,42 2.546,43 2.15,44 1.187,45 1.137,46 2,47 1,48 1,49 5.518,50 23.683,51 4.795,52 1.187,53 1,54 29.819,55 64.017,56 0.093,57 16.6,58 15.27,59 7.971,60 0.183,61 6.852,62 2.197,63 10.17,64 6.854}
{0 CHEMBL1911559,1 0.86,3 1.436,4 5.061,5 4.22,7 0.916,9 1.662,10 4.138,11 5.006,12 4.272,13 4.986,14 5.174,15 12.952,16 16.089,17 32.416,18 2.747,19 2.275,20 2.275,21 309.763,22 309.763,23 3.062,24 5,25 14.98,26 3.703,27 7,28 1.169,29 2.103,30 1.964,31 0.701,33 4.192,34 11.552,35 13.27,36 12.716,37 1.782,38 11.939,39 13.76,40 10.123,41 1.678,42 2.526,43 2.009,44 1.044,45 1,46 2,47 1,48 0.991,49 5.341,50 20.689,51 4.663,52 1.044,53 1,54 26.759,55 57.437,56 0.095,57 15.785,58 13.667,59 6.453,60 0.193,61 6.486,62 1.874,63 8.79,64 6}
{0 CHEMBL1911572,1 0.8,3 1.43,4 5.06,5 4.241,7 0.916,9 1.66,10 4.099,11 4.975,12 4.319,13 5.053,14 5.273,15 14.109,16 18.219,17 37.824,18 2.747,19 1.449,20 1.449,21 309.566,22 309.566,23 2.68,24 4,25 15.289,26 3.688,27 7,28 1.083,29 2.024,30 1.858,31 0.717,33 4.194,34 11.293,35 13.803,36 12.724,37 1.886,38 13.208,39 16.57,40 10.441,41 1.575,42 2.467,43 2,44 1,45 1,46 1.591,47 0.618,48 0.6,49 5.247,50 19.638,51 4.62,52 1,53 0.618,54 24.679,55 54.341,56 0.1,57 14.963,58 13.066,59 6.206,60 0.201,61 6.467,62 1.845,63 8.363,64 5.301}
{0 CHEMBL1915888,3 1.453,4 4.624,5 3.935,6 65.3,9 0.907,10 3.766,11 4.487,12 4.01,13 4.686,14 4.914,15 7.998,16 11.132,17 23.4,18 2.414,19 -1.138,20 -1.138,21 201.458,22 207.458,23 2.152,24 4,25 9.535,27 8,28 0.884,29 2.11,30 1.946,31 0.702,33 3.884,34 6.103,35 8.243,36 6.901,37 1.366,38 8.681,39 12.123,40 8.275,41 1.414,42 1.843,43 0.782,44 -0.178,45 -0.174,46 0.545,47 -0.414,48 -0.395,49 4.939,50 13.953,51 4.3,52 -0.178,53 -0.414,54 17.918,55 39.244,56 0.128,57 10.681,58 9.528,59 4.318,60 0.236,61 1.829,62 1.209,63 5.913,64 5.62}
{0 CHEMBL1915891,3 1.404,4 4.534,5 3.936,6 68.9,9 0.919,10 3.785,11 4.448,12 4.001,13 4.599,14 4.8,15 7.062,16 8.293,17 20.549,18 2.539,19 -1.127,20 -1.127,21 185.866,22 191.866,23 2.486,24 4,25 6.407,27 7,28 0.813,29 2.081,30 1.899,31 0.709,33 3.889,34 5.744,35 6.143,36 5.995,37 1.138,38 7.941,39 9.677,40 7.732,41 1.406,42 1.842,43 0.794,44 -0.118,45 -0.107,46 0.554,47 -0.394,48 -0.365,49 4.92,50 14.264,51 4.289,52 -0.118,53 -0.394,54 18.323,55 39.304,56 0.124,57 12.094,58 10.491,59 4.666,60 0.234,61 2.306,62 1.077,63 6.566,64 6}
{0 CHEMBL1915892,3 1.416,4 4.541,5 3.901,6 69.914,9 0.955,10 3.764,11 4.457,12 3.96,13 4.601,14 4.808,15 7.153,16 8.501,17 20.653,18 2.441,19 -1.14,20 -1.14,21 185.866,22 191.866,23 2.182,24 4,25 6.356,27 6,28 0.496,29 2.081,30 1.899,31 0.709,33 3.85,34 5.762,35 5.943,36 6.002,37 1.208,38 7.808,39 9.855,40 7.77,41 1.301,42 1.869,43 0.789,44 -0.123,45 -0.111,46 0.542,47 -0.411,48 -0.347,49 4.92,50 14.156,51 4.305,52 -0.123,53 -0.411,54 18.323,55 39.64,56 0.124,57 11.052,58 9.886,59 4.417,60 0.234,61 5.448,62 1.252,63 6.13,64 6}
{0 CHEMBL1915896,3 1.473,4 4.645,5 3.958,6 73.997,9 1.057,10 3.802,11 4.527,12 4.013,13 4.708,14 4.931,15 8.061,16 10.637,17 23.333,18 2.453,19 -1.115,20 -1.115,21 211.065,22 217.065,23 2.18,24 4,25 8.254,27 7,28 0.683,29 2.078,30 1.902,31 0.709,33 3.898,34 6.043,35 7.5,36 6.503,37 1.358,38 8.234,39 11.203,40 7.885,41 1.441,42 1.999,43 0.802,44 -0.116,45 -0.106,46 0.573,47 -0.384,48 -0.367,49 5.048,50 14.68,51 4.383,52 -0.116,53 -0.384,54 19.016,55 42.731,56 0.121,57 11.687,58 10.104,59 4.338,60 0.229,61 4.559,62 1.25,63 6.043,64 5.551}
{0 CHEMBL1915906,3 1.433,4 4.518,5 3.871,6 62.217,9 0.739,10 3.732,11 4.378,12 3.963,13 4.577,14 4.787,15 7.354,16 9.181,17 24.917,18 1.975,19 -1.315,20 -1.315,21 181.111,22 187.111,23 2.371,24 4,25 8.236,27 6,28 0.838,29 2.115,30 1.944,31 0.702,33 3.804,34 5.555,35 6.677,36 7.144,37 1.254,38 9.061,39 11.008,40 8.215,41 0.928,42 1.638,43 0.562,44 -0.389,45 -0.368,46 0.36,47 -0.574,48 -0.53,49 4.798,50 13.499,51 4.232,52 -0.389,53 -0.574,54 17.224,55 37.258,56 0.133,57 10.885,58 10.001,59 5.01,60 0.241,61 1.812,62 1.136,63 6.447,64 5.821}
{0 CHEMBL1915910,3 1.463,4 4.723,5 4.009,6 69.099,9 0.966,10 3.789,11 4.533,12 4.083,13 4.871,14 5.133,15 8.595,16 12.772,17 29.966,18 2.603,19 -1.142,20 -1.142,21 212.604,22 218.604,23 2.189,24 4,25 10.624,27 8,28 0.767,29 2.057,30 1.852,31 0.715,33 3.955,34 5.331,35 7.875,36 7.341,37 1.524,38 9.57,39 14.45,40 8.138,41 1.567,42 1.874,43 0.791,44 -0.129,45 -0.118,46 0.541,47 -0.415,48 -0.395,49 4.858,50 14.408,51 4.355,52 -0.129,53 -0.415,54 18.035,55 40.953,56 0.125,57 11.383,58 10.2,59 4.665,60 0.235,61 1.85,62 1.317,63 6.268,64 5}
{0 CHEMBL1915912,3 1.431,4 4.546,5 3.915,6 66.133,9 0.822,10 3.757,11 4.418,12 4.004,13 4.698,14 4.937,15 7.704,16 9.778,17 29.406,18 2.446,19 -1.298,20 -1.298,21 189.885,22 195.885,23 2.656,24 4,25 8.543,27 7,28 0.859,29 2.085,30 1.895,31 0.709,33 3.855,34 5.673,35 6.564,36 7.297,37 1.328,38 9.574,39 12.036,40 8.323,41 1.395,42 1.645,43 0.561,44 -0.389,45 -0.367,46 0.402,47 -0.547,48 -0.511,49 4.778,50 13.943,51 4.265,52 -0.389,53 -0.547,54 17.63,55 38.632,56 0.128,57 11.676,58 10.303,59 5.108,60 0.238,61 1.813,62 1.219,63 6.949,64 5.293}
{0 CHEMBL1916091,3 1.444,4 4.602,5 3.904,6 65.3,9 0.907,10 3.739,11 4.45,12 3.966,13 4.641,14 4.864,15 7.39,16 10.303,17 21.815,18 2.348,19 -1.138,20 -1.138,21 194.64,22 200.64,23 2.057,24 4,25 8.882,27 7,28 0.869,29 2.11,30 1.946,31 0.702,33 3.844,34 5.495,35 7.307,36 6.508,37 1.347,38 7.854,39 10.93,40 7.481,41 1.318,42 1.839,43 0.773,44 -0.178,45 -0.17,46 0.544,47 -0.414,48 -0.395,49 4.894,50 13.769,51 4.289,52 -0.178,53 -0.414,54 17.918,55 38.984,56 0.128,57 10.681,58 9.528,59 4.212,60 0.236,61 1.793,62 1.197,63 5.789,64 5}
{0 CHEMBL1916106,3 1.435,4 4.676,5 4.016,6 79.833,9 0.93,10 3.813,11 4.504,12 4.04,13 4.734,14 4.935,15 8.837,16 9.566,17 21.71,18 2.586,19 -1.044,20 -1.044,21 201.458,22 207.458,23 2.229,24 4,25 8.652,27 7,28 0.627,29 2.044,30 1.851,31 0.716,33 3.952,34 6.268,35 7.048,36 7.497,37 1.797,38 9.697,39 12.001,40 9.19,41 1.557,42 1.999,43 0.803,44 -0.164,45 -0.158,46 0.564,47 -0.379,48 -0.343,49 4.939,50 15.019,51 4.386,52 -0.164,53 -0.379,54 19.304,55 43.052,56 0.148,57 10.681,58 9.528,59 4.365,60 0.228,61 4.657,62 1.406,63 6.291,64 5.277}
{0 CHEMBL1916108,3 1.464,4 4.706,5 3.975,6 74.293,9 0.918,10 3.816,11 4.516,12 4.017,13 4.696,14 4.897,15 8.043,16 9.46,17 20.482,18 2.458,19 -1.141,20 -1.141,21 194.64,22 200.64,23 2.257,24 4,25 8.521,27 3,28 0.536,29 2.046,30 1.846,31 0.717,33 3.947,34 6.482,35 7.319,36 7.822,37 1.707,38 9.568,39 12.066,40 9.341,41 1.384,42 1.998,43 0.797,44 -0.171,45 -0.165,46 0.551,47 -0.413,48 -0.396,49 4.894,50 14.82,51 4.39,52 -0.171,53 -0.413,54 18.611,55 42.442,56 0.154,57 10.512,58 9.104,59 4.487,60 0.232,61 5.234,62 1.567,63 6.294,64 5.301}
{0 CHEMBL1916113,3 1.45,4 4.669,5 4.019,6 67.762,9 0.913,10 3.788,11 4.51,12 4.068,13 4.761,14 4.961,15 8.492,16 10.774,17 24.226,18 2.376,19 -1.096,20 -1.096,21 201.458,22 207.458,23 2.264,24 4,25 9.479,27 6,28 1.16,29 2.081,30 1.899,31 0.709,33 3.964,34 6.285,35 7.475,36 7.305,37 1.614,38 10.109,39 12.578,40 9.87,41 1.358,42 1.891,43 0.801,44 -0.167,45 -0.161,46 0.559,47 -0.403,48 -0.386,49 4.939,50 14.344,51 4.341,52 -0.167,53 -0.403,54 18.323,55 40.613,56 0.125,57 10.597,58 9.555,59 4.416,60 0.234,61 6.181,62 1.359,63 6.068,64 5}
{0 CHEMBL1916114,3 1.449,4 4.643,5 4.012,6 67.762,9 0.913,10 3.784,11 4.515,12 4.06,13 4.757,14 4.959,15 8.525,16 10.955,17 24.282,18 2.403,19 -1.096,20 -1.096,21 201.458,22 207.458,23 2.274,24 4,25 9.228,27 5,28 1.183,29 2.081,30 1.899,31 0.709,33 3.952,34 6.048,35 7.21,36 7.234,37 1.613,38 9.777,39 12.168,40 9.529,41 1.398,42 1.892,43 0.801,44 -0.167,45 -0.161,46 0.56,47 -0.403,48 -0.387,49 4.939,50 14.335,51 4.339,52 -0.167,53 -0.403,54 18.323,55 40.583,56 0.125,57 10.597,58 9.555,59 4.402,60 0.234,61 6.179,62 1.362,63 6.014,64 5.658}
{0 CHEMBL1916123,3 1.437,4 4.75,5 4.088,6 72.258,9 1.009,10 3.831,11 4.557,12 4.144,13 4.843,14 5.027,15 9.432,16 13.066,17 26.832,18 2.348,19 -0.394,20 -0.394,21 218.309,22 230.309,23 2.377,24 4,25 11.537,27 8,28 1.104,29 2.078,30 1.902,31 0.709,33 4.058,34 6.679,35 8.708,36 8.445,37 1.59,38 10.114,39 13.167,40 10.825,41 1.318,42 1.91,43 0.83,44 -0.095,45 -0.086,46 0.781,47 -0.173,48 -0.166,49 5.007,50 14.862,51 4.363,52 -0.095,53 -0.173,54 19.016,55 41.673,56 0.12,57 11.412,58 10.262,59 4.679,60 0.229,61 2.061,62 1.267,63 6.29,64 5.312}
{0 CHEMBL1916124,3 1.437,4 4.751,5 4.1,6 72.258,9 1.009,10 3.831,11 4.557,12 4.162,13 4.867,14 5.056,15 9.688,16 13.193,17 27.687,18 2.376,19 -0.394,20 -0.394,21 218.309,22 230.309,23 2.382,24 4,25 11.313,27 10,28 1.037,29 2.078,30 1.902,31 0.709,33 4.072,34 6.679,35 8.708,36 8.229,37 1.585,38 10.721,39 14.013,40 11.169,41 1.358,42 1.897,43 0.83,44 -0.095,45 -0.086,46 0.78,47 -0.173,48 -0.166,49 5.007,50 14.862,51 4.363,52 -0.095,53 -0.173,54 19.016,55 41.675,56 0.12,57 11.412,58 10.262,59 4.66,60 0.229,61 2.064,62 1.267,63 6.29,64 5.475}
{0 CHEMBL1916125,3 1.436,4 4.727,5 4.094,6 72.258,9 1.009,10 3.827,11 4.561,12 4.154,13 4.864,14 5.055,15 9.685,16 13.333,17 27.728,18 2.403,19 -0.394,20 -0.394,21 218.309,22 230.309,23 2.391,24 4,25 11.09,27 8,28 1.077,29 2.078,30 1.902,31 0.709,33 4.062,34 6.426,35 8.441,36 8.195,37 1.583,38 10.373,39 13.606,40 10.825,41 1.398,42 1.899,43 0.83,44 -0.095,45 -0.086,46 0.781,47 -0.173,48 -0.166,49 5.007,50 14.853,51 4.361,52 -0.095,53 -0.173,54 19.016,55 41.644,56 0.12,57 11.412,58 10.262,59 4.647,60 0.229,61 2.061,62 1.274,63 6.236,64 5.629}
{0 CHEMBL1916130,3 1.447,4 4.804,5 4.123,6 81.252,9 1.013,10 3.873,11 4.584,12 4.142,13 4.881,14 5.065,15 9.144,16 10.956,17 24.334,18 2.459,19 -0.391,20 -0.391,21 217.359,22 223.359,23 2.448,24 4,25 9.544,27 6,28 0.666,29 2.022,30 1.816,31 0.722,33 4.12,34 7,35 7.79,36 8.638,37 1.887,38 11.158,39 13.259,40 11.826,41 1.388,42 2.24,43 0.898,44 -0.027,45 -0.025,46 0.797,47 -0.169,48 -0.163,49 4.964,50 15.712,51 4.445,52 -0.027,53 -0.169,54 19.709,55 44.854,56 0.144,57 11.243,58 9.822,59 4.778,60 0.225,61 5.495,62 1.642,63 6.637,64 6.301}
{0 CHEMBL1916131,3 1.434,4 4.66,5 4.027,6 68.554,9 0.951,10 3.808,11 4.502,12 4.112,13 4.717,14 4.905,15 8.834,16 11.445,17 29.48,18 2.376,19 -1.011,20 -1.011,21 201.458,22 207.458,23 2.449,24 4,25 9.599,27 7,28 1.028,29 2.081,30 1.899,31 0.709,33 3.976,34 6.253,35 7.638,36 7.485,37 1.372,38 10.095,39 13.042,40 9.307,41 1.356,42 1.886,43 0.803,44 -0.164,45 -0.158,46 0.581,47 -0.374,48 -0.335,49 4.939,50 14.452,51 4.326,52 -0.164,53 -0.374,54 18.323,55 40.158,56 0.125,57 11.592,58 10.264,59 4.717,60 0.234,61 2.352,62 1.165,63 6.477,64 6}
{0 CHEMBL1916132,3 1.448,4 4.718,5 4.053,6 77.547,9 0.969,10 3.852,11 4.531,12 4.082,13 4.713,14 4.894,15 8.428,16 8.883,17 22.714,18 2.459,19 -1.013,20 -1.013,21 194.64,22 200.64,23 2.527,24 4,25 8.046,27 3,28 0.577,29 2.022,30 1.81,31 0.723,33 4.003,34 6.513,35 6.763,36 8.024,37 1.613,38 9.82,39 11.762,40 9.537,41 1.386,42 2.164,43 0.803,44 -0.164,45 -0.158,46 0.581,47 -0.372,48 -0.33,49 4.894,50 15.302,51 4.41,52 -0.164,53 -0.372,54 19.016,55 43.447,56 0.149,57 11.422,58 9.824,59 4.835,60 0.229,61 5.356,62 1.533,63 6.823,64 6}
{0 CHEMBL192,1 0.779,3 1.435,4 5.174,5 4.24,6 134.097,7 0.8,9 1.317,10 4.087,11 5.055,12 4.305,13 5.109,14 5.312,15 11.932,16 16.925,17 42.386,18 2.692,19 1.664,20 1.664,21 329.549,22 329.549,23 4.08,24 4,25 17.934,26 3.591,27 7,28 0.803,29 2.018,30 1.842,31 0.72,33 4.229,34 13.054,35 16.653,36 13.512,37 1.865,38 13.452,39 18.027,40 13.005,41 1.657,42 2.312,43 1.965,44 1,45 0.952,46 1.907,47 0.929,48 0.905,49 5.231,50 19.545,51 4.564,52 1,53 0.929,54 23.175,55 51.646,56 0.131,57 16.031,58 13.758,59 7.75,60 0.208,61 6.329,62 1.858,63 10.168,64 5.523}
{0 CHEMBL1939912,2 3.05,3 1.461,4 4.813,5 3.953,6 71.545,7 0.172,9 0.823,10 3.832,11 4.702,12 4.038,13 4.816,14 5.03,15 9.346,16 13.588,17 27.289,18 2.363,19 -1.279,20 -1.279,21 231.819,22 231.819,23 2.429,24 4,25 14.235,26 2.292,27 3,28 0.673,29 2.11,30 1.946,31 0.702,32 1,33 3.972,34 8.502,35 12.095,36 9.537,37 1.425,38 9.502,39 14.026,40 9.655,41 1.347,42 1.701,43 0.707,44 -0.263,45 -0.253,46 0.517,47 -0.463,48 -0.451,49 5.04,50 14.674,51 4.312,52 -0.263,53 -0.463,54 17.918,55 39.447,56 0.127,57 10.862,58 9.391,59 4.918,60 0.236,61 3.853,62 1.335,63 6.641,64 5.721}
{0 CHEMBL1939914,1 0.172,2 3.078,3 1.433,4 4.801,5 3.964,6 70.796,7 0.86,9 0.904,10 3.806,11 4.666,12 4.058,13 4.809,14 5.018,15 9.915,16 14.573,17 26.982,18 2.246,19 -1.202,20 -1.202,21 217.819,22 217.819,23 2.502,24 4,25 14.459,26 2.43,27 2,28 0.927,29 2.135,30 2,31 0.695,33 3.974,34 8.147,35 11.605,36 9.753,37 1.469,38 9.453,39 13.916,40 9.843,41 1.195,42 1.806,43 0.738,44 -0.226,45 -0.216,46 0.532,47 -0.444,48 -0.431,49 4.735,50 14.446,51 4.275,52 -0.226,53 -0.444,54 18.205,55 38.683,56 0.127,57 10.582,58 9.312,59 4.774,60 0.234,61 1.987,62 1.318,63 6.352,64 4.836}
{0 CHEMBL1939915,1 0.172,2 3.087,3 1.439,4 4.893,5 4.028,6 74.934,7 0.86,9 0.904,10 3.86,11 4.752,12 4.137,13 4.914,14 5.147,15 10.986,16 16.232,17 30.83,18 2.391,19 -0.922,20 -0.922,21 248.101,22 248.101,23 2.623,24 4,25 15.875,26 2.448,27 2,28 0.856,29 2.105,30 1.948,31 0.702,32 1,33 4.031,34 8.874,35 12.687,36 10.553,37 1.585,38 10.609,39 15.892,40 10.46,41 1.379,42 1.808,43 0.738,44 -0.223,45 -0.213,46 0.542,47 -0.401,48 -0.373,49 5.063,50 15.125,51 4.324,52 -0.223,53 -0.401,54 18.611,55 40.299,56 0.123,57 11.216,58 9.633,59 4.995,60 0.232,61 2.193,62 1.407,63 6.88,64 5.18}
{0 CHEMBL1939916,1 0.172,2 3.058,3 1.425,4 4.927,5 4.059,6 79.362,7 0.86,9 1.045,10 3.879,11 4.785,12 4.154,13 4.954,14 5.177,15 11.084,16 16.287,17 32.05,18 2.399,19 -0.564,20 -0.564,21 257.928,22 257.928,23 2.681,24 4,25 15.846,26 2.319,27 2,28 0.95,29 2.101,30 1.95,31 0.702,32 1,33 4.058,34 9.042,35 12.806,36 10.661,37 1.61,38 10.785,39 15.951,40 10.7,41 1.387,42 1.808,43 1.103,44 0.19,45 0.173,46 0.738,47 -0.226,48 -0.216,49 5.159,50 15.553,51 4.345,52 0.19,53 -0.226,54 19.304,55 41.311,56 0.119,57 11.385,58 10.057,59 5.097,60 0.228,61 3.441,62 1.427,63 6.874,64 5.921}
{0 CHEMBL1940053,1 0.172,2 3.09,3 1.417,4 4.93,5 4.012,6 73.888,7 0.86,9 0.918,10 3.853,11 4.772,12 4.12,13 4.868,14 5.084,15 10.933,16 16.268,17 29.082,18 2.356,19 -0.921,20 -0.921,21 248.856,22 248.856,23 2.631,24 4,25 16.419,26 2.461,27 4,28 0.913,29 2.13,30 2,31 0.696,33 4.025,34 9.132,35 13.179,36 10.989,37 1.569,38 10.149,39 15.078,40 10.648,41 1.329,42 1.817,43 0.868,44 -0.081,45 -0.077,46 0.603,47 -0.364,48 -0.35,49 5.079,50 15.112,51 4.302,52 -0.081,53 -0.364,54 18.898,55 39.68,56 0.123,57 10.936,58 9.562,59 4.985,60 0.23,61 2.109,62 1.446,63 6.706,64 5.796}
{0 CHEMBL1940056,2 3.057,3 1.436,4 4.901,5 3.929,6 69.119,7 0.172,9 0.698,10 3.82,11 4.745,12 4.027,13 4.79,14 5.016,15 9.689,16 14.288,17 26.97,18 2.356,19 -1,20 -1,21 232.574,22 232.574,23 2.486,24 4,25 15.64,26 2.41,27 3,28 0.958,29 2.135,30 2,31 0.695,33 3.927,34 8.878,35 12.682,36 10.39,37 1.438,38 9.103,39 13.554,40 9.288,41 1.329,42 1.805,43 0.628,44 -0.335,45 -0.32,46 0.512,47 -0.445,48 -0.402,49 5.056,50 14.637,51 4.285,52 -0.335,53 -0.445,54 18.205,55 38.768,56 0.127,57 10.766,58 9.123,59 4.755,60 0.234,61 4.094,62 1.399,63 6.538,64 5.31}
{0 CHEMBL1940057,1 0.86,2 3.102,3 1.387,4 5.031,5 4.121,6 89.97,7 0.86,9 1.369,10 3.941,11 4.899,12 4.221,13 4.994,14 5.206,15 12.101,16 17.977,17 33.354,18 2.479,19 -0.068,20 -0.068,21 294.947,22 294.947,23 2.736,24 4,25 18.268,26 2.46,27 6,28 0.887,29 2.115,30 2,31 0.697,33 4.161,34 10.24,35 14.86,36 12.133,37 1.709,38 11.6,39 17.176,40 12.403,41 1.403,42 2.197,43 1.308,44 0.373,45 0.347,46 0.916,47 -0.03,48 -0.028,49 5.267,50 16.652,51 4.361,52 0.373,53 -0.03,54 20.978,55 43.004,56 0.111,57 12.023,58 10.201,59 5.305,60 0.218,61 2.414,62 1.569,63 7.343,64 5.638}
{0 CHEMBL1940058,1 0.172,2 3.108,3 1.424,4 5.026,5 4.13,6 84.077,7 0.86,9 0.932,10 3.941,11 4.918,12 4.242,13 5.026,14 5.258,15 12.226,16 18.121,17 34.733,18 2.536,19 -0.696,20 -0.696,21 278.955,22 278.955,23 2.705,24 4,25 18.445,26 2.471,27 6,28 0.825,29 2.097,30 1.952,31 0.702,32 1,33 4.165,34 10.444,35 15.195,36 12.227,37 1.735,38 12.244,39 18.362,40 12.527,41 1.483,42 2.197,43 0.938,44 -0.005,45 -0.005,46 0.682,47 -0.261,48 -0.244,49 5.072,50 16.422,51 4.37,52 -0.005,53 -0.261,54 19.997,55 42.718,56 0.115,57 12.157,58 9.79,59 5.121,60 0.224,61 2.507,62 1.586,63 7.668,64 5}
{0 CHEMBL200906,1 0.311,3 1.472,4 4.374,5 3.514,6 134.768,7 0.678,8 1,9 0.618,10 3.641,11 4.29,12 3.526,13 4.188,14 4.333,15 6.206,16 6.161,17 12.159,18 2.102,19 -1.95,20 -1.95,21 155.245,22 155.245,23 1.87,24 4,25 5.842,26 1.492,27 3,28 1.354,29 2.148,30 2,31 0.694,33 3.398,34 5.365,35 4.647,36 6.004,37 0.87,38 4.968,39 4.307,40 4.971,41 1.101,42 1.449,43 0.521,44 -0.459,45 -0.443,46 0.276,47 -0.707,48 -0.691,49 4.851,50 12.687,51 4.245,52 -0.459,53 -0.707,54 16.819,55 36.809,56 0.165,57 10.519,58 9.576,59 4.311,60 0.244,61 5.455,62 0.886,63 5.766,64 4.936}
{0 CHEMBL2012207,1 0.522,3 1.437,4 4.849,5 4.044,7 0.86,9 1.311,10 3.985,11 4.761,12 4.028,13 4.807,14 4.966,15 9.207,16 10.046,17 23.078,18 2.493,19 0.948,20 0.948,21 272.913,22 272.913,23 2.245,24 4,25 9.828,27 7,28 0.882,29 2.036,30 1.877,31 0.715,33 4.016,34 8.913,35 10.443,36 9.179,37 1.729,38 9.189,39 10.081,40 9.204,41 1.49,42 2.307,43 1.916,44 0.971,45 0.911,46 1.423,47 0.507,48 0.456,49 5.248,50 17.909,51 4.563,52 0.971,53 0.507,54 23.463,55 51.737,56 0.124,57 12.778,58 11.17,59 4.955,60 0.206,61 5.715,62 1.672,63 7.069,64 5.319}
{0 CHEMBL2012208,1 0.522,3 1.432,4 4.86,5 4.051,7 0.86,9 1.311,10 3.999,11 4.778,12 4.027,13 4.82,14 4.975,15 9.222,16 9.782,17 22.206,18 2.892,19 1.125,20 1.125,21 272.913,22 272.913,23 2.28,24 4,25 9.224,27 6,28 0.881,29 2.018,30 1.846,31 0.719,33 4.025,34 8.993,35 9.736,36 9.23,37 1.765,38 9.224,39 9.595,40 9.232,41 1.84,42 2.307,43 1.932,44 0.994,45 0.925,46 1.478,47 0.526,48 0.487,49 5.248,50 18.278,51 4.591,52 0.994,53 0.526,54 23.868,55 52.985,56 0.121,57 12.778,58 11.17,59 5.025,60 0.205,61 5.708,62 1.816,63 7.21,64 5.569}
{0 CHEMBL2012209,1 0.522,3 1.42,4 4.856,5 4.058,7 0.86,9 1.311,10 4.015,11 4.772,12 4.043,13 4.815,14 4.965,15 9.363,16 9.73,17 23.541,18 2.886,19 1.125,20 1.125,21 272.913,22 272.913,23 2.442,24 4,25 9.448,27 6,28 0.893,29 2.018,30 1.846,31 0.719,33 4.035,34 9.173,35 10.096,36 9.471,37 1.723,38 9.419,39 9.759,40 9.482,41 1.763,42 2.307,43 1.931,44 0.994,45 0.923,46 1.469,47 0.526,48 0.477,49 5.248,50 18.386,51 4.579,52 0.994,53 0.526,54 23.868,55 52.542,56 0.121,57 13.808,58 11.869,59 5.277,60 0.205,61 5.756,62 1.648,63 7.646,64 5.569}
{0 CHEMBL2012212,1 0.522,3 1.433,4 4.86,5 4.054,7 0.86,9 1.373,10 3.999,11 4.778,12 4.026,13 4.815,14 4.971,15 9.26,16 9.392,17 22.082,18 2.86,19 0.966,20 0.966,21 280.913,22 280.913,23 2.255,24 4,25 9.263,27 6,28 0.842,29 2.018,30 1.846,31 0.719,33 4.024,34 8.993,35 9.736,36 9.232,37 1.823,38 9.223,39 9.662,40 9.227,41 1.81,42 2.308,43 1.917,44 0.971,45 0.912,46 1.424,47 0.507,48 0.457,49 5.402,50 18.278,51 4.591,52 0.971,53 0.507,54 23.868,55 53.006,56 0.121,57 12.778,58 11.17,59 5.001,60 0.205,61 5.706,62 1.816,63 7.213,64 5.409}
{0 CHEMBL2012213,1 0.522,3 1.42,4 4.856,5 4.066,7 0.86,9 1.376,10 4.015,11 4.772,12 4.054,13 4.812,14 4.965,15 9.527,16 9.701,17 22.27,18 2.834,19 0.966,20 0.966,21 280.913,22 280.913,23 2.367,24 4,25 9.451,27 7,28 0.893,29 2.018,30 1.846,31 0.719,33 4.034,34 9.173,35 10.096,36 9.471,37 1.712,38 9.404,39 9.765,40 9.464,41 1.688,42 2.307,43 1.917,44 0.971,45 0.912,46 1.424,47 0.507,48 0.457,49 5.402,50 18.386,51 4.579,52 0.971,53 0.507,54 23.868,55 52.553,56 0.121,57 13.82,58 11.752,59 5.236,60 0.205,61 5.767,62 1.648,63 7.65,64 5.678}
{0 CHEMBL2012214,1 0.522,3 1.432,4 4.872,5 4.054,7 0.86,9 1.484,10 3.999,11 4.778,12 4.026,13 4.817,14 4.971,15 9.259,16 9.46,17 22.067,18 2.517,19 1.063,20 1.063,21 280.913,22 280.913,23 2.255,24 4,25 8.874,27 6,28 0.742,29 2.018,30 1.846,31 0.719,33 4.028,34 8.995,35 9.775,36 9.27,37 1.805,38 9.219,39 9.811,40 9.217,41 1.505,42 2.379,43 1.918,44 0.971,45 0.913,46 1.461,47 0.517,48 0.474,49 5.402,50 18.283,51 4.591,52 0.971,53 0.517,54 23.868,55 52.985,56 0.121,57 12.778,58 11.17,59 5.056,60 0.205,61 5.834,62 1.847,63 7.175,64 5.444}
{0 CHEMBL2012215,1 0.522,3 1.42,4 4.864,5 4.066,7 0.86,9 1.484,10 4.015,11 4.772,12 4.054,13 4.813,14 4.965,15 9.511,16 9.706,17 22.042,18 2.51,19 1.063,20 1.063,21 280.913,22 280.913,23 2.367,24 4,25 9.421,27 7,28 0.838,29 2.018,30 1.846,31 0.719,33 4.041,34 9.173,35 10.099,36 9.634,37 1.716,38 9.386,39 9.776,40 9.424,41 1.495,42 2.344,43 1.918,44 0.971,45 0.913,46 1.455,47 0.517,48 0.469,49 5.402,50 18.391,51 4.579,52 0.971,53 0.517,54 23.868,55 52.544,56 0.121,57 13.666,58 12.077,59 5.425,60 0.205,61 5.783,62 1.644,63 7.582,64 5.638}
{0 CHEMBL2012216,1 0.86,3 1.424,4 4.938,5 4.145,7 0.86,9 1.484,10 4.033,11 4.814,12 4.147,13 4.962,14 5.152,15 10.707,16 12.175,17 30.064,18 2.565,19 1.161,20 1.161,21 298.947,22 304.947,23 2.369,24 4,25 10.554,27 6,28 0.769,29 2.017,30 1.85,31 0.719,33 4.094,34 9.345,35 10.729,36 10.029,37 1.901,38 10.709,39 12.946,40 10.056,41 1.535,42 2.452,43 1.918,44 0.971,45 0.913,46 1.525,47 0.58,48 0.537,49 5.445,50 18.801,51 4.608,52 0.971,53 0.58,54 24.561,55 54.095,56 0.117,57 13.487,58 11.998,59 5.291,60 0.202,61 5.874,62 1.742,63 7.395,64 6.06}
{0 CHEMBL2012217,1 0.522,3 1.427,4 4.897,5 4.064,7 0.86,9 1.484,10 4.013,11 4.795,12 4.024,13 4.827,14 4.977,15 9.31,16 8.87,17 20.969,18 2.787,19 1.425,20 1.425,21 272.913,22 272.913,23 2.258,24 4,25 8.055,27 5,28 0.647,29 2.001,30 1.818,31 0.724,33 4.039,34 9.078,35 9.12,36 9.364,37 1.877,38 9.248,39 9.551,40 9.23,41 1.678,42 2.473,43 1.938,44 1.001,45 0.931,46 1.578,47 0.618,48 0.578,49 5.248,50 18.657,51 4.619,52 1.001,53 0.618,54 24.274,55 54.236,56 0.117,57 12.778,58 11.17,59 5.146,60 0.203,61 5.855,62 2.03,63 7.284,64 5.602}
{0 CHEMBL2012218,1 0.522,3 1.416,4 4.888,5 4.076,7 0.86,9 1.484,10 4.029,11 4.789,12 4.052,13 4.823,14 4.971,15 9.565,16 9.097,17 20.845,18 2.747,19 1.425,20 1.425,21 280.913,22 280.913,23 2.359,24 4,25 8.44,27 6,28 0.71,29 2.001,30 1.818,31 0.724,33 4.053,34 9.256,35 9.427,36 9.748,37 1.793,38 9.417,39 9.512,40 9.439,41 1.561,42 2.473,43 1.937,44 1.001,45 0.927,46 1.564,47 0.618,48 0.554,49 5.402,50 18.765,51 4.608,52 1.001,53 0.618,54 24.274,55 53.795,56 0.117,57 13.666,58 12.077,59 5.5,60 0.203,61 6.01,62 1.817,63 7.691,64 5.886}
{0 CHEMBL2012219,1 0.522,3 1.428,4 4.885,5 4.061,7 0.86,9 1.484,10 4.013,11 4.795,12 4.025,13 4.829,14 4.98,15 9.273,16 9.197,17 21.061,18 2.901,19 1.3,20 1.3,21 280.913,22 280.913,23 2.282,24 4,25 8.408,27 5,28 0.767,29 2.001,30 1.818,31 0.724,33 4.036,34 9.075,35 9.075,36 9.325,37 1.842,38 9.253,39 9.326,40 9.245,41 1.844,42 2.423,43 1.934,44 0.994,45 0.928,46 1.54,47 0.57,48 0.541,49 5.402,50 18.652,51 4.619,52 0.994,53 0.57,54 24.274,55 54.261,56 0.117,57 12.778,58 11.17,59 5.113,60 0.203,61 5.855,62 1.995,63 7.319,64 5.658}
{0 CHEMBL2012220,1 0.522,3 1.416,4 4.881,5 4.068,7 0.86,9 1.484,10 4.029,11 4.789,12 4.041,13 4.825,14 4.97,15 9.416,16 9.135,17 22.406,18 2.897,19 1.3,20 1.3,21 280.913,22 280.913,23 2.428,24 4,25 8.48,27 5,28 0.756,29 2.001,30 1.818,31 0.724,33 4.046,34 9.256,35 9.421,36 9.584,37 1.799,38 9.45,39 9.485,40 9.498,41 1.765,42 2.422,43 1.933,44 0.994,45 0.925,46 1.531,47 0.57,48 0.526,49 5.402,50 18.76,51 4.608,52 0.994,53 0.57,54 24.274,55 53.81,56 0.117,57 13.808,58 11.869,59 5.348,60 0.203,61 6.01,62 1.822,63 7.756,64 5.569}
{0 CHEMBL2012221,1 0.522,3 1.404,4 4.872,5 4.08,7 0.86,9 1.484,10 4.045,11 4.782,12 4.069,13 4.821,14 4.964,15 9.631,16 9.344,17 22.211,18 2.896,19 1.3,20 1.3,21 280.913,22 280.913,23 2.529,24 4,25 8.938,27 6,28 0.852,29 2.001,30 1.818,31 0.724,33 4.06,34 9.341,35 9.67,36 9.892,37 1.71,38 9.581,39 9.411,40 9.652,41 1.764,42 2.379,43 1.933,44 0.994,45 0.925,46 1.525,47 0.57,48 0.517,49 5.402,50 18.869,51 4.596,52 0.994,53 0.57,54 24.274,55 53.364,56 0.117,57 14.708,58 12.632,59 5.7,60 0.203,61 5.824,62 1.62,63 8.163,64 5.959}
{0 CHEMBL2012222,1 0.522,3 1.427,4 4.872,5 4.061,7 0.86,9 1.484,10 4.013,11 4.797,12 4.025,13 4.828,14 4.98,15 9.274,16 9.126,17 21.076,18 2.897,19 1.177,20 1.177,21 280.913,22 280.913,23 2.289,24 4,25 8.659,27 5,28 0.853,29 2.001,30 1.818,31 0.724,33 4.033,34 9.077,35 9.177,36 9.284,37 1.853,38 9.257,39 9.172,40 9.256,41 1.844,42 2.353,43 1.932,44 0.994,45 0.925,46 1.488,47 0.534,48 0.496,49 5.402,50 18.652,51 4.619,52 0.994,53 0.534,54 24.274,55 54.223,56 0.117,57 12.778,58 11.17,59 5.096,60 0.203,61 5.699,62 2.076,63 7.332,64 5.658}
{0 CHEMBL2012223,1 0.522,3 1.437,4 4.946,5 4.125,7 0.86,9 1.324,10 4.059,11 4.845,12 4.115,13 4.894,14 5.044,15 9.976,16 10.78,17 26.265,18 2.958,19 2.044,20 2.044,21 291.71,22 291.71,23 2.553,24 4,25 11.107,27 6,28 1.013,29 2.001,30 1.818,31 0.724,32 1,33 4.109,34 9.831,35 11.217,36 10.518,37 1.837,38 9.967,39 10.364,40 10.61,41 1.782,42 2.347,43 1.936,44 1,45 0.928,46 1.741,47 0.789,48 0.747,49 5.304,50 19.062,51 4.617,52 1,53 0.789,54 24.274,55 54.602,56 0.117,57 14.547,58 12.115,59 5.461,60 0.203,61 5.901,62 1.745,63 8.172,64 5.959}
{0 CHEMBL2012224,1 0.522,3 1.449,4 4.95,5 4.121,7 0.86,9 1.373,10 4.044,11 4.851,12 4.099,13 4.894,14 5.05,15 9.872,16 10.452,17 24.86,18 2.911,19 2.036,20 2.036,21 299.71,22 299.71,23 2.367,24 4,25 10.866,27 6,28 0.941,29 2.001,30 1.818,31 0.724,32 1,33 4.099,34 9.624,35 10.831,36 10.209,37 1.934,38 9.768,39 10.279,40 10.39,41 1.843,42 2.347,43 1.93,44 0.992,45 0.923,46 1.731,47 0.777,48 0.739,49 5.449,50 18.954,51 4.629,52 0.992,53 0.777,54 24.274,55 55.067,56 0.117,57 13.517,58 11.415,59 5.185,60 0.203,61 5.852,62 1.908,63 7.739,64 5.854}
{0 CHEMBL2012225,1 0.522,3 1.449,4 4.961,5 4.121,7 0.86,9 1.551,10 4.044,11 4.851,12 4.099,13 4.895,14 5.05,15 9.872,16 10.517,17 24.848,18 2.619,19 2.035,20 2.035,21 299.71,22 299.71,23 2.366,24 4,25 10.487,27 6,28 0.844,29 2.001,30 1.818,31 0.724,32 1,33 4.102,34 9.626,35 10.863,36 10.244,37 1.916,38 9.763,39 10.421,40 10.38,41 1.572,42 2.379,43 1.93,44 0.992,45 0.923,46 1.735,47 0.78,48 0.742,49 5.449,50 18.958,51 4.629,52 0.992,53 0.78,54 24.274,55 55.045,56 0.117,57 13.517,58 11.415,59 5.24,60 0.203,61 5.896,62 1.938,63 7.7,64 5.959}
{0 CHEMBL2012226,1 0.522,3 1.443,4 4.984,5 4.131,7 0.86,9 1.624,10 4.057,11 4.867,12 4.098,13 4.904,14 5.055,15 9.923,16 9.923,17 23.72,18 2.787,19 2.049,20 2.049,21 291.71,22 291.71,23 2.369,24 4,25 9.702,27 5,28 0.734,29 1.985,30 1.793,31 0.728,32 1,33 4.113,34 9.708,35 10.197,36 10.334,37 1.986,38 9.793,39 10.127,40 10.396,41 1.678,42 2.499,43 1.94,44 1.005,45 0.932,46 1.759,47 0.807,48 0.764,49 5.304,50 19.332,51 4.656,52 1.005,53 0.807,54 24.679,55 56.294,56 0.114,57 13.517,58 11.415,59 5.33,60 0.201,61 5.917,62 2.115,63 7.809,64 5.854}
{0 CHEMBL2012227,1 0.522,3 1.432,4 4.975,5 4.142,7 0.86,9 1.624,10 4.072,11 4.861,12 4.124,13 4.901,14 5.049,15 10.181,16 10.162,17 23.585,18 2.747,19 2.049,20 2.049,21 299.71,22 299.71,23 2.47,24 4,25 10.146,27 6,28 0.811,29 1.985,30 1.793,31 0.728,32 1,33 4.126,34 9.918,35 10.536,36 10.792,37 1.904,38 9.967,39 10.07,40 10.567,41 1.578,42 2.499,43 1.939,44 1.005,45 0.93,46 1.756,47 0.807,48 0.758,49 5.449,50 19.44,51 4.645,52 1.005,53 0.807,54 24.679,55 55.854,56 0.114,57 14.406,58 12.322,59 5.684,60 0.201,61 6.072,62 1.909,63 8.216,64 5.796}
{0 CHEMBL2012228,1 0.522,3 1.444,4 4.973,5 4.128,7 0.86,9 1.624,10 4.057,11 4.867,12 4.098,13 4.907,14 5.058,15 9.887,16 10.242,17 23.848,18 2.963,19 2.047,20 2.047,21 299.71,22 299.71,23 2.393,24 4,25 10.051,27 5,28 0.85,29 1.985,30 1.793,31 0.728,32 1,33 4.11,34 9.705,35 10.16,36 10.295,37 1.95,38 9.797,39 9.913,40 10.411,41 1.898,42 2.428,43 1.938,44 1.001,45 0.93,46 1.75,47 0.795,48 0.756,49 5.449,50 19.328,51 4.656,52 1.001,53 0.795,54 24.679,55 56.32,56 0.114,57 13.517,58 11.415,59 5.297,60 0.201,61 5.917,62 2.081,63 7.845,64 5.638}
{0 CHEMBL2012229,1 0.522,3 1.433,4 4.968,5 4.135,7 0.86,9 1.624,10 4.072,11 4.861,12 4.114,13 4.903,14 5.049,15 10.029,16 10.181,17 25.097,18 2.962,19 2.047,20 2.047,21 299.71,22 299.71,23 2.539,24 4,25 10.166,27 5,28 0.856,29 1.985,30 1.793,31 0.728,32 1,33 4.12,34 9.914,35 10.533,36 10.625,37 1.911,38 9.997,39 10.057,40 10.629,41 1.782,42 2.427,43 1.937,44 1.001,45 0.929,46 1.748,47 0.795,48 0.753,49 5.449,50 19.436,51 4.645,52 1.001,53 0.795,54 24.679,55 55.869,56 0.114,57 14.547,58 12.115,59 5.533,60 0.201,61 6.072,62 1.914,63 8.281,64 5.959}
{0 CHEMBL2012230,1 0.522,3 1.421,4 4.96,5 4.145,7 0.86,9 1.624,10 4.087,11 4.855,12 4.14,13 4.899,14 5.043,15 10.247,16 10.403,17 24.894,18 2.961,19 2.047,20 2.047,21 299.71,22 299.71,23 2.641,24 4,25 10.702,27 6,28 0.969,29 1.985,30 1.793,31 0.728,32 1,33 4.132,34 10.034,35 10.815,36 11.025,37 1.824,38 10.141,39 9.966,40 10.747,41 1.782,42 2.389,43 1.937,44 1.001,45 0.929,46 1.748,47 0.795,48 0.752,49 5.449,50 19.544,51 4.633,52 1.001,53 0.795,54 24.679,55 55.423,56 0.114,57 15.448,58 12.878,59 5.884,60 0.201,61 5.97,62 1.718,63 8.688,64 5.745}
{0 CHEMBL2012231,1 0.522,3 1.443,4 4.96,5 4.128,7 0.86,9 1.625,10 4.057,11 4.868,12 4.098,13 4.906,14 5.058,15 9.887,16 10.175,17 23.863,18 2.963,19 2.045,20 2.045,21 299.71,22 299.71,23 2.4,24 4,25 10.291,27 5,28 0.933,29 1.985,30 1.793,31 0.728,32 1,33 4.108,34 9.706,35 10.27,36 10.256,37 1.962,38 9.802,39 9.766,40 10.422,41 1.898,42 2.353,43 1.937,44 1.001,45 0.929,46 1.743,47 0.789,48 0.75,49 5.449,50 19.328,51 4.656,52 1.001,53 0.789,54 24.679,55 56.284,56 0.114,57 13.517,58 11.415,59 5.28,60 0.201,61 5.845,62 2.162,63 7.857,64 5.699}
{0 CHEMBL2012232,1 0.522,3 1.44,4 4.997,5 4.137,7 0.86,9 1.804,10 4.07,11 4.882,12 4.097,13 4.916,14 5.063,15 9.938,16 9.648,17 22.591,18 2.963,19 2.111,20 2.111,21 291.71,22 291.71,23 2.39,24 4,25 9.405,27 4,28 0.757,29 1.97,30 1.769,31 0.732,32 1,33 4.121,34 9.787,35 9.501,36 10.388,37 2.02,38 9.826,39 9.62,40 10.427,41 1.898,42 2.596,43 1.962,44 1.03,45 0.951,46 1.804,47 0.852,48 0.802,49 5.304,50 19.702,51 4.683,52 1.03,53 0.852,54 25.085,55 57.595,56 0.112,57 13.517,58 11.415,59 5.374,60 0.2,61 5.937,62 2.262,63 7.957,64 5.469}
{0 CHEMBL2180945,1 0.8,3 1.412,4 5.172,5 4.217,7 0.86,9 1.212,10 4.035,11 5.051,12 4.304,13 5.112,14 5.328,15 12.894,16 18.381,17 43.903,18 2.419,19 0.467,20 0.467,21 327.549,22 327.549,23 3.792,24 3,25 18.359,26 3.613,27 6,28 0.791,29 1.967,30 1.797,31 0.729,33 4.192,34 13.635,35 17.725,36 13.775,37 1.842,38 14.363,39 19.275,40 13.825,41 1.383,42 2.2,43 1.347,44 0.392,45 0.368,46 1.273,47 0.327,48 0.31,49 5.199,50 18.252,51 4.452,52 0.392,53 0.327,54 20.978,55 46.59,56 0.143,57 14.622,58 12.642,59 7.452,60 0.218,61 6.268,62 1.791,63 9.699,64 5.474}
{0 CHEMBL2313234,3 1.423,4 4.838,5 4.025,6 83.806,7 0.172,9 1.256,10 3.946,11 4.77,12 4.106,13 4.702,14 4.901,15 9.349,16 12.659,17 22.454,18 2.351,19 0.569,20 0.569,21 241.323,22 241.323,23 2.82,24 5,25 13.405,26 2.407,27 5,28 0.844,29 2.2,30 2.1,31 0.682,33 3.987,34 8.974,35 11.799,36 9.664,37 1.432,38 9.069,39 12.196,40 9.317,41 1.268,42 2.222,43 1.784,44 0.819,45 0.788,46 1.175,47 0.219,48 0.208,49 5.028,50 16.952,51 4.415,52 0.819,53 0.219,54 22.076,55 45.528,56 0.106,57 12.835,58 11.356,59 5.51,60 0.213,61 2.341,62 1.465,63 7.478,64 5}
{0 CHEMBL249691,1 0.86,3 1.445,4 5.243,5 4.284,7 1.2,9 1.801,10 4.153,11 5.092,12 4.265,13 5.107,14 5.268,15 11.093,16 13.294,17 32.414,18 2.933,19 2.275,20 2.275,21 332.136,22 332.136,23 2.769,24 4,25 17.041,26 3.059,27 7,28 0.639,29 1.965,30 1.767,31 0.732,33 4.293,34 11.734,35 14.852,36 13.095,37 2.074,38 12.965,39 16.189,40 14.558,41 1.867,42 2.473,43 1.967,44 1.032,45 0.965,46 1.965,47 1,48 0.955,49 5.032,50 20.995,51 4.709,52 1.032,53 1,54 25.66,55 59.246,56 0.109,57 15.995,58 12.658,59 5.865,60 0.197,61 6.304,62 2.035,63 9.66,64 6.222}
{0 CHEMBL249933,1 0.522,3 1.463,4 5.236,5 4.26,7 0.86,9 1.484,10 4.119,11 5.018,12 4.27,13 5.135,14 5.341,15 11.954,16 14.12,17 37.669,18 2.891,19 2.275,20 2.275,21 316.141,22 316.141,23 3.422,24 4,25 14.259,26 3.832,27 4,28 0.55,29 1.964,30 1.762,31 0.733,33 4.205,34 12.793,35 14.104,36 12.679,37 2.066,38 13.012,39 16.769,40 11.691,41 1.834,42 2.454,43 1.967,44 1.03,45 0.965,46 1.964,47 1,48 0.954,49 5.099,50 20.632,51 4.709,52 1.03,53 1,54 24.967,55 58.535,56 0.112,57 16.57,58 14.829,59 7.9,60 0.2,61 6.246,62 2.034,63 10.525,64 5.481}
{0 CHEMBL250137,1 0.86,2 2.739,3 1.457,4 5.146,5 4.285,7 1.2,9 1.801,10 4.166,11 5.018,12 4.269,13 5.107,14 5.283,15 11.111,16 12.839,17 31.76,18 2.936,19 2.275,20 2.275,21 326.304,22 330.304,23 2.976,24 5,25 13.822,26 3.16,27 4,28 0.769,29 2.043,30 1.865,31 0.715,33 4.26,34 10.422,35 12.862,36 11.946,37 2.116,38 11.323,39 13.451,40 12.181,41 1.872,42 2.473,43 1.972,44 1.037,45 0.965,46 1.967,47 1,48 0.961,49 5.243,50 21.751,51 4.758,52 1.037,53 1,54 27.857,55 62.641,56 0.104,57 15.791,58 14.142,59 6.425,60 0.189,61 6.363,62 2.035,63 8.921,64 6}
{0 CHEMBL250546,3 1.389,4 4.543,5 3.77,7 0.86,9 1.3,10 3.78,11 4.489,12 3.729,13 4.43,14 4.56,15 7.2,16 6.18,17 10.06,18 2.506,19 -0.898,20 -0.898,21 181.911,22 181.911,23 1.85,24 3,25 5.48,27 3,28 0.853,29 1.944,30 1.741,31 0.737,33 3.703,34 6.203,35 5.091,36 7.351,37 1.24,38 6.662,39 6.079,40 6.869,41 1.429,42 1.971,43 0.622,44 -0.315,45 -0.222,46 0.513,47 -0.347,48 -0.289,49 4.787,50 14.518,51 4.344,52 -0.315,53 -0.347,54 18.611,55 41.682,56 0.149,57 11.805,58 9.817,59 4.346,60 0.232,61 5.695,62 1.258,63 6.363,64 5}
{0 CHEMBL251107,1 0.86,3 1.467,4 5.325,5 4.495,7 1.2,9 1.808,10 4.304,11 5.186,12 4.529,13 5.321,14 5.524,15 16.11,16 20.067,17 43.683,18 2.935,19 2.588,20 2.588,21 377.978,22 377.978,23 4.002,24 6,25 17.468,26 3.661,27 7,28 0.679,29 2.088,30 1.924,31 0.706,33 4.426,34 13.151,35 16.543,36 14.978,37 2.647,38 15.672,39 19.968,40 14.733,41 1.87,42 2.644,43 2.304,44 1.333,45 1.279,46 2.037,47 1.063,48 1.03,49 5.478,50 24.516,51 4.87,52 1.333,53 1.063,54 30.917,55 68.942,56 0.095,57 17.132,58 15.913,59 7.929,60 0.18,61 6.656,62 2.409,63 10.152,64 6.886}
{0 CHEMBL251785,1 0.86,3 1.383,4 4.627,5 3.911,6 102.887,7 0.86,9 1.128,10 3.817,11 4.51,12 4.002,13 4.639,14 4.853,15 9.498,16 11.012,17 27.026,18 2.461,19 0.446,20 0.446,21 214.604,22 224.869,23 2.642,24 4,25 8.761,27 4,28 0.88,29 2.12,30 2,31 0.696,33 3.813,34 7.016,35 7.998,36 7.64,37 1.412,38 8.917,39 10.533,40 7.811,41 1.431,42 2,43 1.285,44 0.424,45 0.361,46 1.183,47 0.332,48 0.28,49 4.997,50 15.049,51 4.309,52 0.424,53 0.332,54 20.285,55 41.494,56 0.149,57 11.816,58 11.155,59 5.166,60 0.222,61 1.961,62 1.187,63 6.666,64 4.301}
{0 CHEMBL28079,2 2.791,3 1.397,4 4.244,5 3.407,6 70.385,9 -0.099,10 3.464,11 4.285,12 3.442,13 4.234,14 4.438,15 4.379,16 5.778,17 13.969,18 1.983,19 -2.449,20 -2.449,21 157.71,22 157.71,23 1.209,24 3,25 5.852,27 6,28 0.812,29 2.107,30 2,31 0.697,33 3.385,34 4.923,35 6.519,36 4.42,37 0.772,38 4.857,39 6.718,40 4.543,41 0.981,42 1.23,43 0.194,44 -0.775,45 -0.743,46 -0.031,47 -1,48 -0.969,49 4.779,50 10.841,51 4.004,52 -0.775,53 -1,54 14.909,55 30.739,56 0.147,57 8.414,58 7.231,59 2.779,60 0.259,61 3.89,62 0.824,63 4.24,64 4.921}
{0 CHEMBL282515,1 1.214,2 3.598,3 1.495,4 5.436,5 4.59,6 366.319,7 1.392,8 2,9 2,10 4.393,11 5.298,12 4.666,13 5.47,14 5.693,15 19.158,16 26.796,17 53.752,18 3.136,19 3.343,20 3.343,21 431.102,22 431.102,23 5.117,24 8,25 24.755,26 6.07,27 13,28 1.426,29 2.249,30 2.139,31 0.675,32 3,33 4.599,34 15.329,35 20.864,36 18.253,37 2.729,38 17.612,39 24.273,40 18.324,41 2.07,42 2.682,43 2.385,44 1.402,45 1.376,46 2.268,47 1.311,48 1.249,49 5.906,50 26.462,51 4.898,52 1.402,53 1.311,54 33.232,55 71.781,56 0.085,57 18.771,58 17.319,59 9.266,60 0.173,61 7.265,62 2.446,63 11.513,64 8.756}
{0 CHEMBL284059,1 1.214,2 3.599,3 1.502,4 5.397,5 4.587,6 349.901,7 1.392,8 2,9 2,10 4.383,11 5.266,12 4.657,13 5.443,14 5.654,15 18.32,16 24.418,17 50.891,18 3.081,19 2.998,20 2.998,21 407.05,22 407.05,23 5.175,24 8,25 23.893,26 6.077,27 15,28 1.403,29 2.272,30 2.182,31 0.67,32 3,33 4.594,34 15.623,35 20.615,36 18.019,37 2.625,38 18.877,39 24.954,40 18.561,41 2.04,42 2.681,43 2.393,44 1.402,45 1.386,46 2.276,47 1.296,48 1.264,49 5.815,50 25.988,51 4.888,52 1.402,53 1.296,54 32.827,55 70.6,56 0.087,57 18.265,58 16.725,59 8.943,60 0.175,61 7.248,62 2.359,63 11.228,64 7.071}
{0 CHEMBL284070,1 1.214,2 3.598,3 1.495,4 5.408,5 4.59,6 366.393,7 1.392,8 2,9 2,10 4.393,11 5.295,12 4.663,13 5.453,14 5.669,15 18.961,16 25.834,17 51.938,18 3.124,19 3.124,20 3.124,21 428.235,22 428.235,23 5.212,24 8,25 24.091,26 6.07,27 14,28 1.43,29 2.265,30 2.177,31 0.671,32 3,33 4.598,34 15.547,35 20.826,36 18.094,37 2.7,38 18.18,39 24.36,40 18.463,41 2.063,42 2.682,43 2.418,44 1.433,45 1.407,46 2.339,47 1.357,48 1.328,49 5.948,50 26.462,51 4.896,52 1.433,53 1.357,54 33.52,55 71.777,56 0.085,57 18.607,58 17.042,59 9.104,60 0.173,61 7.259,62 2.437,63 11.379,64 8.697}
{0 CHEMBL284535,1 0.916,2 3.62,3 1.492,4 5.454,5 4.635,6 238.233,7 1.214,8 2,9 1.975,10 4.383,11 5.292,12 4.724,13 5.528,14 5.766,15 19.917,16 27.493,17 57.977,18 3.069,19 2.998,20 2.998,21 429.99,22 429.99,23 5.117,24 7,25 26.245,26 6.13,27 16,28 1.361,29 2.195,30 2.069,31 0.684,32 3,33 4.624,34 16.328,35 22.288,36 19.249,37 2.803,38 20.824,39 28.852,40 19.328,41 2.026,42 2.672,43 2.384,44 1.391,45 1.379,46 2.276,47 1.296,48 1.264,49 5.811,50 25.627,51 4.864,52 1.391,53 1.296,54 31.441,55 68.611,56 0.088,57 17.96,58 16.307,59 8.965,60 0.178,61 7.253,62 2.432,63 11.345,64 7.149}
{0 CHEMBL284560,1 0.916,2 3.6,3 1.487,4 5.4,5 4.6,6 228.714,7 1.214,8 2,9 1.892,10 4.352,11 5.262,12 4.675,13 5.462,14 5.679,15 18.749,16 25.495,17 52.873,18 3.025,19 2.829,20 2.829,21 411.877,22 411.877,23 5.033,24 7,25 24.816,26 6.098,27 15,28 1.42,29 2.216,30 2.108,31 0.68,32 3,33 4.599,34 15.694,35 21.291,36 18.221,37 2.67,38 19.433,39 26.313,40 18.992,41 1.961,42 2.656,43 2.276,44 1.296,45 1.264,46 2.212,47 1.221,48 1.207,49 5.801,50 24.979,51 4.833,52 1.296,53 1.221,54 31.035,55 66.915,56 0.09,57 17.442,58 15.796,59 8.64,60 0.18,61 7.204,62 2.355,63 10.892,64 7.643}
{0 CHEMBL284594,1 1.214,2 3.555,3 1.499,4 5.227,5 4.361,6 265.669,7 1.392,8 2,9 1.969,10 4.158,11 5.042,12 4.418,13 5.194,14 5.387,15 13.975,16 19.297,17 38.861,18 2.883,19 2.22,20 2.22,21 319.566,22 319.566,23 4.03,24 6,25 20.031,26 5.516,27 12,28 1.21,29 2.184,30 2.041,31 0.688,32 2,33 4.386,34 12.375,35 16.297,36 14.759,37 2.091,38 14.416,39 19.192,40 14.614,41 1.821,42 2.477,43 2.009,44 1.012,45 1.008,46 1.898,47 0.892,48 0.886,49 5.416,50 20.656,51 4.676,52 1.012,53 0.892,54 25.778,55 56.949,56 0.107,57 15.154,58 13.36,59 6.872,60 0.197,61 6.608,62 1.885,63 9.162,64 7.276}
{0 CHEMBL284627,1 1.392,2 3.572,3 1.501,4 5.466,5 4.583,6 356.927,7 1.911,8 2,9 2.079,10 4.36,11 5.293,12 4.64,13 5.482,14 5.707,15 17.84,16 24.17,17 55.403,18 3.098,19 3.336,20 3.336,21 418.347,22 418.347,23 4.859,24 7,25 26.123,26 7.53,27 12,28 1.215,29 2.179,30 2.034,31 0.689,32 3,33 4.578,34 15.726,35 21.232,36 18.725,37 2.596,38 17.961,39 25.113,40 17.98,41 2.042,42 2.72,43 2.413,44 1.426,45 1.402,46 2.306,47 1.326,48 1.291,49 5.731,50 25.395,51 4.869,52 1.426,53 1.326,54 31.153,55 69.05,56 0.088,57 18.496,58 15.943,59 8.586,60 0.179,61 7.184,62 2.377,63 11.519,64 7.319}
{0 CHEMBL284719,1 1.214,2 3.589,3 1.494,4 5.33,5 4.512,6 343.634,7 1.392,8 2,9 2,10 4.333,11 5.188,12 4.577,13 5.344,14 5.552,15 16.767,16 22.076,17 45.448,18 3.062,19 2.907,20 2.907,21 380.428,22 380.428,23 4.965,24 8,25 21.815,26 5.98,27 15,28 1.28,29 2.279,30 2.187,31 0.669,32 3,33 4.51,34 14.397,35 18.567,36 16.788,37 2.445,38 16.969,39 22.249,40 16.654,41 2.033,42 2.68,43 2.388,44 1.397,45 1.381,46 2.152,47 1.166,48 1.146,49 5.678,50 25.321,51 4.873,52 1.397,53 1.166,54 32.134,55 68.729,56 0.088,57 17.923,58 16.416,59 8.633,60 0.176,61 7.095,62 2.185,63 10.899,64 6.022}
{0 CHEMBL284745,1 0.916,2 3.597,3 1.474,4 5.45,5 4.655,6 245.29,7 1.214,8 2,9 2.073,10 4.386,11 5.295,12 4.731,13 5.528,14 5.748,15 19.994,16 27.006,17 56.795,18 3.07,19 2.998,20 2.998,21 429.652,22 431.652,23 5.161,24 7,25 25.72,26 6.059,27 15,28 1.363,29 2.19,30 2.067,31 0.685,32 3,33 4.645,34 16.148,35 21.768,36 19.014,37 2.821,38 20.774,39 28.345,40 20.029,41 2.025,42 2.672,43 2.385,44 1.393,45 1.379,46 2.276,47 1.296,48 1.264,49 5.755,50 25.871,51 4.868,52 1.393,53 1.296,54 32.134,55 69.293,56 0.087,57 18.151,58 16.624,59 8.954,60 0.176,61 7.284,62 2.417,63 11.23,64 6}
{0 CHEMBL285737,1 1.392,2 3.575,3 1.493,4 5.415,5 4.581,6 357.928,7 1.907,8 2,9 2,10 4.355,11 5.31,12 4.651,13 5.476,14 5.695,15 18.538,16 25.845,17 54.731,18 3.109,19 2.826,20 2.826,21 429.102,22 429.102,23 4.951,24 7,25 24.183,26 5.806,27 13,28 1.333,29 2.195,30 2.069,31 0.684,32 3,33 4.577,34 15.447,35 21.291,36 17.771,37 2.638,38 17.886,39 24.743,40 17.761,41 2.055,42 2.681,43 2.359,44 1.374,45 1.35,46 2.143,47 1.151,48 1.14,49 5.878,50 25.435,51 4.856,52 1.374,53 1.151,54 31.441,55 68.657,56 0.088,57 17.997,58 16.183,59 8.723,60 0.178,61 7.177,62 2.388,63 11.012,64 8.367}
{0 CHEMBL286309,1 1.392,2 3.584,3 1.485,4 5.435,5 4.594,6 370.631,7 1.911,8 3,9 2.082,10 4.388,11 5.329,12 4.666,13 5.489,14 5.71,15 19.029,16 26.415,17 55.421,18 3.144,19 3.348,20 3.348,21 431.5,22 431.5,23 5.174,24 8,25 24.364,26 7.79,27 13,28 1.332,29 2.249,30 2.139,31 0.675,32 3,33 4.595,34 15.963,35 21.756,36 18.169,37 2.695,38 18.11,39 24.866,40 18.167,41 2.077,42 2.741,43 2.442,44 1.459,45 1.424,46 2.349,47 1.363,48 1.338,49 5.831,50 26.888,51 4.909,52 1.459,53 1.363,54 33.232,55 71.271,56 0.085,57 18.771,58 17.319,59 9.545,60 0.173,61 7.231,62 2.443,63 11.793,64 8.328}
{0 CHEMBL296435,3 1.37,4 4.73,5 3.648,6 81.192,9 -0.223,10 3.57,11 4.66,12 3.797,13 4.675,14 4.97,15 7.823,16 12.815,17 25.105,18 1.776,19 -2.415,20 -2.415,21 211.82,22 211.82,23 1.566,24 2,25 12.462,27 5,28 1.015,29 1.966,30 1.818,31 0.727,32 2,33 3.534,34 7.201,35 11.692,36 7.641,37 1.078,38 6.971,39 11.64,40 6.051,41 0.786,42 0.911,43 -0.044,44 -1,45 -0.885,46 -0.109,47 -1,48 -0.96,49 4.926,50 11.481,51 3.928,52 -1,53 -1,54 13.523,55 28.777,56 0.158,57 8.234,58 6.658,59 3.655,60 0.272,61 4.046,62 1.082,63 5.24,64 4.796}
{0 CHEMBL32255,1 1.214,2 3.599,3 1.502,4 5.397,5 4.587,6 349.901,7 1.392,8 2,9 2,10 4.383,11 5.266,12 4.657,13 5.443,14 5.654,15 18.32,16 24.418,17 50.891,18 3.081,19 2.998,20 2.998,21 407.05,22 407.05,23 5.175,24 8,25 23.893,26 6.077,27 15,28 1.403,29 2.272,30 2.182,31 0.67,32 3,33 4.594,34 15.623,35 20.615,36 18.019,37 2.625,38 18.877,39 24.954,40 18.561,41 2.04,42 2.681,43 2.393,44 1.402,45 1.386,46 2.276,47 1.296,48 1.264,49 5.815,50 25.988,51 4.888,52 1.402,53 1.296,54 32.827,55 70.6,56 0.087,57 18.265,58 16.725,59 8.943,60 0.175,61 7.248,62 2.359,63 11.228,64 8.26}
{0 CHEMBL33121,1 1.214,2 3.593,3 1.49,4 5.397,5 4.582,6 366.393,7 1.392,8 2,9 2,10 4.379,11 5.279,12 4.652,13 5.442,14 5.655,15 18.493,16 25.15,17 50.77,18 3.123,19 3.124,20 3.124,21 420.632,22 420.632,23 5.144,24 8,25 23.431,26 6.023,27 14,28 1.413,29 2.265,30 2.177,31 0.671,32 3,33 4.59,34 15,35 19.973,36 17.637,37 2.672,38 17.797,39 23.799,40 17.756,41 2.061,42 2.682,43 2.407,44 1.433,45 1.393,46 2.333,47 1.357,48 1.318,49 5.924,50 26.279,51 4.89,52 1.433,53 1.357,54 33.52,55 71.512,56 0.085,57 18.607,58 17.042,59 8.995,60 0.173,61 7.251,62 2.413,63 11.255,64 8.377}
{0 CHEMBL33147,1 1.392,2 3.561,3 1.509,4 5.359,5 4.533,6 327.511,7 1.886,8 2,9 2,10 4.307,11 5.237,12 4.595,13 5.402,14 5.608,15 17.37,16 23.946,17 49.383,18 3.079,19 2.826,20 2.826,21 388.428,22 388.428,23 4.836,24 7,25 22.575,26 5.686,27 13,28 1.341,29 2.205,30 2.073,31 0.683,32 3,33 4.529,34 14.374,35 19.127,36 16.781,37 2.495,38 16.679,39 22.291,40 16.667,41 2.043,42 2.681,43 2.353,44 1.368,45 1.342,46 2.143,47 1.149,48 1.14,49 5.797,50 24.239,51 4.829,52 1.368,53 1.149,54 30.054,55 66.385,56 0.092,57 17.497,58 15.486,59 8.368,60 0.182,61 7.081,62 2.244,63 10.525,64 7.319}
{0 CHEMBL33381,1 1.214,2 3.6,3 1.49,4 5.415,5 4.56,6 328.009,7 1.392,8 2,9 1.969,10 4.342,11 5.305,12 4.642,13 5.458,14 5.685,15 18.628,16 26.42,17 54.223,18 2.976,19 2.825,20 2.825,21 419.48,22 419.48,23 4.992,24 7,25 25.423,26 6.181,27 14,28 1.385,29 2.222,30 2.111,31 0.679,32 3,33 4.562,34 16.204,35 22.818,36 18.136,37 2.627,38 18.468,39 25.891,40 18.283,41 1.953,42 2.647,43 2.335,44 1.352,45 1.323,46 2.143,47 1.149,48 1.14,49 5.826,50 24.837,51 4.81,52 1.352,53 1.149,54 30.342,55 65.578,56 0.092,57 17.021,58 15.55,59 8.772,60 0.182,61 7.15,62 2.38,63 11.015,64 7.509}
{0 CHEMBL33518,1 1.214,2 3.598,3 1.496,4 5.419,5 4.591,6 366.393,7 1.392,8 2,9 2,10 4.395,11 5.293,12 4.664,13 5.447,14 5.657,15 18.881,16 25.696,17 51.071,18 3.125,19 3.124,20 3.124,21 428.235,22 428.235,23 5.224,24 8,25 24.481,26 6.086,27 15,28 1.412,29 2.265,30 2.177,31 0.671,32 3,33 4.603,34 15.795,35 21.093,36 18.284,37 2.709,38 18.502,39 24.664,40 18.573,41 2.063,42 2.682,43 2.411,44 1.433,45 1.398,46 2.336,47 1.357,48 1.322,49 5.948,50 26.471,51 4.897,52 1.433,53 1.357,54 33.52,55 71.805,56 0.085,57 18.607,58 17.042,59 9.133,60 0.173,61 7.261,62 2.428,63 11.419,64 8.62}
{0 CHEMBL33627,1 1.392,2 3.575,3 1.503,4 5.455,5 4.578,6 357.469,7 1.911,8 3,9 2,10 4.359,11 5.297,12 4.652,13 5.478,14 5.7,15 18.807,16 26.563,17 55.133,18 3.13,19 2.829,20 2.829,21 418.347,22 418.347,23 4.915,24 7,25 25.087,26 7.419,27 13,28 1.332,29 2.179,30 2.034,31 0.689,32 3,33 4.581,34 15.582,35 21.156,36 18.42,37 2.658,38 17.635,39 24.476,40 17.919,41 2.065,42 2.682,43 2.37,44 1.384,45 1.361,46 2.162,47 1.188,48 1.149,49 5.731,50 25.4,51 4.867,52 1.384,53 1.188,54 31.153,55 69.128,56 0.088,57 18.324,58 16.502,59 8.835,60 0.179,61 7.184,62 2.384,63 11.346,64 8.328}
{0 CHEMBL33944,1 1.214,2 3.604,3 1.508,4 5.39,5 4.557,6 326.318,7 1.392,8 2,9 2,10 4.339,11 5.277,12 4.632,13 5.43,14 5.643,15 18.209,16 25.386,17 51.455,18 3.128,19 2.826,20 2.826,21 403.05,22 403.05,23 5.083,24 8,25 24.402,26 6.228,27 15,28 1.398,29 2.287,30 2.192,31 0.668,32 3,33 4.565,34 15.726,35 21.742,36 17.733,37 2.595,38 18.352,39 25.042,40 18.341,41 2.066,42 2.681,43 2.362,44 1.375,45 1.353,46 2.143,47 1.15,48 1.14,49 5.758,50 25.715,51 4.858,52 1.375,53 1.15,54 31.441,55 67.846,56 0.09,57 17.546,58 15.725,59 8.956,60 0.178,61 7.166,62 2.339,63 11.54,64 7.367}
{0 CHEMBL34169,1 0.916,2 3.527,3 1.491,4 5.359,5 4.538,6 223.224,7 1.214,8 2,9 1.873,10 4.316,11 5.228,12 4.605,13 5.399,14 5.617,15 17.136,16 23.187,17 49.204,18 3.028,19 2.808,20 2.808,21 386.428,22 386.428,23 4.855,24 7,25 22.99,26 5.954,27 14,28 1.266,29 2.222,30 2.111,31 0.679,32 3,33 4.525,34 14.7,35 19.819,36 17.023,37 2.524,38 17.485,39 23.613,40 16.877,41 1.958,42 2.658,43 2.276,44 1.296,45 1.264,46 2.066,47 1.071,48 1.062,49 5.768,50 24.311,51 4.815,52 1.296,53 1.071,54 30.342,55 65.605,56 0.092,57 17.261,58 15.455,59 8.317,60 0.182,61 7.104,62 2.3,63 10.565,64 7.409}
{0 CHEMBL34276,1 0.916,2 3.6,3 1.487,4 5.4,5 4.586,6 231.763,7 1.214,8 2,9 1.914,10 4.352,11 5.262,12 4.668,13 5.447,14 5.669,15 18.787,16 25.77,17 52.414,18 3.055,19 2.813,20 2.813,21 403.877,22 403.877,23 5.006,24 7,25 24.809,26 6.109,27 15,28 1.43,29 2.216,30 2.108,31 0.68,32 3,33 4.572,34 15.694,35 21.291,36 18.223,37 2.666,38 19.226,39 26.128,40 18.411,41 2,42 2.671,43 2.276,44 1.296,45 1.264,46 2.077,47 1.084,48 1.073,49 5.688,50 24.979,51 4.833,52 1.296,53 1.084,54 31.035,55 66.928,56 0.09,57 17.43,58 15.864,59 8.662,60 0.18,61 7.186,62 2.355,63 10.889,64 8.174}
{0 CHEMBL34628,1 1.214,2 3.587,3 1.493,4 5.351,5 4.528,6 313.03,7 1.392,8 2,9 1.969,10 4.3,11 5.225,12 4.601,13 5.388,14 5.601,15 17.703,16 24.388,17 49.185,18 2.974,19 2.55,20 2.55,21 388.428,22 388.428,23 4.825,24 7,25 23.13,26 6.039,27 14,28 1.416,29 2.228,30 2.114,31 0.678,32 3,33 4.522,34 14.747,35 20.068,36 17.056,37 2.512,38 17.412,39 23.575,40 17.086,41 1.949,42 2.559,43 2.25,44 1.269,45 1.239,46 2.142,47 1.148,48 1.139,49 5.797,50 23.912,51 4.793,52 1.269,53 1.148,54 29.649,55 64.216,56 0.095,57 16.668,58 15.3,59 8.343,60 0.184,61 7.087,62 2.241,63 10.386,64 6.928}
{0 CHEMBL34744,1 0.916,2 3.617,3 1.503,4 5.402,5 4.565,6 223.224,7 1.214,8 2,9 1.864,10 4.349,11 5.26,12 4.646,13 5.415,14 5.632,15 18.281,16 25.087,17 50.461,18 3.043,19 2.808,20 2.808,21 396.295,22 396.295,23 5.052,24 7,25 25.481,26 6.163,27 15,28 1.501,29 2.222,30 2.111,31 0.679,32 3,33 4.563,34 15.876,35 21.898,36 18.485,37 2.608,38 18.693,39 25.406,40 18.671,41 2.006,42 2.664,43 2.276,44 1.296,45 1.264,46 2.07,47 1.071,48 1.067,49 5.661,50 24.735,51 4.829,52 1.296,53 1.071,54 30.342,55 66.133,56 0.092,57 17.261,58 15.455,59 8.624,60 0.182,61 7.159,62 2.37,63 11.026,64 8.187}
{0 CHEMBL34802,1 1.214,2 3.589,3 1.48,4 5.395,5 4.547,6 328.009,7 1.392,8 2,9 2,10 4.318,11 5.255,12 4.621,13 5.45,14 5.673,15 18.211,16 25.502,17 53.895,18 2.975,19 2.825,20 2.825,21 406.295,22 406.295,23 4.878,24 7,25 24.249,26 6.053,27 13,28 1.38,29 2.222,30 2.111,31 0.679,32 3,33 4.542,34 15.128,35 20.739,36 17.562,37 2.558,38 17.837,39 24.624,40 17.176,41 1.948,42 2.598,43 2.31,44 1.352,45 1.279,46 2.143,47 1.149,48 1.139,49 5.804,50 24.408,51 4.801,52 1.352,53 1.149,54 30.342,55 65.129,56 0.092,57 17.021,58 15.55,59 8.517,60 0.182,61 7.13,62 2.279,63 10.655,64 7.658}
{0 CHEMBL373102,1 0.522,3 1.426,4 4.975,5 4.169,6 205.477,7 0.573,9 1.397,10 4.042,11 4.888,12 4.246,13 4.937,14 5.139,15 10.821,16 13.088,17 48.191,18 2.783,19 1.885,20 1.885,21 274.825,22 274.825,23 3.455,24 5,25 14.218,26 3.792,27 14,28 1.041,29 2.14,30 2,31 0.695,32 1,33 4.142,34 10.729,35 13.688,36 11.298,37 1.68,38 12.333,39 14.736,40 12.186,41 1.609,42 2.156,43 1.836,44 0.883,45 0.807,46 1.738,47 0.806,48 0.727,49 5.185,50 18.679,51 4.519,52 0.883,53 0.806,54 23.581,55 49.905,56 0.111,57 14.557,58 12.775,59 6.293,60 0.206,61 6.431,62 1.643,63 8.448,64 6.268}
{0 CHEMBL399298,1 0.86,3 1.446,4 5.214,5 4.261,7 1.2,9 1.801,10 4.159,11 5.096,12 4.231,13 5.09,14 5.259,15 10.576,16 12.376,17 33.867,18 2.944,19 1.88,20 1.88,21 346.136,22 346.136,23 2.543,24 4,25 16.86,26 1.52,27 7,28 0.766,29 1.965,30 1.767,31 0.732,32 1,33 4.26,34 11.683,35 14.987,36 12.566,37 2.018,38 12.243,39 15.209,40 13.236,41 1.885,42 2.473,43 1.967,44 1.033,45 0.956,46 1.748,47 0.769,48 0.748,49 5.244,50 21.078,51 4.716,52 1.033,53 0.769,54 25.66,55 59.271,56 0.109,57 16.123,58 12.381,59 5.843,60 0.197,61 6.297,62 2.012,63 9.784,64 6.086}
{0 CHEMBL399385,1 0.86,3 1.447,4 5.11,5 4.29,7 1.2,9 1.801,10 4.162,11 5.013,12 4.277,13 5.084,14 5.254,15 11.379,16 12.64,17 29.814,18 2.93,19 2.275,20 2.275,21 323.65,22 327.65,23 3.018,24 5,25 12.832,26 3.169,27 5,28 0.692,29 2.058,30 1.895,31 0.711,33 4.267,34 10.754,35 13.013,36 11.819,37 2.139,38 11.987,39 13.847,40 12.865,41 1.864,42 2.473,43 1.971,44 1.036,45 0.965,46 1.967,47 1,48 0.961,49 5.285,50 21.709,51 4.742,52 1.036,53 1,54 28.145,55 62.225,56 0.104,57 15.51,58 14.056,59 6.384,60 0.188,61 6.364,62 2.044,63 8.7,64 5.678}
{0 CHEMBL399690,1 0.522,3 1.446,4 4.542,5 3.77,7 0.86,9 0.794,10 3.7,11 4.445,12 3.736,13 4.508,14 4.674,15 6.831,16 6.71,17 16.059,18 2.307,19 -1.276,20 -1.276,21 190.621,22 190.621,23 1.653,24 3,25 5.802,27 2,28 0.759,29 1.961,30 1.763,31 0.733,33 3.677,34 5.917,35 6.141,36 6.35,37 1.356,38 6.627,39 7.325,40 6.442,41 1.281,42 1.8,43 0.635,44 -0.298,45 -0.274,46 0.518,47 -0.452,48 -0.438,49 4.888,50 13.562,51 4.336,52 -0.298,53 -0.452,54 17.512,55 40.5,56 0.159,57 9.963,58 8.54,59 3.677,60 0.239,61 4.966,62 1.301,63 5.265,64 5.119}
{0 CHEMBL400976,1 0.86,3 1.436,4 5.203,5 4.433,7 1.2,9 1.801,10 4.227,11 5.093,12 4.432,13 5.293,14 5.476,15 13.356,16 15.661,17 40.453,18 2.931,19 2.579,20 2.579,21 375.683,22 375.683,23 3.495,24 5,25 15.306,26 1.67,27 6,28 0.711,29 2.055,30 1.9,31 0.711,33 4.426,34 11.93,35 15.273,36 12.898,37 2.432,38 14.93,39 18.207,40 16.206,41 1.866,42 2.473,43 2.237,44 1.284,45 1.215,46 1.984,47 1.035,48 0.983,49 5.525,50 22.933,51 4.778,52 1.284,53 1.035,54 29.531,55 64.618,56 0.099,57 16.104,58 14.402,59 6.932,60 0.184,61 6.539,62 2.21,63 9.341,64 5.824}
{0 CHEMBL401186,1 0.8,3 1.429,4 5.055,5 4.242,7 0.86,9 1.484,10 4.104,11 4.954,12 4.241,13 5.037,14 5.215,15 10.915,16 12.587,17 29.346,18 2.833,19 2.275,20 2.275,21 307.566,22 307.566,23 2.901,24 5,25 11.83,26 3.622,27 5,28 0.69,29 2.077,30 1.922,31 0.707,33 4.196,34 9.675,35 12.103,36 10.376,37 2.065,38 11.576,39 13.893,40 11.264,41 1.786,42 2.473,43 1.967,44 1.03,45 0.965,46 1.964,47 1,48 0.954,49 5.213,50 20.624,51 4.673,52 1.03,53 1,54 27.046,55 58.581,56 0.109,57 14.651,58 13.236,59 6.048,60 0.192,61 6.327,62 1.967,63 8.229,64 5.699}
{0 CHEMBL401345,1 0.86,3 1.405,4 5.179,5 4.374,7 0.86,9 1.801,10 4.185,11 5.037,12 4.364,13 5.216,14 5.377,15 12.472,16 15.201,17 36.052,18 2.933,19 2.58,20 2.58,21 349.408,22 349.408,23 3.122,24 5,25 13.727,26 3.51,27 5,28 0.787,29 2.041,30 1.871,31 0.715,33 4.353,34 10.314,35 12.822,36 11.493,37 2.287,38 12.213,39 13.938,40 13.763,41 1.866,42 2.597,43 2.175,44 1.254,45 1.151,46 1.967,47 1.033,48 0.965,49 5.215,50 22.381,51 4.751,52 1.254,53 1.033,54 29.244,55 63.239,56 0.099,57 16.269,58 14.679,59 6.582,60 0.185,61 6.488,62 2.106,63 8.933,64 6.013}
{0 CHEMBL40200,3 1.378,4 4.492,5 3.757,7 0.86,9 1.214,10 3.747,11 4.429,12 3.722,13 4.399,14 4.532,15 7.18,16 6.176,17 10.015,18 2.358,19 -0.757,20 -0.757,21 175.24,22 175.24,23 1.798,24 3,25 5.444,27 2,28 0.848,29 1.963,30 1.77,31 0.732,33 3.68,34 5.822,35 5.04,36 6.942,37 1.232,38 6.476,39 6.054,40 6.68,41 1.307,42 1.96,43 0.617,44 -0.319,45 -0.222,46 0.51,47 -0.347,48 -0.29,49 4.736,50 14.067,51 4.296,52 -0.319,53 -0.347,54 18.205,55 39.968,56 0.154,57 11.159,58 9.64,59 4.24,60 0.234,61 5.674,62 1.229,63 6.152,64 5.137}
{0 CHEMBL418594,1 1.214,2 6.753,3 1.492,4 5.384,5 4.566,6 352.984,7 1.392,8 2,9 2,10 4.365,11 5.268,12 4.634,13 5.432,14 5.648,15 18.179,16 25.031,17 50.838,18 3.123,19 2.828,20 2.828,21 413.05,22 413.05,23 5.022,24 8,25 23.244,26 6.038,27 13,28 1.435,29 2.272,30 2.182,31 0.67,32 3,33 4.574,34 14.712,35 19.866,36 17.374,37 2.628,38 17.108,39 23.149,40 17.722,41 2.059,42 2.682,43 2.371,44 1.384,45 1.363,46 2.206,47 1.24,48 1.194,49 5.901,50 25.852,51 4.874,52 1.384,53 1.24,54 32.827,55 70.114,56 0.087,57 18.253,58 16.792,59 8.914,60 0.175,61 7.219,62 2.363,63 11.094,64 8.456}
{0 CHEMBL437020,1 0.765,3 1.458,4 5.2,5 4.325,7 0.86,9 1.484,10 4.2,11 5.075,12 4.355,13 5.14,14 5.332,15 13.985,16 17.198,17 36.224,18 2.93,19 2.372,20 2.372,21 335.059,22 335.059,23 3.36,24 5,25 16.29,26 1.585,27 8,28 0.646,29 2.053,30 1.884,31 0.713,33 4.253,34 12.534,35 15.218,36 14.015,37 2.265,38 13.081,39 16.256,40 12.38,41 1.865,42 2.473,43 2,44 1.035,45 1,46 1.984,47 1,48 0.983,49 5.318,50 21.825,51 4.751,52 1.035,53 1,54 27.334,55 61.22,56 0.106,57 15.405,58 13.866,59 6.835,60 0.191,61 6.4,62 2.119,63 9.091,64 6.301}
{0 CHEMBL471529,1 0.657,3 1.374,4 4.904,5 4.16,7 0.86,9 1.188,10 3.929,11 4.788,12 4.249,13 5.079,14 5.323,15 11.955,16 16.154,17 38.968,18 2.365,19 0.157,20 0.157,21 286.955,22 292.955,23 2.399,24 3,25 14.165,27 7,28 0.871,29 1.993,30 1.837,31 0.722,33 4.117,34 9.517,35 12.58,36 10.523,37 1.683,38 11.827,39 16.839,40 11.065,41 1.333,42 2.139,43 1.397,44 0.508,45 0.444,46 1.02,47 0.066,48 0.063,49 5.326,50 16.399,51 4.385,52 0.508,53 0.066,54 20.69,55 43.98,56 0.111,57 12.941,58 10.695,59 4.964,60 0.22,61 4.73,62 1.401,63 7.215,64 4.644}
{0 CHEMBL471701,1 0.657,3 1.391,4 4.973,5 4.225,7 0.86,9 1.411,10 4.005,11 4.876,12 4.312,13 5.128,14 5.361,15 12.734,16 17.242,17 39.846,18 2.558,19 0.914,20 0.914,21 310.811,22 316.811,23 2.542,24 4,25 14.467,27 7,28 0.876,29 2.063,30 1.92,31 0.708,33 4.217,34 10.58,35 14.221,36 10.877,37 1.78,38 12.728,39 17.917,40 12.542,41 1.545,42 2.359,43 1.588,44 0.689,45 0.61,46 1.397,47 0.508,48 0.443,49 5.37,50 18.603,51 4.502,52 0.689,53 0.508,54 23.175,55 48.692,56 0.107,57 13.862,58 11.733,59 5.57,60 0.208,61 5.492,62 1.516,63 8.298,64 4.833}
{0 CHEMBL471702,1 0.657,3 1.363,4 4.956,5 4.198,7 0.86,9 1.188,10 3.97,11 4.854,12 4.288,13 5.115,14 5.354,15 12.497,16 17.112,17 39.924,18 2.365,19 0.553,20 0.553,21 306.743,22 312.743,23 2.467,24 3,25 14.566,27 7,28 0.872,29 1.993,30 1.842,31 0.722,33 4.176,34 10.289,35 13.939,36 10.755,37 1.743,38 12.385,39 17.729,40 12.078,41 1.333,42 2.151,43 1.408,44 0.512,45 0.449,46 1.352,47 0.371,48 0.361,49 5.392,50 17.061,51 4.41,52 0.512,53 0.371,54 21.383,55 44.979,56 0.109,57 13.061,58 11.323,59 5.248,60 0.216,61 5.098,62 1.48,63 7.436,64 5.114}
{0 CHEMBL471703,1 0.657,3 1.405,4 5.194,5 4.27,7 0.86,9 1.411,10 4.075,11 4.983,12 4.363,13 5.183,14 5.412,15 13.576,16 18.959,17 42.121,18 2.469,19 0.913,20 0.913,21 324.451,22 330.451,23 2.554,24 3,25 18.781,27 7,28 0.874,29 1.952,30 1.776,31 0.733,33 4.286,34 12.118,35 16.685,36 13.225,37 1.865,38 13.567,39 19.567,40 14.104,41 1.454,42 2.359,43 1.584,44 0.685,45 0.607,46 1.396,47 0.507,48 0.443,49 5.163,50 18.441,51 4.524,52 0.685,53 0.507,54 22.076,55 49.177,56 0.113,57 14.815,58 12.055,59 5.582,60 0.213,61 5.751,62 1.711,63 9.238,64 5.022}
{0 CHEMBL488080,1 0.657,3 1.38,4 5.026,5 4.205,7 0.86,9 1.411,10 3.998,11 4.886,12 4.283,13 5.11,14 5.337,15 12.532,16 17.076,17 39.03,18 2.36,19 0.913,20 0.913,21 308.056,22 314.056,23 2.387,24 3,25 14.95,27 5,28 0.817,29 1.976,30 1.811,31 0.727,33 4.185,34 10.525,35 14.012,36 11.081,37 1.734,38 12.265,39 17.371,40 12.03,41 1.316,42 2.223,43 1.558,44 0.681,45 0.588,46 1.388,47 0.506,48 0.439,49 5.323,50 17.503,51 4.452,52 0.681,53 0.506,54 21.789,55 46.923,56 0.109,57 13.769,58 11.733,59 5.297,60 0.214,61 5.38,62 1.523,63 7.902,64 5.114}
{0 CHEMBL488265,1 0.657,3 1.369,4 4.868,5 4.128,7 0.86,9 1.326,10 3.906,11 4.749,12 4.202,13 5.036,14 5.275,15 11.464,16 15.154,17 37.184,18 2.36,19 0.157,20 0.157,21 277.315,22 283.315,23 2.271,24 3,25 12.907,27 5,28 0.816,29 1.993,30 1.837,31 0.722,33 4.063,34 8.89,35 11.211,36 9.926,37 1.613,38 11.142,39 15.626,40 10.025,41 1.313,42 2.109,43 1.389,44 0.508,45 0.44,46 1.012,47 0.066,48 0.062,49 5.346,50 16.155,51 4.38,52 0.508,53 0.066,54 20.69,55 43.798,56 0.111,57 12.941,58 10.695,59 4.825,60 0.22,61 4.681,62 1.342,63 6.939,64 4.614}
{0 CHEMBL512174,1 0.86,3 1.366,4 4.926,5 4.196,7 0.86,9 1.411,10 3.971,11 4.819,12 4.244,13 5.119,14 5.345,15 12.066,16 14.866,17 39.301,18 2.41,19 0.913,20 0.913,21 286.955,22 292.955,23 2.429,24 3,25 12.811,27 5,28 0.737,29 1.952,30 1.776,31 0.733,33 4.171,34 9.562,35 11.893,36 10.632,37 1.912,38 11.979,39 15.313,40 11.28,41 1.339,42 2.358,43 1.584,44 0.685,45 0.606,46 1.396,47 0.507,48 0.443,49 5.326,50 17.493,51 4.47,52 0.685,53 0.507,54 22.076,55 47.808,56 0.131,57 12.941,58 10.695,59 5.158,60 0.213,61 4.898,62 1.606,63 7.486,64 5.149}
{0 CHEMBL513593,1 0.86,3 1.374,4 5.199,5 4.342,7 0.86,9 1.67,10 4.168,11 5.103,12 4.416,13 5.273,14 5.504,15 15.288,16 20.703,17 46.374,18 2.657,19 2.136,20 2.136,21 358.163,22 364.163,23 3.361,24 4,25 19.235,26 2.309,27 7,28 0.711,29 2.016,30 1.861,31 0.718,33 4.355,34 12.757,35 17.298,36 14.319,37 2.238,38 14.23,39 19.291,40 13.471,41 1.603,42 2.406,43 1.984,44 1,45 0.983,46 1.892,47 0.969,48 0.882,49 5.435,50 21.314,51 4.621,52 1,53 0.969,54 26.641,55 56.328,56 0.112,57 15.234,58 12.706,59 6.785,60 0.194,61 5.134,62 2.014,63 9.388,64 4.406}
{0 CHEMBL520074,1 0.68,3 1.363,4 4.923,5 4.176,7 0.86,9 1.246,10 3.951,11 4.797,12 4.262,13 5.059,14 5.296,15 12.086,16 16.208,17 37.501,18 2.365,19 0.553,20 0.553,21 296.947,22 302.947,23 2.329,24 3,25 13.52,27 7,28 0.852,29 1.993,30 1.842,31 0.722,33 4.142,34 9.622,35 12.555,36 10.334,37 1.692,38 11.896,39 16.636,40 11.17,41 1.333,42 2.151,43 1.408,44 0.512,45 0.449,46 1.352,47 0.371,48 0.361,49 5.41,50 16.802,51 4.41,52 0.512,53 0.371,54 21.383,55 44.979,56 0.109,57 13.061,58 11.323,59 5.096,60 0.216,61 5.078,62 1.422,63 7.179,64 5.108}
{0 CHEMBL521075,1 0.657,3 1.358,4 4.922,5 4.167,7 0.86,9 1.326,10 3.948,11 4.819,12 4.243,13 5.074,14 5.307,15 11.998,16 16.129,17 38.048,18 2.36,19 0.553,20 0.553,21 296.947,22 302.947,23 2.339,24 3,25 13.318,27 5,28 0.816,29 1.993,30 1.842,31 0.722,33 4.126,34 9.666,35 12.64,36 10.161,37 1.674,38 11.691,39 16.486,40 11.026,41 1.313,42 2.122,43 1.398,44 0.512,45 0.445,46 1.352,47 0.371,48 0.361,49 5.41,50 16.817,51 4.405,52 0.512,53 0.371,54 21.383,55 44.798,56 0.109,57 13.061,58 11.323,59 5.11,60 0.216,61 5.049,62 1.42,63 7.159,64 4.979}
{0 CHEMBL551052,1 0.86,3 1.353,4 5.099,5 4.14,7 0.86,8 1,9 1.368,10 4.054,11 5.066,12 4.222,13 5.073,14 5.322,15 11.43,16 17.99,17 38.023,18 2.466,19 1.962,20 1.962,21 357.42,22 357.42,23 2.599,24 4,25 17.853,26 4.03,27 4,28 1.128,29 2.095,30 2,31 0.699,33 4.102,34 10.9,35 16.438,36 11.815,37 1.783,38 10.394,39 16.372,40 10.082,41 1.412,42 2.18,43 1.952,44 1,45 0.946,46 1.839,47 0.906,48 0.84,49 5.415,50 19.344,51 4.469,52 1,53 0.906,54 25.137,55 50.059,56 0.103,57 13.989,58 12.101,59 5.706,60 0.199,61 6.36,62 1.755,63 8.058,64 6.461}
{0 CHEMBL567470,1 0.86,3 1.386,4 5.122,5 4.139,7 0.86,8 1,9 1.332,10 4.067,11 5.097,12 4.206,13 5.044,14 5.272,15 10.971,16 16.876,17 36.369,18 2.627,19 1.063,20 1.063,21 346.49,22 346.49,23 2.952,24 4,25 17.657,26 1.708,27 6,28 1.321,29 2.079,30 1.96,31 0.703,32 2,33 4.135,34 11.633,35 17.319,36 11.766,37 1.744,38 10.149,39 15.482,40 10.929,41 1.545,42 2.158,43 1.959,44 1,45 0.956,46 1.47,47 0.521,48 0.481,49 5.414,50 19.286,51 4.494,52 1,53 0.521,54 24.156,55 49.893,56 0.106,57 13.916,58 11.961,59 5.919,60 0.203,61 6.4,62 1.801,63 8.327,64 7.193}
{0 CHEMBL583914,1 0.172,3 1.477,4 5.143,5 4.148,6 125.688,7 0.916,9 1.413,10 4.141,11 5.09,12 4.246,13 5.038,14 5.276,15 10.917,16 16.197,17 34.852,18 2.639,19 1.699,20 1.699,21 312.321,22 314.321,23 3.351,24 6,25 18.433,26 2.436,27 7,28 1.473,29 2.23,30 2.133,31 0.677,32 1,33 4.128,34 11.797,35 17.739,36 11.899,37 1.798,38 11.84,39 17.171,40 10.719,41 1.601,42 2.351,43 1.821,44 0.857,45 0.823,46 1.655,47 0.7,48 0.667,49 5.327,50 20.619,51 4.623,52 0.857,53 0.7,54 25.66,55 54.662,56 0.1,57 14.52,58 12.881,59 7.131,60 0.197,61 5.813,62 1.982,63 9.373,64 6}
{0 CHEMBL63,1 0.149,3 1.422,4 4.553,5 3.599,7 0.86,9 0.525,10 3.665,11 4.681,12 3.694,13 4.529,14 4.742,15 7.492,16 10.347,17 21.966,18 1.657,19 -2.671,20 -2.671,21 190.905,22 190.905,23 1.527,24 3,25 10.899,28 1.109,29 2.107,30 2,31 0.697,32 1,33 3.549,34 8.765,35 12.183,36 7.857,37 0.936,38 7.454,39 10.181,40 7.247,41 0.671,42 1.45,43 0.241,44 -0.81,45 -0.849,46 0.023,47 -0.944,48 -0.909,49 4.656,50 12.391,51 4.042,52 -0.81,53 -0.944,54 14.909,55 31.281,56 0.165,57 8.566,58 7.218,59 4.232,60 0.259,61 4.346,62 1.071,63 5.64,64 4.796}
{0 CHEMBL779,1 1.214,2 3.521,3 1.521,4 5.008,5 4.192,6 214.479,7 1.392,8 2,9 1.676,10 4.037,11 4.855,12 4.245,13 4.975,14 5.172,15 11.682,16 14.861,17 30.118,18 2.679,19 1.114,20 1.114,21 257.323,22 257.323,23 3.617,24 6,25 14.136,26 3.275,27 11,28 0.921,29 2.233,30 2.096,31 0.679,32 2,33 4.179,34 10.035,35 12.124,36 11.679,37 1.697,38 11.816,39 15.2,40 10.935,41 1.656,42 2.389,43 1.695,44 0.682,45 0.679,46 1.435,47 0.457,48 0.44,49 5.361,50 18.335,51 4.594,52 0.682,53 0.457,54 23.293,55 51.728,56 0.119,57 13.4,58 12.468,59 6.166,60 0.207,61 6.089,62 1.554,63 7.793,64 7.432}
{0 CHEMBL932,1 0.8,3 1.356,4 5.328,5 4.483,7 0.8,9 1.579,10 4.162,11 5.312,12 4.519,13 5.436,14 5.648,15 13.196,16 21.814,17 54.757,18 2.508,19 2.117,20 2.117,21 306.842,22 306.842,23 3.552,24 4,25 21.219,26 8.077,27 16,28 0.951,29 2.073,30 1.964,31 0.704,33 4.569,34 12.599,35 21.458,36 11.974,37 2.369,38 12.837,39 22.762,40 14.262,41 1.487,42 2.17,43 1.984,44 1,45 0.983,46 1.984,47 1,48 0.983,49 4.037,50 21.521,51 4.512,52 1,53 1,54 26.235,55 52.888,56 0.088,57 14.589,58 12.431,59 6.84,60 0.195,61 3.644,62 2.095,63 9.356,64 6.398}
