{
  "data_features": {
    "feature": [
      {
        "data_type": "nominal",
        "index": "0",
        "is_ignore": "false",
        "is_row_identifier": "true",
        "is_target": "false",
        "name": "molecule_id",
        "nominal_value": [
          "CHEMBL1076153",
          "CHEMBL1076880",
          "CHEMBL1077616",
          "CHEMBL1079383",
          "CHEMBL1080035",
          "CHEMBL1080196",
          "CHEMBL1080446",
          "CHEMBL1080447",
          "CHEMBL1080448",
          "CHEMBL1080449",
          "CHEMBL1080705",
          "CHEMBL1080706",
          "CHEMBL1080707",
          "CHEMBL1081382",
          "CHEMBL1081550",
          "CHEMBL108660",
          "CHEMBL108697",
          "CHEMBL109018",
          "CHEMBL109085",
          "CHEMBL111309",
          "CHEMBL111310",
          "CHEMBL11608",
          "CHEMBL1170237",
          "CHEMBL1172318",
          "CHEMBL1173331",
          "CHEMBL1173525",
          "CHEMBL118703",
          "CHEMBL121",
          "CHEMBL1213717",
          "CHEMBL1213718",
          "CHEMBL1213719",
          "CHEMBL1213775",
          "CHEMBL1213776",
          "CHEMBL1213777",
          "CHEMBL1213778",
          "CHEMBL1213779",
          "CHEMBL1213838",
          "CHEMBL1213839",
          "CHEMBL1213840",
          "CHEMBL1213841",
          "CHEMBL1213842",
          "CHEMBL1213843",
          "CHEMBL1213911",
          "CHEMBL1213912",
          "CHEMBL1213914",
          "CHEMBL1213915",
          "CHEMBL1213916",
          "CHEMBL1213968",
          "CHEMBL1213972",
          "CHEMBL1214023",
          "CHEMBL121432",
          "CHEMBL12208",
          "CHEMBL1221929",
          "CHEMBL1221930",
          "CHEMBL1221980",
          "CHEMBL1221981",
          "CHEMBL1221982",
          "CHEMBL1222279",
          "CHEMBL1222280",
          "CHEMBL1222281",
          "CHEMBL1222282",
          "CHEMBL1222283",
          "CHEMBL1222341",
          "CHEMBL1235738",
          "CHEMBL123895",
          "CHEMBL1240558",
          "CHEMBL1241294",
          "CHEMBL1241295",
          "CHEMBL1242936",
          "CHEMBL1242937",
          "CHEMBL1242938",
          "CHEMBL1242964",
          "CHEMBL1242965",
          "CHEMBL1242991",
          "CHEMBL1242992",
          "CHEMBL1243025",
          "CHEMBL1243026",
          "CHEMBL1243057",
          "CHEMBL1243058",
          "CHEMBL1243059",
          "CHEMBL1243088",
          "CHEMBL1243089",
          "CHEMBL1243090",
          "CHEMBL1243124",
          "CHEMBL1243125",
          "CHEMBL1243150",
          "CHEMBL1243151",
          "CHEMBL1243152",
          "CHEMBL1243180",
          "CHEMBL1243181",
          "CHEMBL1243182",
          "CHEMBL1243212",
          "CHEMBL1243213",
          "CHEMBL1243214",
          "CHEMBL1243245",
          "CHEMBL1243371",
          "CHEMBL1243399",
          "CHEMBL1243400",
          "CHEMBL1243401",
          "CHEMBL124935",
          "CHEMBL125044",
          "CHEMBL125094",
          "CHEMBL1253262",
          "CHEMBL1253263",
          "CHEMBL1253264",
          "CHEMBL1253281",
          "CHEMBL1253283",
          "CHEMBL1253302",
          "CHEMBL1253303",
          "CHEMBL1253333",
          "CHEMBL1253334",
          "CHEMBL1253357",
          "CHEMBL1253578",
          "CHEMBL1253604",
          "CHEMBL1253605",
          "CHEMBL1253606",
          "CHEMBL1253613",
          "CHEMBL1253614",
          "CHEMBL1253618",
          "CHEMBL1253680",
          "CHEMBL1253693",
          "CHEMBL1253699",
          "CHEMBL1253700",
          "CHEMBL1253762",
          "CHEMBL1253763",
          "CHEMBL1253764",
          "CHEMBL1253845",
          "CHEMBL1253846",
          "CHEMBL1253847",
          "CHEMBL1253924",
          "CHEMBL1253925",
          "CHEMBL1253926",
          "CHEMBL1254017",
          "CHEMBL1254471",
          "CHEMBL1254550",
          "CHEMBL1254551",
          "CHEMBL1254552",
          "CHEMBL1254623",
          "CHEMBL1254624",
          "CHEMBL1254625",
          "CHEMBL1254763",
          "CHEMBL1254764",
          "CHEMBL1254850",
          "CHEMBL1254851",
          "CHEMBL1254934",
          "CHEMBL1254935",
          "CHEMBL1255019",
          "CHEMBL1255020",
          "CHEMBL1255021",
          "CHEMBL1255743",
          "CHEMBL1256153",
          "CHEMBL1257340",
          "CHEMBL1257570",
          "CHEMBL1257571",
          "CHEMBL1257692",
          "CHEMBL1257815",
          "CHEMBL1258275",
          "CHEMBL125843",
          "CHEMBL1258500",
          "CHEMBL1258611",
          "CHEMBL1258954",
          "CHEMBL1258955",
          "CHEMBL125921",
          "CHEMBL126",
          "CHEMBL126504",
          "CHEMBL126505",
          "CHEMBL1269720",
          "CHEMBL1269721",
          "CHEMBL1271892",
          "CHEMBL1271944",
          "CHEMBL1271945",
          "CHEMBL1272000",
          "CHEMBL1272057",
          "CHEMBL1272108",
          "CHEMBL127517",
          "CHEMBL127518",
          "CHEMBL127622",
          "CHEMBL127751",
          "CHEMBL127757",
          "CHEMBL127774",
          "CHEMBL127982",
          "CHEMBL127983",
          "CHEMBL128029",
          "CHEMBL130217",
          "CHEMBL13311",
          "CHEMBL1351571",
          "CHEMBL1383041",
          "CHEMBL1391898",
          "CHEMBL139679",
          "CHEMBL1400294",
          "CHEMBL1411619",
          "CHEMBL142582",
          "CHEMBL142738",
          "CHEMBL142799",
          "CHEMBL142916",
          "CHEMBL143316",
          "CHEMBL14346",
          "CHEMBL143555",
          "CHEMBL145003",
          "CHEMBL145292",
          "CHEMBL145374",
          "CHEMBL145452",
          "CHEMBL145503",
          "CHEMBL145781",
          "CHEMBL145792",
          "CHEMBL1458820",
          "CHEMBL1461072",
          "CHEMBL146222",
          "CHEMBL1477100",
          "CHEMBL1492484",
          "CHEMBL149463",
          "CHEMBL1501880",
          "CHEMBL151",
          "CHEMBL1521156",
          "CHEMBL1529697",
          "CHEMBL1575961",
          "CHEMBL158946",
          "CHEMBL160347",
          "CHEMBL1606959",
          "CHEMBL161896",
          "CHEMBL161907",
          "CHEMBL16312",
          "CHEMBL163651",
          "CHEMBL1642670",
          "CHEMBL1642671",
          "CHEMBL1642672",
          "CHEMBL1642673",
          "CHEMBL1642674",
          "CHEMBL1642675",
          "CHEMBL1642676",
          "CHEMBL1642677",
          "CHEMBL1642678",
          "CHEMBL1642679",
          "CHEMBL1642680",
          "CHEMBL1642681",
          "CHEMBL1642682",
          "CHEMBL1642683",
          "CHEMBL1642685",
          "CHEMBL1642686",
          "CHEMBL1643120",
          "CHEMBL1643121",
          "CHEMBL1643122",
          "CHEMBL1643123",
          "CHEMBL1643124",
          "CHEMBL16442",
          "CHEMBL1645548",
          "CHEMBL164781",
          "CHEMBL1651054",
          "CHEMBL1651055",
          "CHEMBL16530",
          "CHEMBL16623",
          "CHEMBL16861",
          "CHEMBL17052",
          "CHEMBL17079",
          "CHEMBL17092",
          "CHEMBL1712955",
          "CHEMBL1760713",
          "CHEMBL1760714",
          "CHEMBL1760715",
          "CHEMBL1760716",
          "CHEMBL1760717",
          "CHEMBL1760718",
          "CHEMBL1760719",
          "CHEMBL1760720",
          "CHEMBL1760721",
          "CHEMBL1760722",
          "CHEMBL1761757",
          "CHEMBL1761758",
          "CHEMBL1761759",
          "CHEMBL1761760",
          "CHEMBL1761761",
          "CHEMBL1761762",
          "CHEMBL1761763",
          "CHEMBL1761764",
          "CHEMBL1766549",
          "CHEMBL1766550",
          "CHEMBL1766551",
          "CHEMBL1766552",
          "CHEMBL1766553",
          "CHEMBL1766554",
          "CHEMBL1766555",
          "CHEMBL1766556",
          "CHEMBL1766557",
          "CHEMBL1766558",
          "CHEMBL1766560",
          "CHEMBL1766561",
          "CHEMBL1766562",
          "CHEMBL1766612",
          "CHEMBL1766613",
          "CHEMBL1766614",
          "CHEMBL1766619",
          "CHEMBL1766620",
          "CHEMBL1766622",
          "CHEMBL1766624",
          "CHEMBL1766625",
          "CHEMBL1766626",
          "CHEMBL1777814",
          "CHEMBL1777845",
          "CHEMBL1777847",
          "CHEMBL1777849",
          "CHEMBL1783714",
          "CHEMBL1783715",
          "CHEMBL1783716",
          "CHEMBL1795980",
          "CHEMBL1796443",
          "CHEMBL1796444",
          "CHEMBL1796447",
          "CHEMBL1796448",
          "CHEMBL1796454",
          "CHEMBL1796455",
          "CHEMBL1796456",
          "CHEMBL1796457",
          "CHEMBL1796458",
          "CHEMBL1796459",
          "CHEMBL1796460",
          "CHEMBL1796461",
          "CHEMBL1796807",
          "CHEMBL1806757",
          "CHEMBL1806758",
          "CHEMBL1806759",
          "CHEMBL1806760",
          "CHEMBL1806761",
          "CHEMBL1806762",
          "CHEMBL1806763",
          "CHEMBL1806764",
          "CHEMBL1806765",
          "CHEMBL1806766",
          "CHEMBL1806767",
          "CHEMBL1806768",
          "CHEMBL18116",
          "CHEMBL1813518",
          "CHEMBL1813519",
          "CHEMBL1813520",
          "CHEMBL1813521",
          "CHEMBL1813522",
          "CHEMBL1813523",
          "CHEMBL1813524",
          "CHEMBL1813525",
          "CHEMBL1814055",
          "CHEMBL1814057",
          "CHEMBL1814064",
          "CHEMBL1814065",
          "CHEMBL1814066",
          "CHEMBL1814067",
          "CHEMBL1814068",
          "CHEMBL1814069",
          "CHEMBL1814070",
          "CHEMBL1814071",
          "CHEMBL1814072",
          "CHEMBL1814073",
          "CHEMBL1814644",
          "CHEMBL1814645",
          "CHEMBL1814648",
          "CHEMBL1821748",
          "CHEMBL1823530",
          "CHEMBL1823533",
          "CHEMBL1823539",
          "CHEMBL1823540",
          "CHEMBL1823543",
          "CHEMBL1823545",
          "CHEMBL1823547",
          "CHEMBL1823549",
          "CHEMBL1823550",
          "CHEMBL1823552",
          "CHEMBL1823554",
          "CHEMBL1823802",
          "CHEMBL1823805",
          "CHEMBL1823807",
          "CHEMBL1823808",
          "CHEMBL1823811",
          "CHEMBL1823814",
          "CHEMBL1823815",
          "CHEMBL1830129",
          "CHEMBL1830130",
          "CHEMBL1830131",
          "CHEMBL1830132",
          "CHEMBL1830133",
          "CHEMBL1830134",
          "CHEMBL1830135",
          "CHEMBL1830136",
          "CHEMBL1830137",
          "CHEMBL1830138",
          "CHEMBL1830139",
          "CHEMBL1830140",
          "CHEMBL1830141",
          "CHEMBL1830142",
          "CHEMBL1830143",
          "CHEMBL1830144",
          "CHEMBL1830145",
          "CHEMBL1830146",
          "CHEMBL1830147",
          "CHEMBL1830148",
          "CHEMBL1830792",
          "CHEMBL1830793",
          "CHEMBL1830795",
          "CHEMBL1830796",
          "CHEMBL1830797",
          "CHEMBL1830799",
          "CHEMBL1830800",
          "CHEMBL1830801",
          "CHEMBL1830808",
          "CHEMBL1830809",
          "CHEMBL1830810",
          "CHEMBL1830811",
          "CHEMBL1830814",
          "CHEMBL1830815",
          "CHEMBL1830816",
          "CHEMBL1830817",
          "CHEMBL1830818",
          "CHEMBL1830824",
          "CHEMBL1830825",
          "CHEMBL1830827",
          "CHEMBL1830828",
          "CHEMBL1830829",
          "CHEMBL1830830",
          "CHEMBL1830833",
          "CHEMBL1830834",
          "CHEMBL1835223",
          "CHEMBL1835224",
          "CHEMBL1835225",
          "CHEMBL1835226",
          "CHEMBL1835227",
          "CHEMBL1835228",
          "CHEMBL1835229",
          "CHEMBL1835230",
          "CHEMBL1835231",
          "CHEMBL1835232",
          "CHEMBL1835233",
          "CHEMBL1835326",
          "CHEMBL1835327",
          "CHEMBL1835328",
          "CHEMBL187760",
          "CHEMBL188105",
          "CHEMBL189117",
          "CHEMBL1891947",
          "CHEMBL18966",
          "CHEMBL18978",
          "CHEMBL190268",
          "CHEMBL1911926",
          "CHEMBL1911927",
          "CHEMBL1911928",
          "CHEMBL1914652",
          "CHEMBL1917495",
          "CHEMBL1917526",
          "CHEMBL1917527",
          "CHEMBL1917528",
          "CHEMBL1917529",
          "CHEMBL1917530",
          "CHEMBL1917531",
          "CHEMBL1917532",
          "CHEMBL1917940",
          "CHEMBL1927665",
          "CHEMBL1927666",
          "CHEMBL1927667",
          "CHEMBL1927668",
          "CHEMBL1927669",
          "CHEMBL1927670",
          "CHEMBL1927672",
          "CHEMBL1927673",
          "CHEMBL1927674",
          "CHEMBL1927675",
          "CHEMBL1927677",
          "CHEMBL1927679",
          "CHEMBL1927680",
          "CHEMBL1927681",
          "CHEMBL1927683",
          "CHEMBL1927684",
          "CHEMBL1928855",
          "CHEMBL193000",
          "CHEMBL1934039",
          "CHEMBL1934040",
          "CHEMBL1934041",
          "CHEMBL1934042",
          "CHEMBL1934043",
          "CHEMBL1934044",
          "CHEMBL1934673",
          "CHEMBL1934675",
          "CHEMBL1934676",
          "CHEMBL1934677",
          "CHEMBL1938476",
          "CHEMBL1938479",
          "CHEMBL1938483",
          "CHEMBL1938897",
          "CHEMBL1938898",
          "CHEMBL1938899",
          "CHEMBL1945150",
          "CHEMBL1945151",
          "CHEMBL1945152",
          "CHEMBL1945153",
          "CHEMBL1945154",
          "CHEMBL1945155",
          "CHEMBL1945156",
          "CHEMBL1945157",
          "CHEMBL1945158",
          "CHEMBL1945159",
          "CHEMBL1945160",
          "CHEMBL1945271",
          "CHEMBL1945272",
          "CHEMBL1945273",
          "CHEMBL1946643",
          "CHEMBL1946644",
          "CHEMBL1946645",
          "CHEMBL1946826",
          "CHEMBL1946827",
          "CHEMBL1946828",
          "CHEMBL194732",
          "CHEMBL1950700",
          "CHEMBL1950701",
          "CHEMBL1950702",
          "CHEMBL1950703",
          "CHEMBL1950704",
          "CHEMBL1950705",
          "CHEMBL1950706",
          "CHEMBL1950707",
          "CHEMBL1950708",
          "CHEMBL1950709",
          "CHEMBL1950710",
          "CHEMBL1963386",
          "CHEMBL1982267",
          "CHEMBL1987137",
          "CHEMBL198810",
          "CHEMBL2023193",
          "CHEMBL2029527",
          "CHEMBL2029531",
          "CHEMBL2029532",
          "CHEMBL2029533",
          "CHEMBL2029534",
          "CHEMBL2029535",
          "CHEMBL2029536",
          "CHEMBL2029537",
          "CHEMBL2029538",
          "CHEMBL2029539",
          "CHEMBL2029540",
          "CHEMBL2029541",
          "CHEMBL2029542",
          "CHEMBL2029543",
          "CHEMBL2029544",
          "CHEMBL2029545",
          "CHEMBL2029546",
          "CHEMBL2029547",
          "CHEMBL2029548",
          "CHEMBL2029549",
          "CHEMBL2029550",
          "CHEMBL2058150",
          "CHEMBL2058151",
          "CHEMBL2058152",
          "CHEMBL2058153",
          "CHEMBL2058154",
          "CHEMBL2058407",
          "CHEMBL2058408",
          "CHEMBL2058409",
          "CHEMBL2058410",
          "CHEMBL2058411",
          "CHEMBL2058412",
          "CHEMBL2058413",
          "CHEMBL2058414",
          "CHEMBL2058415",
          "CHEMBL2058416",
          "CHEMBL2058417",
          "CHEMBL2058418",
          "CHEMBL2058419",
          "CHEMBL2058420",
          "CHEMBL2058421",
          "CHEMBL2058422",
          "CHEMBL2058423",
          "CHEMBL2058424",
          "CHEMBL2058425",
          "CHEMBL2058426",
          "CHEMBL2058427",
          "CHEMBL2058428",
          "CHEMBL2058429",
          "CHEMBL2058694",
          "CHEMBL2058695",
          "CHEMBL2058696",
          "CHEMBL2058697",
          "CHEMBL2058698",
          "CHEMBL2058699",
          "CHEMBL2058700",
          "CHEMBL2058701",
          "CHEMBL2058702",
          "CHEMBL2058703",
          "CHEMBL2058704",
          "CHEMBL2058705",
          "CHEMBL2058706",
          "CHEMBL2062871",
          "CHEMBL2062872",
          "CHEMBL2062873",
          "CHEMBL2062874",
          "CHEMBL2062875",
          "CHEMBL2062876",
          "CHEMBL2062877",
          "CHEMBL2062878",
          "CHEMBL2062879",
          "CHEMBL2062880",
          "CHEMBL2062881",
          "CHEMBL2062882",
          "CHEMBL2062883",
          "CHEMBL2088299",
          "CHEMBL2088300",
          "CHEMBL2088301",
          "CHEMBL2088302",
          "CHEMBL2088303",
          "CHEMBL2088304",
          "CHEMBL2088305",
          "CHEMBL2088306",
          "CHEMBL2088307",
          "CHEMBL2088308",
          "CHEMBL2088309",
          "CHEMBL2088310",
          "CHEMBL2088311",
          "CHEMBL2088312",
          "CHEMBL2088313",
          "CHEMBL2088314",
          "CHEMBL2088315",
          "CHEMBL2088316",
          "CHEMBL2088317",
          "CHEMBL2088319",
          "CHEMBL2088320",
          "CHEMBL2088321",
          "CHEMBL2093956",
          "CHEMBL2093957",
          "CHEMBL2094026",
          "CHEMBL2094027",
          "CHEMBL2094028",
          "CHEMBL214255",
          "CHEMBL2151536",
          "CHEMBL2151538",
          "CHEMBL2151539",
          "CHEMBL2151540",
          "CHEMBL2151542",
          "CHEMBL2151543",
          "CHEMBL2151544",
          "CHEMBL2151545",
          "CHEMBL2151546",
          "CHEMBL2151547",
          "CHEMBL2151549",
          "CHEMBL2151550",
          "CHEMBL2151553",
          "CHEMBL2151555",
          "CHEMBL2151556",
          "CHEMBL2151558",
          "CHEMBL2151562",
          "CHEMBL2151568",
          "CHEMBL2151660",
          "CHEMBL2151661",
          "CHEMBL2151662",
          "CHEMBL2151663",
          "CHEMBL2151664",
          "CHEMBL2151665",
          "CHEMBL2151666",
          "CHEMBL2151667",
          "CHEMBL2151668",
          "CHEMBL2151669",
          "CHEMBL2151670",
          "CHEMBL2151672",
          "CHEMBL2151673",
          "CHEMBL2151675",
          "CHEMBL2151676",
          "CHEMBL2151677",
          "CHEMBL2151678",
          "CHEMBL2151679",
          "CHEMBL2151680",
          "CHEMBL2151682",
          "CHEMBL2151683",
          "CHEMBL2151684",
          "CHEMBL2151685",
          "CHEMBL2151686",
          "CHEMBL2151688",
          "CHEMBL2151689",
          "CHEMBL2151690",
          "CHEMBL2158241",
          "CHEMBL2158242",
          "CHEMBL2158243",
          "CHEMBL2158244",
          "CHEMBL2158245",
          "CHEMBL2158246",
          "CHEMBL2158247",
          "CHEMBL2158248",
          "CHEMBL2158249",
          "CHEMBL2158250",
          "CHEMBL2158251",
          "CHEMBL2177457",
          "CHEMBL2177462",
          "CHEMBL2177463",
          "CHEMBL2177464",
          "CHEMBL2177465",
          "CHEMBL2177466",
          "CHEMBL2177467",
          "CHEMBL2203918",
          "CHEMBL2203919",
          "CHEMBL2203920",
          "CHEMBL2203921",
          "CHEMBL2204752",
          "CHEMBL2204753",
          "CHEMBL2204754",
          "CHEMBL2204755",
          "CHEMBL2204756",
          "CHEMBL2204757",
          "CHEMBL2204758",
          "CHEMBL2204759",
          "CHEMBL2204760",
          "CHEMBL2204761",
          "CHEMBL2204762",
          "CHEMBL2204763",
          "CHEMBL2204764",
          "CHEMBL2204765",
          "CHEMBL2204766",
          "CHEMBL2204767",
          "CHEMBL2204768",
          "CHEMBL2204769",
          "CHEMBL2204770",
          "CHEMBL2204771",
          "CHEMBL2204772",
          "CHEMBL2204773",
          "CHEMBL2204774",
          "CHEMBL2204775",
          "CHEMBL220495",
          "CHEMBL2206089",
          "CHEMBL2206090",
          "CHEMBL2206091",
          "CHEMBL2206092",
          "CHEMBL2206093",
          "CHEMBL2206094",
          "CHEMBL2206095",
          "CHEMBL2206096",
          "CHEMBL2206097",
          "CHEMBL2206098",
          "CHEMBL2206099",
          "CHEMBL2206100",
          "CHEMBL2206102",
          "CHEMBL2206103",
          "CHEMBL2206104",
          "CHEMBL2206105",
          "CHEMBL2206106",
          "CHEMBL2206107",
          "CHEMBL2206108",
          "CHEMBL229472",
          "CHEMBL229908",
          "CHEMBL2312485",
          "CHEMBL2312486",
          "CHEMBL2312487",
          "CHEMBL2312488",
          "CHEMBL2312489",
          "CHEMBL2312490",
          "CHEMBL2312974",
          "CHEMBL2312975",
          "CHEMBL2312976",
          "CHEMBL2312977",
          "CHEMBL2312978",
          "CHEMBL2312979",
          "CHEMBL2312980",
          "CHEMBL2312981",
          "CHEMBL2312982",
          "CHEMBL2312983",
          "CHEMBL2312984",
          "CHEMBL2312985",
          "CHEMBL2312986",
          "CHEMBL2312987",
          "CHEMBL2312988",
          "CHEMBL2312989",
          "CHEMBL2312990",
          "CHEMBL2312991",
          "CHEMBL2313274",
          "CHEMBL2313275",
          "CHEMBL2313276",
          "CHEMBL2313277",
          "CHEMBL2313278",
          "CHEMBL2313279",
          "CHEMBL2313280",
          "CHEMBL2313281",
          "CHEMBL2313282",
          "CHEMBL2313283",
          "CHEMBL2313284",
          "CHEMBL2313285",
          "CHEMBL2313286",
          "CHEMBL2313287",
          "CHEMBL2313288",
          "CHEMBL2313289",
          "CHEMBL2313290",
          "CHEMBL2313291",
          "CHEMBL2313292",
          "CHEMBL2313293",
          "CHEMBL2313294",
          "CHEMBL2313295",
          "CHEMBL2313296",
          "CHEMBL2313297",
          "CHEMBL2313298",
          "CHEMBL2326864",
          "CHEMBL2331563",
          "CHEMBL2332163",
          "CHEMBL2332166",
          "CHEMBL2332170",
          "CHEMBL2332171",
          "CHEMBL2332172",
          "CHEMBL2332173",
          "CHEMBL2332174",
          "CHEMBL2332175",
          "CHEMBL2332176",
          "CHEMBL2332177",
          "CHEMBL2332178",
          "CHEMBL2332179",
          "CHEMBL2332181",
          "CHEMBL2332182",
          "CHEMBL2332183",
          "CHEMBL2332184",
          "CHEMBL2332185",
          "CHEMBL2332186",
          "CHEMBL2332187",
          "CHEMBL2332188",
          "CHEMBL2332189",
          "CHEMBL2332190",
          "CHEMBL2332210",
          "CHEMBL2332211",
          "CHEMBL2332212",
          "CHEMBL2333925",
          "CHEMBL2333926",
          "CHEMBL2333927",
          "CHEMBL2333928",
          "CHEMBL2333929",
          "CHEMBL2333930",
          "CHEMBL2333931",
          "CHEMBL2333932",
          "CHEMBL2333933",
          "CHEMBL2333934",
          "CHEMBL2333935",
          "CHEMBL2333936",
          "CHEMBL2333937",
          "CHEMBL239507",
          "CHEMBL239508",
          "CHEMBL241861",
          "CHEMBL241909",
          "CHEMBL244661",
          "CHEMBL246809",
          "CHEMBL246811",
          "CHEMBL246813",
          "CHEMBL247833",
          "CHEMBL247834",
          "CHEMBL248049",
          "CHEMBL248050",
          "CHEMBL255230",
          "CHEMBL255231",
          "CHEMBL255590",
          "CHEMBL255700",
          "CHEMBL255822",
          "CHEMBL256699",
          "CHEMBL257368",
          "CHEMBL257990",
          "CHEMBL258420",
          "CHEMBL258547",
          "CHEMBL26138",
          "CHEMBL274030",
          "CHEMBL274318",
          "CHEMBL275224",
          "CHEMBL276076",
          "CHEMBL279390",
          "CHEMBL28",
          "CHEMBL286796",
          "CHEMBL288122",
          "CHEMBL290302",
          "CHEMBL291647",
          "CHEMBL293004",
          "CHEMBL294811",
          "CHEMBL299655",
          "CHEMBL303594",
          "CHEMBL304241",
          "CHEMBL313833",
          "CHEMBL315361",
          "CHEMBL323988",
          "CHEMBL326294",
          "CHEMBL331650",
          "CHEMBL338035",
          "CHEMBL338094",
          "CHEMBL339027",
          "CHEMBL339429",
          "CHEMBL339561",
          "CHEMBL339565",
          "CHEMBL339626",
          "CHEMBL340701",
          "CHEMBL341071",
          "CHEMBL342327",
          "CHEMBL342357",
          "CHEMBL342724",
          "CHEMBL344504",
          "CHEMBL347197",
          "CHEMBL348922",
          "CHEMBL348961",
          "CHEMBL349376",
          "CHEMBL350093",
          "CHEMBL356385",
          "CHEMBL356714",
          "CHEMBL356977",
          "CHEMBL357614",
          "CHEMBL361891",
          "CHEMBL363555",
          "CHEMBL364437",
          "CHEMBL364917",
          "CHEMBL365987",
          "CHEMBL370697",
          "CHEMBL371428",
          "CHEMBL372047",
          "CHEMBL372943",
          "CHEMBL373323",
          "CHEMBL374237",
          "CHEMBL375539",
          "CHEMBL379350",
          "CHEMBL386941",
          "CHEMBL387777",
          "CHEMBL387778",
          "CHEMBL396778",
          "CHEMBL39898",
          "CHEMBL399353",
          "CHEMBL399572",
          "CHEMBL404232",
          "CHEMBL404505",
          "CHEMBL406861",
          "CHEMBL408",
          "CHEMBL408592",
          "CHEMBL414637",
          "CHEMBL420523",
          "CHEMBL421088",
          "CHEMBL431770",
          "CHEMBL43185",
          "CHEMBL434261",
          "CHEMBL434695",
          "CHEMBL436947",
          "CHEMBL439811",
          "CHEMBL445184",
          "CHEMBL446059",
          "CHEMBL446771",
          "CHEMBL447307",
          "CHEMBL447729",
          "CHEMBL448696",
          "CHEMBL450239",
          "CHEMBL450413",
          "CHEMBL450518",
          "CHEMBL450771",
          "CHEMBL451747",
          "CHEMBL452001",
          "CHEMBL452004",
          "CHEMBL453410",
          "CHEMBL453703",
          "CHEMBL455782",
          "CHEMBL456150",
          "CHEMBL457535",
          "CHEMBL459523",
          "CHEMBL460269",
          "CHEMBL461133",
          "CHEMBL462630",
          "CHEMBL463249",
          "CHEMBL466769",
          "CHEMBL466770",
          "CHEMBL466872",
          "CHEMBL467794",
          "CHEMBL468597",
          "CHEMBL468852",
          "CHEMBL468854",
          "CHEMBL469024",
          "CHEMBL469350",
          "CHEMBL469362",
          "CHEMBL469571",
          "CHEMBL469583",
          "CHEMBL469768",
          "CHEMBL469782",
          "CHEMBL469783",
          "CHEMBL469818",
          "CHEMBL469976",
          "CHEMBL470008",
          "CHEMBL470020",
          "CHEMBL470213",
          "CHEMBL470220",
          "CHEMBL470221",
          "CHEMBL470226",
          "CHEMBL470420",
          "CHEMBL470612",
          "CHEMBL471221",
          "CHEMBL471228",
          "CHEMBL471232",
          "CHEMBL471447",
          "CHEMBL472069",
          "CHEMBL472080",
          "CHEMBL472081",
          "CHEMBL472218",
          "CHEMBL472638",
          "CHEMBL477846",
          "CHEMBL483450",
          "CHEMBL484410",
          "CHEMBL484769",
          "CHEMBL487050",
          "CHEMBL487071",
          "CHEMBL487235",
          "CHEMBL488063",
          "CHEMBL488072",
          "CHEMBL488073",
          "CHEMBL488074",
          "CHEMBL488075",
          "CHEMBL488076",
          "CHEMBL488266",
          "CHEMBL488267",
          "CHEMBL488916",
          "CHEMBL488917",
          "CHEMBL489079",
          "CHEMBL489718",
          "CHEMBL489719",
          "CHEMBL489720",
          "CHEMBL489743",
          "CHEMBL490752",
          "CHEMBL490922",
          "CHEMBL490923",
          "CHEMBL491888",
          "CHEMBL494795",
          "CHEMBL495714",
          "CHEMBL496279",
          "CHEMBL496280",
          "CHEMBL496281",
          "CHEMBL497674",
          "CHEMBL497675",
          "CHEMBL497676",
          "CHEMBL498505",
          "CHEMBL498506",
          "CHEMBL498507",
          "CHEMBL498683",
          "CHEMBL498694",
          "CHEMBL499266",
          "CHEMBL50",
          "CHEMBL500093",
          "CHEMBL500683",
          "CHEMBL502021",
          "CHEMBL502371",
          "CHEMBL504356",
          "CHEMBL506",
          "CHEMBL506301",
          "CHEMBL508324",
          "CHEMBL508657",
          "CHEMBL508698",
          "CHEMBL508793",
          "CHEMBL508817",
          "CHEMBL509322",
          "CHEMBL509345",
          "CHEMBL511011",
          "CHEMBL511601",
          "CHEMBL511789",
          "CHEMBL511966",
          "CHEMBL511967",
          "CHEMBL512332",
          "CHEMBL512703",
          "CHEMBL512719",
          "CHEMBL512843",
          "CHEMBL512883",
          "CHEMBL513209",
          "CHEMBL513549",
          "CHEMBL51601",
          "CHEMBL519678",
          "CHEMBL520061",
          "CHEMBL522271",
          "CHEMBL524447",
          "CHEMBL526897",
          "CHEMBL534756",
          "CHEMBL536057",
          "CHEMBL536059",
          "CHEMBL536060",
          "CHEMBL537732",
          "CHEMBL537735",
          "CHEMBL539970",
          "CHEMBL541474",
          "CHEMBL542118",
          "CHEMBL545413",
          "CHEMBL550000",
          "CHEMBL550409",
          "CHEMBL551075",
          "CHEMBL551278",
          "CHEMBL553631",
          "CHEMBL554514",
          "CHEMBL554831",
          "CHEMBL555787",
          "CHEMBL556769",
          "CHEMBL557213",
          "CHEMBL55934",
          "CHEMBL560280",
          "CHEMBL561746",
          "CHEMBL562142",
          "CHEMBL562143",
          "CHEMBL564016",
          "CHEMBL564763",
          "CHEMBL568150",
          "CHEMBL568385",
          "CHEMBL570731",
          "CHEMBL572233",
          "CHEMBL577099",
          "CHEMBL582494",
          "CHEMBL589765",
          "CHEMBL590",
          "CHEMBL592160",
          "CHEMBL592642",
          "CHEMBL592764",
          "CHEMBL595",
          "CHEMBL596254",
          "CHEMBL596690",
          "CHEMBL596693",
          "CHEMBL596955",
          "CHEMBL597371",
          "CHEMBL597372",
          "CHEMBL597373",
          "CHEMBL597472",
          "CHEMBL597716",
          "CHEMBL597768",
          "CHEMBL597769",
          "CHEMBL598096",
          "CHEMBL598151",
          "CHEMBL598321",
          "CHEMBL598393",
          "CHEMBL598394",
          "CHEMBL598395",
          "CHEMBL598720",
          "CHEMBL598746",
          "CHEMBL598913",
          "CHEMBL599148",
          "CHEMBL599149",
          "CHEMBL599545",
          "CHEMBL599547",
          "CHEMBL599761",
          "CHEMBL599762",
          "CHEMBL600384",
          "CHEMBL600385",
          "CHEMBL600390",
          "CHEMBL600391",
          "CHEMBL600392",
          "CHEMBL600596",
          "CHEMBL600597",
          "CHEMBL601205",
          "CHEMBL601843",
          "CHEMBL601844",
          "CHEMBL602048",
          "CHEMBL602141",
          "CHEMBL602259",
          "CHEMBL602260",
          "CHEMBL602464",
          "CHEMBL602465",
          "CHEMBL602466",
          "CHEMBL602880",
          "CHEMBL604043",
          "CHEMBL60720",
          "CHEMBL607571",
          "CHEMBL608141",
          "CHEMBL608438",
          "CHEMBL62743",
          "CHEMBL63223",
          "CHEMBL65252",
          "CHEMBL65761",
          "CHEMBL66639",
          "CHEMBL673",
          "CHEMBL69011",
          "CHEMBL7002",
          "CHEMBL750",
          "CHEMBL7531",
          "CHEMBL7976",
          "CHEMBL86304",
          "CHEMBL86905",
          "CHEMBL8706",
          "CHEMBL87333",
          "CHEMBL887",
          "CHEMBL903",
          "CHEMBL92401",
          "CHEMBL9687",
          "CHEMBL972"
        ],
        "number_of_missing_values": "0"
      },
      {
        "data_type": "numeric",
        "index": "1",
        "is_ignore": "false",
        "is_row_identifier": "false",
        "is_target": "false",
        "name": "FCFP4_1024b389",
        "number_of_missing_values": "0"
      },
      {
        "data_type": "numeric",
        "index": "2",
        "is_ignore": "false",
        "is_row_identifier": "false",
        "is_target": "false",
        "name": "FCFP4_1024b650",
        "number_of_missing_values": "0"
      },
      {
        "data_type": "numeric",
        "index": "3",
        "is_ignore": "false",
        "is_row_identifier": "false",
        "is_target": "false",
        "name": "FCFP4_1024b171",
        "number_of_missing_values": "0"
      },
      {
        "data_type": "numeric",
        "index": "4",
        "is_ignore": "false",
        "is_row_identifier": "false",
        "is_target": "false",
        "name": "FCFP4_1024b173",
        "number_of_missing_values": "0"
      },
      {
        "data_type": "numeric",
        "index": "5",
        "is_ignore": "false",
        "is_row_identifier": "false",
        "is_target": "false",
        "name": "FCFP4_1024b113",
        "number_of_missing_values": "0"
      },
      {
        "data_type": "numeric",
        "index": "6",
        "is_ignore": "false",
        "is_row_identifier": "false",
        "is_target": "false",
        "name": "FCFP4_1024b1003",
        "number_of_missing_values": "0"
      },
      {
        "data_type": "numeric",
        "index": "7",
        "is_ignore": "false",
        "is_row_identifier": "false",
        "is_target": "false",
        "name": "FCFP4_1024b330",
        "number_of_missing_values": "0"
      },
      {
        "data_type": "numeric",
        "index": "8",
        "is_ignore": "false",
        "is_row_identifier": "false",
        "is_target": "false",
        "name": "FCFP4_1024b375",
        "number_of_missing_values": "0"
      },
      {
        "data_type": "numeric",
        "index": "9",
        "is_ignore": "false",
        "is_row_identifier": "false",
        "is_target": "false",
        "name": "FCFP4_1024b237",
        "number_of_missing_values": "0"
      },
      {
        "data_type": "numeric",
        "index": "10",
        "is_ignore": "false",
        "is_row_identifier": "false",
        "is_target": "false",
        "name": "FCFP4_1024b357",
        "number_of_missing_values": "0"
      },
      {
        "data_type": "numeric",
        "index": "11",
        "is_ignore": "false",
        "is_row_identifier": "false",
        "is_target": "false",
        "name": "FCFP4_1024b553",
        "number_of_missing_values": "0"
      },
      {
        "data_type": "numeric",
        "index": "12",
        "is_ignore": "false",
        "is_row_identifier": "false",
        "is_target": "false",
        "name": "FCFP4_1024b787",
        "number_of_missing_values": "0"
      },
      {
        "data_type": "numeric",
        "index": "13",
        "is_ignore": "false",
        "is_row_identifier": "false",
        "is_target": "false",
        "name": "FCFP4_1024b208",
        "number_of_missing_values": "0"
      },
      {
        "data_type": "numeric",
        "index": "14",
        "is_ignore": "false",
        "is_row_identifier": "false",
        "is_target": "false",
        "name": "FCFP4_1024b169",
        "number_of_missing_values": "0"
      },
      {
        "data_type": "numeric",
        "index": "15",
        "is_ignore": "false",
        "is_row_identifier": "false",
        "is_target": "false",
        "name": "FCFP4_1024b639",
        "number_of_missing_values": "0"
      },
      {
        "data_type": "numeric",
        "index": "16",
        "is_ignore": "false",
        "is_row_identifier": "false",
        "is_target": "false",
        "name": "FCFP4_1024b889",
        "number_of_missing_values": "0"
      },
      {
        "data_type": "numeric",
        "index": "17",
        "is_ignore": "false",
        "is_row_identifier": "false",
        "is_target": "false",
        "name": "FCFP4_1024b11",
        "number_of_missing_values": "0"
      },
      {
        "data_type": "numeric",
        "index": "18",
        "is_ignore": "false",
        "is_row_identifier": "false",
        "is_target": "false",
        "name": "FCFP4_1024b642",
        "number_of_missing_values": "0"
      },
      {
        "data_type": "numeric",
        "index": "19",
        "is_ignore": "false",
        "is_row_identifier": "false",
        "is_target": "false",
        "name": "FCFP4_1024b84",
        "number_of_missing_values": "0"
      },
      {
        "data_type": "numeric",
        "index": "20",
        "is_ignore": "false",
        "is_row_identifier": "false",
        "is_target": "false",
        "name": "FCFP4_1024b885",
        "number_of_missing_values": "0"
      },
      {
        "data_type": "numeric",
        "index": "21",
        "is_ignore": "false",
        "is_row_identifier": "false",
        "is_target": "false",
        "name": "FCFP4_1024b578",
        "number_of_missing_values": "0"
      },
      {
        "data_type": "numeric",
        "index": "22",
        "is_ignore": "false",
        "is_row_identifier": "false",
        "is_target": "false",
        "name": "FCFP4_1024b1020",
        "number_of_missing_values": "0"
      },
      {
        "data_type": "numeric",
        "index": "23",
        "is_ignore": "false",
        "is_row_identifier": "false",
        "is_target": "false",
        "name": "FCFP4_1024b472",
        "number_of_missing_values": "0"
      },
      {
        "data_type": "numeric",
        "index": "24",
        "is_ignore": "false",
        "is_row_identifier": "false",
        "is_target": "false",
        "name": "FCFP4_1024b822",
        "number_of_missing_values": "0"
      },
      {
        "data_type": "numeric",
        "index": "25",
        "is_ignore": "false",
        "is_row_identifier": "false",
        "is_target": "false",
        "name": "FCFP4_1024b438",
        "number_of_missing_values": "0"
      },
      {
        "data_type": "numeric",
        "index": "26",
        "is_ignore": "false",
        "is_row_identifier": "false",
        "is_target": "false",
        "name": "FCFP4_1024b660",
        "number_of_missing_values": "0"
      },
      {
        "data_type": "numeric",
        "index": "27",
        "is_ignore": "false",
        "is_row_identifier": "false",
        "is_target": "false",
        "name": "FCFP4_1024b214",
        "number_of_missing_values": "0"
      },
      {
        "data_type": "numeric",
        "index": "28",
        "is_ignore": "false",
        "is_row_identifier": "false",
        "is_target": "false",
        "name": "FCFP4_1024b85",
        "number_of_missing_values": "0"
      },
      {
        "data_type": "numeric",
        "index": "29",
        "is_ignore": "false",
        "is_row_identifier": "false",
        "is_target": "false",
        "name": "FCFP4_1024b1",
        "number_of_missing_values": "0"
      },
      {
        "data_type": "numeric",
        "index": "30",
        "is_ignore": "false",
        "is_row_identifier": "false",
        "is_target": "false",
        "name": "FCFP4_1024b10",
        "number_of_missing_values": "0"
      },
      {
        "data_type": "numeric",
        "index": "31",
        "is_ignore": "false",
        "is_row_identifier": "false",
        "is_target": "false",
        "name": "FCFP4_1024b100",
        "number_of_missing_values": "0"
      },
      {
        "data_type": "numeric",
        "index": "32",
        "is_ignore": "false",
        "is_row_identifier": "false",
        "is_target": "false",
        "name": "FCFP4_1024b1000",
        "number_of_missing_values": "0"
      },
      {
        "data_type": "numeric",
        "index": "33",
        "is_ignore": "false",
        "is_row_identifier": "false",
        "is_target": "false",
        "name": "FCFP4_1024b1001",
        "number_of_missing_values": "0"
      },
      {
        "data_type": "numeric",
        "index": "34",
        "is_ignore": "false",
        "is_row_identifier": "false",
        "is_target": "false",
        "name": "FCFP4_1024b1002",
        "number_of_missing_values": "0"
      },
      {
        "data_type": "numeric",
        "index": "35",
        "is_ignore": "false",
        "is_row_identifier": "false",
        "is_target": "false",
        "name": "FCFP4_1024b1004",
        "number_of_missing_values": "0"
      },
      {
        "data_type": "numeric",
        "index": "36",
        "is_ignore": "false",
        "is_row_identifier": "false",
        "is_target": "false",
        "name": "FCFP4_1024b1005",
        "number_of_missing_values": "0"
      },
      {
        "data_type": "numeric",
        "index": "37",
        "is_ignore": "false",
        "is_row_identifier": "false",
        "is_target": "false",
        "name": "FCFP4_1024b1006",
        "number_of_missing_values": "0"
      },
      {
        "data_type": "numeric",
        "index": "38",
        "is_ignore": "false",
        "is_row_identifier": "false",
        "is_target": "false",
        "name": "FCFP4_1024b1007",
        "number_of_missing_values": "0"
      },
      {
        "data_type": "numeric",
        "index": "39",
        "is_ignore": "false",
        "is_row_identifier": "false",
        "is_target": "false",
        "name": "FCFP4_1024b1008",
        "number_of_missing_values": "0"
      },
      {
        "data_type": "numeric",
        "index": "40",
        "is_ignore": "false",
        "is_row_identifier": "false",
        "is_target": "false",
        "name": "FCFP4_1024b1009",
        "number_of_missing_values": "0"
      },
      {
        "data_type": "numeric",
        "index": "41",
        "is_ignore": "false",
        "is_row_identifier": "false",
        "is_target": "false",
        "name": "FCFP4_1024b101",
        "number_of_missing_values": "0"
      },
      {
        "data_type": "numeric",
        "index": "42",
        "is_ignore": "false",
        "is_row_identifier": "false",
        "is_target": "false",
        "name": "FCFP4_1024b1010",
        "number_of_missing_values": "0"
      },
      {
        "data_type": "numeric",
        "index": "43",
        "is_ignore": "false",
        "is_row_identifier": "false",
        "is_target": "false",
        "name": "FCFP4_1024b1011",
        "number_of_missing_values": "0"
      },
      {
        "data_type": "numeric",
        "index": "44",
        "is_ignore": "false",
        "is_row_identifier": "false",
        "is_target": "false",
        "name": "FCFP4_1024b1012",
        "number_of_missing_values": "0"
      },
      {
        "data_type": "numeric",
        "index": "45",
        "is_ignore": "false",
        "is_row_identifier": "false",
        "is_target": "false",
        "name": "FCFP4_1024b1013",
        "number_of_missing_values": "0"
      },
      {
        "data_type": "numeric",
        "index": "46",
        "is_ignore": "false",
        "is_row_identifier": "false",
        "is_target": "false",
        "name": "FCFP4_1024b1014",
        "number_of_missing_values": "0"
      },
      {
        "data_type": "numeric",
        "index": "47",
        "is_ignore": "false",
        "is_row_identifier": "false",
        "is_target": "false",
        "name": "FCFP4_1024b1015",
        "number_of_missing_values": "0"
      },
      {
        "data_type": "numeric",
        "index": "48",
        "is_ignore": "false",
        "is_row_identifier": "false",
        "is_target": "false",
        "name": "FCFP4_1024b1016",
        "number_of_missing_values": "0"
      },
      {
        "data_type": "numeric",
        "index": "49",
        "is_ignore": "false",
        "is_row_identifier": "false",
        "is_target": "false",
        "name": "FCFP4_1024b1017",
        "number_of_missing_values": "0"
      },
      {
        "data_type": "numeric",
        "index": "50",
        "is_ignore": "false",
        "is_row_identifier": "false",
        "is_target": "false",
        "name": "FCFP4_1024b1018",
        "number_of_missing_values": "0"
      },
      {
        "data_type": "numeric",
        "index": "51",
        "is_ignore": "false",
        "is_row_identifier": "false",
        "is_target": "false",
        "name": "FCFP4_1024b1019",
        "number_of_missing_values": "0"
      },
      {
        "data_type": "numeric",
        "index": "52",
        "is_ignore": "false",
        "is_row_identifier": "false",
        "is_target": "false",
        "name": "FCFP4_1024b102",
        "number_of_missing_values": "0"
      },
      {
        "data_type": "numeric",
        "index": "53",
        "is_ignore": "false",
        "is_row_identifier": "false",
        "is_target": "false",
        "name": "FCFP4_1024b1021",
        "number_of_missing_values": "0"
      },
      {
        "data_type": "numeric",
        "index": "54",
        "is_ignore": "false",
        "is_row_identifier": "false",
        "is_target": "false",
        "name": "FCFP4_1024b1022",
        "number_of_missing_values": "0"
      },
      {
        "data_type": "numeric",
        "index": "55",
        "is_ignore": "false",
        "is_row_identifier": "false",
        "is_target": "false",
        "name": "FCFP4_1024b1023",
        "number_of_missing_values": "0"
      },
      {
        "data_type": "numeric",
        "index": "56",
        "is_ignore": "false",
        "is_row_identifier": "false",
        "is_target": "false",
        "name": "FCFP4_1024b1024",
        "number_of_missing_values": "0"
      },
      {
        "data_type": "numeric",
        "index": "57",
        "is_ignore": "false",
        "is_row_identifier": "false",
        "is_target": "false",
        "name": "FCFP4_1024b103",
        "number_of_missing_values": "0"
      },
      {
        "data_type": "numeric",
        "index": "58",
        "is_ignore": "false",
        "is_row_identifier": "false",
        "is_target": "false",
        "name": "FCFP4_1024b104",
        "number_of_missing_values": "0"
      },
      {
        "data_type": "numeric",
        "index": "59",
        "is_ignore": "false",
        "is_row_identifier": "false",
        "is_target": "false",
        "name": "FCFP4_1024b105",
        "number_of_missing_values": "0"
      },
      {
        "data_type": "numeric",
        "index": "60",
        "is_ignore": "false",
        "is_row_identifier": "false",
        "is_target": "false",
        "name": "FCFP4_1024b106",
        "number_of_missing_values": "0"
      },
      {
        "data_type": "numeric",
        "index": "61",
        "is_ignore": "false",
        "is_row_identifier": "false",
        "is_target": "false",
        "name": "FCFP4_1024b107",
        "number_of_missing_values": "0"
      },
      {
        "data_type": "numeric",
        "index": "62",
        "is_ignore": "false",
        "is_row_identifier": "false",
        "is_target": "false",
        "name": "FCFP4_1024b108",
        "number_of_missing_values": "0"
      },
      {
        "data_type": "numeric",
        "index": "63",
        "is_ignore": "false",
        "is_row_identifier": "false",
        "is_target": "false",
        "name": "FCFP4_1024b109",
        "number_of_missing_values": "0"
      },
      {
        "data_type": "numeric",
        "index": "64",
        "is_ignore": "false",
        "is_row_identifier": "false",
        "is_target": "false",
        "name": "FCFP4_1024b110",
        "number_of_missing_values": "0"
      },
      {
        "data_type": "numeric",
        "index": "65",
        "is_ignore": "false",
        "is_row_identifier": "false",
        "is_target": "false",
        "name": "FCFP4_1024b111",
        "number_of_missing_values": "0"
      },
      {
        "data_type": "numeric",
        "index": "66",
        "is_ignore": "false",
        "is_row_identifier": "false",
        "is_target": "false",
        "name": "FCFP4_1024b112",
        "number_of_missing_values": "0"
      },
      {
        "data_type": "numeric",
        "index": "67",
        "is_ignore": "false",
        "is_row_identifier": "false",
        "is_target": "false",
        "name": "FCFP4_1024b114",
        "number_of_missing_values": "0"
      },
      {
        "data_type": "numeric",
        "index": "68",
        "is_ignore": "false",
        "is_row_identifier": "false",
        "is_target": "false",
        "name": "FCFP4_1024b115",
        "number_of_missing_values": "0"
      },
      {
        "data_type": "numeric",
        "index": "69",
        "is_ignore": "false",
        "is_row_identifier": "false",
        "is_target": "false",
        "name": "FCFP4_1024b116",
        "number_of_missing_values": "0"
      },
      {
        "data_type": "numeric",
        "index": "70",
        "is_ignore": "false",
        "is_row_identifier": "false",
        "is_target": "false",
        "name": "FCFP4_1024b117",
        "number_of_missing_values": "0"
      },
      {
        "data_type": "numeric",
        "index": "71",
        "is_ignore": "false",
        "is_row_identifier": "false",
        "is_target": "false",
        "name": "FCFP4_1024b118",
        "number_of_missing_values": "0"
      },
      {
        "data_type": "numeric",
        "index": "72",
        "is_ignore": "false",
        "is_row_identifier": "false",
        "is_target": "false",
        "name": "FCFP4_1024b119",
        "number_of_missing_values": "0"
      },
      {
        "data_type": "numeric",
        "index": "73",
        "is_ignore": "false",
        "is_row_identifier": "false",
        "is_target": "false",
        "name": "FCFP4_1024b12",
        "number_of_missing_values": "0"
      },
      {
        "data_type": "numeric",
        "index": "74",
        "is_ignore": "false",
        "is_row_identifier": "false",
        "is_target": "false",
        "name": "FCFP4_1024b120",
        "number_of_missing_values": "0"
      },
      {
        "data_type": "numeric",
        "index": "75",
        "is_ignore": "false",
        "is_row_identifier": "false",
        "is_target": "false",
        "name": "FCFP4_1024b121",
        "number_of_missing_values": "0"
      },
      {
        "data_type": "numeric",
        "index": "76",
        "is_ignore": "false",
        "is_row_identifier": "false",
        "is_target": "false",
        "name": "FCFP4_1024b122",
        "number_of_missing_values": "0"
      },
      {
        "data_type": "numeric",
        "index": "77",
        "is_ignore": "false",
        "is_row_identifier": "false",
        "is_target": "false",
        "name": "FCFP4_1024b123",
        "number_of_missing_values": "0"
      },
      {
        "data_type": "numeric",
        "index": "78",
        "is_ignore": "false",
        "is_row_identifier": "false",
        "is_target": "false",
        "name": "FCFP4_1024b124",
        "number_of_missing_values": "0"
      },
      {
        "data_type": "numeric",
        "index": "79",
        "is_ignore": "false",
        "is_row_identifier": "false",
        "is_target": "false",
        "name": "FCFP4_1024b125",
        "number_of_missing_values": "0"
      },
      {
        "data_type": "numeric",
        "index": "80",
        "is_ignore": "false",
        "is_row_identifier": "false",
        "is_target": "false",
        "name": "FCFP4_1024b126",
        "number_of_missing_values": "0"
      },
      {
        "data_type": "numeric",
        "index": "81",
        "is_ignore": "false",
        "is_row_identifier": "false",
        "is_target": "false",
        "name": "FCFP4_1024b127",
        "number_of_missing_values": "0"
      },
      {
        "data_type": "numeric",
        "index": "82",
        "is_ignore": "false",
        "is_row_identifier": "false",
        "is_target": "false",
        "name": "FCFP4_1024b128",
        "number_of_missing_values": "0"
      },
      {
        "data_type": "numeric",
        "index": "83",
        "is_ignore": "false",
        "is_row_identifier": "false",
        "is_target": "false",
        "name": "FCFP4_1024b129",
        "number_of_missing_values": "0"
      },
      {
        "data_type": "numeric",
        "index": "84",
        "is_ignore": "false",
        "is_row_identifier": "false",
        "is_target": "false",
        "name": "FCFP4_1024b13",
        "number_of_missing_values": "0"
      },
      {
        "data_type": "numeric",
        "index": "85",
        "is_ignore": "false",
        "is_row_identifier": "false",
        "is_target": "false",
        "name": "FCFP4_1024b130",
        "number_of_missing_values": "0"
      },
      {
        "data_type": "numeric",
        "index": "86",
        "is_ignore": "false",
        "is_row_identifier": "false",
        "is_target": "false",
        "name": "FCFP4_1024b131",
        "number_of_missing_values": "0"
      },
      {
        "data_type": "numeric",
        "index": "87",
        "is_ignore": "false",
        "is_row_identifier": "false",
        "is_target": "false",
        "name": "FCFP4_1024b132",
        "number_of_missing_values": "0"
      },
      {
        "data_type": "numeric",
        "index": "88",
        "is_ignore": "false",
        "is_row_identifier": "false",
        "is_target": "false",
        "name": "FCFP4_1024b133",
        "number_of_missing_values": "0"
      },
      {
        "data_type": "numeric",
        "index": "89",
        "is_ignore": "false",
        "is_row_identifier": "false",
        "is_target": "false",
        "name": "FCFP4_1024b134",
        "number_of_missing_values": "0"
      },
      {
        "data_type": "numeric",
        "index": "90",
        "is_ignore": "false",
        "is_row_identifier": "false",
        "is_target": "false",
        "name": "FCFP4_1024b135",
        "number_of_missing_values": "0"
      },
      {
        "data_type": "numeric",
        "index": "91",
        "is_ignore": "false",
        "is_row_identifier": "false",
        "is_target": "false",
        "name": "FCFP4_1024b136",
        "number_of_missing_values": "0"
      },
      {
        "data_type": "numeric",
        "index": "92",
        "is_ignore": "false",
        "is_row_identifier": "false",
        "is_target": "false",
        "name": "FCFP4_1024b137",
        "number_of_missing_values": "0"
      },
      {
        "data_type": "numeric",
        "index": "93",
        "is_ignore": "false",
        "is_row_identifier": "false",
        "is_target": "false",
        "name": "FCFP4_1024b138",
        "number_of_missing_values": "0"
      },
      {
        "data_type": "numeric",
        "index": "94",
        "is_ignore": "false",
        "is_row_identifier": "false",
        "is_target": "false",
        "name": "FCFP4_1024b139",
        "number_of_missing_values": "0"
      },
      {
        "data_type": "numeric",
        "index": "95",
        "is_ignore": "false",
        "is_row_identifier": "false",
        "is_target": "false",
        "name": "FCFP4_1024b14",
        "number_of_missing_values": "0"
      },
      {
        "data_type": "numeric",
        "index": "96",
        "is_ignore": "false",
        "is_row_identifier": "false",
        "is_target": "false",
        "name": "FCFP4_1024b140",
        "number_of_missing_values": "0"
      },
      {
        "data_type": "numeric",
        "index": "97",
        "is_ignore": "false",
        "is_row_identifier": "false",
        "is_target": "false",
        "name": "FCFP4_1024b141",
        "number_of_missing_values": "0"
      },
      {
        "data_type": "numeric",
        "index": "98",
        "is_ignore": "false",
        "is_row_identifier": "false",
        "is_target": "false",
        "name": "FCFP4_1024b142",
        "number_of_missing_values": "0"
      },
      {
        "data_type": "numeric",
        "index": "99",
        "is_ignore": "false",
        "is_row_identifier": "false",
        "is_target": "false",
        "name": "FCFP4_1024b143",
        "number_of_missing_values": "0"
      },
      {
        "data_type": "numeric",
        "index": "100",
        "is_ignore": "false",
        "is_row_identifier": "false",
        "is_target": "false",
        "name": "FCFP4_1024b144",
        "number_of_missing_values": "0"
      },
      {
        "data_type": "numeric",
        "index": "101",
        "is_ignore": "false",
        "is_row_identifier": "false",
        "is_target": "false",
        "name": "FCFP4_1024b145",
        "number_of_missing_values": "0"
      },
      {
        "data_type": "numeric",
        "index": "102",
        "is_ignore": "false",
        "is_row_identifier": "false",
        "is_target": "false",
        "name": "FCFP4_1024b146",
        "number_of_missing_values": "0"
      },
      {
        "data_type": "numeric",
        "index": "103",
        "is_ignore": "false",
        "is_row_identifier": "false",
        "is_target": "false",
        "name": "FCFP4_1024b147",
        "number_of_missing_values": "0"
      },
      {
        "data_type": "numeric",
        "index": "104",
        "is_ignore": "false",
        "is_row_identifier": "false",
        "is_target": "false",
        "name": "FCFP4_1024b148",
        "number_of_missing_values": "0"
      },
      {
        "data_type": "numeric",
        "index": "105",
        "is_ignore": "false",
        "is_row_identifier": "false",
        "is_target": "false",
        "name": "FCFP4_1024b149",
        "number_of_missing_values": "0"
      },
      {
        "data_type": "numeric",
        "index": "106",
        "is_ignore": "false",
        "is_row_identifier": "false",
        "is_target": "false",
        "name": "FCFP4_1024b15",
        "number_of_missing_values": "0"
      },
      {
        "data_type": "numeric",
        "index": "107",
        "is_ignore": "false",
        "is_row_identifier": "false",
        "is_target": "false",
        "name": "FCFP4_1024b150",
        "number_of_missing_values": "0"
      },
      {
        "data_type": "numeric",
        "index": "108",
        "is_ignore": "false",
        "is_row_identifier": "false",
        "is_target": "false",
        "name": "FCFP4_1024b151",
        "number_of_missing_values": "0"
      },
      {
        "data_type": "numeric",
        "index": "109",
        "is_ignore": "false",
        "is_row_identifier": "false",
        "is_target": "false",
        "name": "FCFP4_1024b152",
        "number_of_missing_values": "0"
      },
      {
        "data_type": "numeric",
        "index": "110",
        "is_ignore": "false",
        "is_row_identifier": "false",
        "is_target": "false",
        "name": "FCFP4_1024b153",
        "number_of_missing_values": "0"
      },
      {
        "data_type": "numeric",
        "index": "111",
        "is_ignore": "false",
        "is_row_identifier": "false",
        "is_target": "false",
        "name": "FCFP4_1024b154",
        "number_of_missing_values": "0"
      },
      {
        "data_type": "numeric",
        "index": "112",
        "is_ignore": "false",
        "is_row_identifier": "false",
        "is_target": "false",
        "name": "FCFP4_1024b155",
        "number_of_missing_values": "0"
      },
      {
        "data_type": "numeric",
        "index": "113",
        "is_ignore": "false",
        "is_row_identifier": "false",
        "is_target": "false",
        "name": "FCFP4_1024b156",
        "number_of_missing_values": "0"
      },
      {
        "data_type": "numeric",
        "index": "114",
        "is_ignore": "false",
        "is_row_identifier": "false",
        "is_target": "false",
        "name": "FCFP4_1024b157",
        "number_of_missing_values": "0"
      },
      {
        "data_type": "numeric",
        "index": "115",
        "is_ignore": "false",
        "is_row_identifier": "false",
        "is_target": "false",
        "name": "FCFP4_1024b158",
        "number_of_missing_values": "0"
      },
      {
        "data_type": "numeric",
        "index": "116",
        "is_ignore": "false",
        "is_row_identifier": "false",
        "is_target": "false",
        "name": "FCFP4_1024b159",
        "number_of_missing_values": "0"
      },
      {
        "data_type": "numeric",
        "index": "117",
        "is_ignore": "false",
        "is_row_identifier": "false",
        "is_target": "false",
        "name": "FCFP4_1024b16",
        "number_of_missing_values": "0"
      },
      {
        "data_type": "numeric",
        "index": "118",
        "is_ignore": "false",
        "is_row_identifier": "false",
        "is_target": "false",
        "name": "FCFP4_1024b160",
        "number_of_missing_values": "0"
      },
      {
        "data_type": "numeric",
        "index": "119",
        "is_ignore": "false",
        "is_row_identifier": "false",
        "is_target": "false",
        "name": "FCFP4_1024b161",
        "number_of_missing_values": "0"
      },
      {
        "data_type": "numeric",
        "index": "120",
        "is_ignore": "false",
        "is_row_identifier": "false",
        "is_target": "false",
        "name": "FCFP4_1024b162",
        "number_of_missing_values": "0"
      },
      {
        "data_type": "numeric",
        "index": "121",
        "is_ignore": "false",
        "is_row_identifier": "false",
        "is_target": "false",
        "name": "FCFP4_1024b163",
        "number_of_missing_values": "0"
      },
      {
        "data_type": "numeric",
        "index": "122",
        "is_ignore": "false",
        "is_row_identifier": "false",
        "is_target": "false",
        "name": "FCFP4_1024b164",
        "number_of_missing_values": "0"
      },
      {
        "data_type": "numeric",
        "index": "123",
        "is_ignore": "false",
        "is_row_identifier": "false",
        "is_target": "false",
        "name": "FCFP4_1024b165",
        "number_of_missing_values": "0"
      },
      {
        "data_type": "numeric",
        "index": "124",
        "is_ignore": "false",
        "is_row_identifier": "false",
        "is_target": "false",
        "name": "FCFP4_1024b166",
        "number_of_missing_values": "0"
      },
      {
        "data_type": "numeric",
        "index": "125",
        "is_ignore": "false",
        "is_row_identifier": "false",
        "is_target": "false",
        "name": "FCFP4_1024b167",
        "number_of_missing_values": "0"
      },
      {
        "data_type": "numeric",
        "index": "126",
        "is_ignore": "false",
        "is_row_identifier": "false",
        "is_target": "false",
        "name": "FCFP4_1024b168",
        "number_of_missing_values": "0"
      },
      {
        "data_type": "numeric",
        "index": "127",
        "is_ignore": "false",
        "is_row_identifier": "false",
        "is_target": "false",
        "name": "FCFP4_1024b17",
        "number_of_missing_values": "0"
      },
      {
        "data_type": "numeric",
        "index": "128",
        "is_ignore": "false",
        "is_row_identifier": "false",
        "is_target": "false",
        "name": "FCFP4_1024b170",
        "number_of_missing_values": "0"
      },
      {
        "data_type": "numeric",
        "index": "129",
        "is_ignore": "false",
        "is_row_identifier": "false",
        "is_target": "false",
        "name": "FCFP4_1024b172",
        "number_of_missing_values": "0"
      },
      {
        "data_type": "numeric",
        "index": "130",
        "is_ignore": "false",
        "is_row_identifier": "false",
        "is_target": "false",
        "name": "FCFP4_1024b174",
        "number_of_missing_values": "0"
      },
      {
        "data_type": "numeric",
        "index": "131",
        "is_ignore": "false",
        "is_row_identifier": "false",
        "is_target": "false",
        "name": "FCFP4_1024b175",
        "number_of_missing_values": "0"
      },
      {
        "data_type": "numeric",
        "index": "132",
        "is_ignore": "false",
        "is_row_identifier": "false",
        "is_target": "false",
        "name": "FCFP4_1024b176",
        "number_of_missing_values": "0"
      },
      {
        "data_type": "numeric",
        "index": "133",
        "is_ignore": "false",
        "is_row_identifier": "false",
        "is_target": "false",
        "name": "FCFP4_1024b177",
        "number_of_missing_values": "0"
      },
      {
        "data_type": "numeric",
        "index": "134",
        "is_ignore": "false",
        "is_row_identifier": "false",
        "is_target": "false",
        "name": "FCFP4_1024b178",
        "number_of_missing_values": "0"
      },
      {
        "data_type": "numeric",
        "index": "135",
        "is_ignore": "false",
        "is_row_identifier": "false",
        "is_target": "false",
        "name": "FCFP4_1024b179",
        "number_of_missing_values": "0"
      },
      {
        "data_type": "numeric",
        "index": "136",
        "is_ignore": "false",
        "is_row_identifier": "false",
        "is_target": "false",
        "name": "FCFP4_1024b18",
        "number_of_missing_values": "0"
      },
      {
        "data_type": "numeric",
        "index": "137",
        "is_ignore": "false",
        "is_row_identifier": "false",
        "is_target": "false",
        "name": "FCFP4_1024b180",
        "number_of_missing_values": "0"
      },
      {
        "data_type": "numeric",
        "index": "138",
        "is_ignore": "false",
        "is_row_identifier": "false",
        "is_target": "false",
        "name": "FCFP4_1024b181",
        "number_of_missing_values": "0"
      },
      {
        "data_type": "numeric",
        "index": "139",
        "is_ignore": "false",
        "is_row_identifier": "false",
        "is_target": "false",
        "name": "FCFP4_1024b182",
        "number_of_missing_values": "0"
      },
      {
        "data_type": "numeric",
        "index": "140",
        "is_ignore": "false",
        "is_row_identifier": "false",
        "is_target": "false",
        "name": "FCFP4_1024b183",
        "number_of_missing_values": "0"
      },
      {
        "data_type": "numeric",
        "index": "141",
        "is_ignore": "false",
        "is_row_identifier": "false",
        "is_target": "false",
        "name": "FCFP4_1024b184",
        "number_of_missing_values": "0"
      },
      {
        "data_type": "numeric",
        "index": "142",
        "is_ignore": "false",
        "is_row_identifier": "false",
        "is_target": "false",
        "name": "FCFP4_1024b185",
        "number_of_missing_values": "0"
      },
      {
        "data_type": "numeric",
        "index": "143",
        "is_ignore": "false",
        "is_row_identifier": "false",
        "is_target": "false",
        "name": "FCFP4_1024b186",
        "number_of_missing_values": "0"
      },
      {
        "data_type": "numeric",
        "index": "144",
        "is_ignore": "false",
        "is_row_identifier": "false",
        "is_target": "false",
        "name": "FCFP4_1024b187",
        "number_of_missing_values": "0"
      },
      {
        "data_type": "numeric",
        "index": "145",
        "is_ignore": "false",
        "is_row_identifier": "false",
        "is_target": "false",
        "name": "FCFP4_1024b188",
        "number_of_missing_values": "0"
      },
      {
        "data_type": "numeric",
        "index": "146",
        "is_ignore": "false",
        "is_row_identifier": "false",
        "is_target": "false",
        "name": "FCFP4_1024b189",
        "number_of_missing_values": "0"
      },
      {
        "data_type": "numeric",
        "index": "147",
        "is_ignore": "false",
        "is_row_identifier": "false",
        "is_target": "false",
        "name": "FCFP4_1024b19",
        "number_of_missing_values": "0"
      },
      {
        "data_type": "numeric",
        "index": "148",
        "is_ignore": "false",
        "is_row_identifier": "false",
        "is_target": "false",
        "name": "FCFP4_1024b190",
        "number_of_missing_values": "0"
      },
      {
        "data_type": "numeric",
        "index": "149",
        "is_ignore": "false",
        "is_row_identifier": "false",
        "is_target": "false",
        "name": "FCFP4_1024b191",
        "number_of_missing_values": "0"
      },
      {
        "data_type": "numeric",
        "index": "150",
        "is_ignore": "false",
        "is_row_identifier": "false",
        "is_target": "false",
        "name": "FCFP4_1024b192",
        "number_of_missing_values": "0"
      },
      {
        "data_type": "numeric",
        "index": "151",
        "is_ignore": "false",
        "is_row_identifier": "false",
        "is_target": "false",
        "name": "FCFP4_1024b193",
        "number_of_missing_values": "0"
      },
      {
        "data_type": "numeric",
        "index": "152",
        "is_ignore": "false",
        "is_row_identifier": "false",
        "is_target": "false",
        "name": "FCFP4_1024b194",
        "number_of_missing_values": "0"
      },
      {
        "data_type": "numeric",
        "index": "153",
        "is_ignore": "false",
        "is_row_identifier": "false",
        "is_target": "false",
        "name": "FCFP4_1024b195",
        "number_of_missing_values": "0"
      },
      {
        "data_type": "numeric",
        "index": "154",
        "is_ignore": "false",
        "is_row_identifier": "false",
        "is_target": "false",
        "name": "FCFP4_1024b196",
        "number_of_missing_values": "0"
      },
      {
        "data_type": "numeric",
        "index": "155",
        "is_ignore": "false",
        "is_row_identifier": "false",
        "is_target": "true",
        "name": "pXC50",
        "number_of_missing_values": "0"
      }
    ]
  }
}