"molecule_id","AMW","C.","H.","Me","Mi","Mp","Mv","MW","N.","nAB","nAT","nB","nBM","nBO","nBR","nBT","nC","nCL","nCsp","nCsp2","nCsp3","nDB","nF","nH","nHet","nHM","nI","nN","nO","nP","nS","nSK","nTB","nX","O.","RBF","RBN","SCBO","Se","Si","Sp","Sv","X.","pXC50"
{1 9.987,2 29.6,3 37,4 1.055,5 1.136,6 0.688,7 0.661,8 539.3,9 5.6,10 12,11 54,13 17,14 35,16 55,17 16,20 12,21 4,22 5,24 20,25 18,26 3,28 3,29 12,30 3,32 34,35 22.2,36 0.182,37 10,38 46,39 56.993,40 61.331,41 37.13,42 35.681,44 8.301}
{0 CHEMBL116926,1 9.244,2 36.8,3 36.8,4 1.041,5 1.131,6 0.684,7 0.669,8 351.28,9 7.9,10 12,11 38,13 15,14 25,16 39,17 14,20 12,21 2,22 3,24 14,25 10,26 1,28 3,29 6,30 1,32 24,35 15.8,36 0.154,37 6,38 34,39 39.545,40 42.966,41 25.994,42 25.438,44 7.377}
{0 CHEMBL117766,1 9.147,2 37.2,3 37.2,4 1.041,5 1.13,6 0.679,7 0.667,8 393.32,9 7,10 12,11 43,13 16,14 28,16 44,17 16,20 13,21 3,22 4,24 16,25 11,26 1,28 3,29 7,30 1,32 27,35 16.3,36 0.159,37 7,38 38,39 44.756,40 48.591,41 29.21,42 28.679,44 7.699}
{0 CHEMBL118007,1 9.874,2 30.2,3 37.7,4 1.05,5 1.134,6 0.692,7 0.66,8 523.3,9 5.7,10 12,11 53,13 17,14 34,16 54,17 16,20 12,21 4,22 5,24 20,25 17,26 3,28 3,29 11,30 3,32 33,35 20.8,36 0.167,37 9,38 45,39 55.666,40 60.121,41 36.676,42 34.966,44 7.377}
{0 CHEMBL119180,1 9.482,2 37.5,3 35,4 1.047,5 1.129,6 0.686,7 0.679,8 379.29,9 7.5,10 12,11 40,13 16,14 27,16 41,17 15,20 13,21 2,22 4,24 14,25 11,26 1,28 3,29 7,30 1,32 26,35 17.5,36 0.146,37 6,38 37,39 41.873,40 45.176,41 27.449,42 27.152,44 8.092}
{0 CHEMBL119235,1 9.641,2 36.6,3 34.1,4 1.054,5 1.131,6 0.681,7 0.68,8 395.29,9 7.3,10 12,11 41,13 16,14 28,16 42,17 15,20 13,21 2,22 4,24 14,25 12,26 1,28 3,29 8,30 1,32 27,35 19.5,36 0.167,37 7,38 38,39 43.2,40 46.385,41 27.903,42 27.867,44 8.027}
{0 CHEMBL119416,1 11.009,2 31.1,3 31.1,4 1.074,5 1.13,6 0.701,7 0.697,8 495.42,9 6.7,10 12,11 45,13 19,14 32,16 46,17 14,20 12,21 2,22 7,24 14,25 17,26 3,28 3,29 11,30 1,31 2,32 31,35 24.4,36 0.152,37 7,38 45,39 48.335,40 50.853,41 31.562,42 31.386,44 7.959}
{0 CHEMBL130059,1 9.889,2 44.9,3 32.7,4 1.037,5 1.106,6 0.731,7 0.716,8 484.54,9 4.1,10 18,11 49,13 25,14 36,16 52,17 22,20 22,22 7,24 16,25 11,26 2,28 2,29 7,31 2,32 33,35 14.3,36 0.096,37 5,38 52,39 50.833,40 54.209,41 35.818,42 35.108,44 5.125}
{0 CHEMBL130094,1 8.277,2 28.6,3 46.4,4 1.028,5 1.146,6 0.641,7 0.607,8 463.51,9 8.9,10 10,11 56,13 11,14 32,16 58,17 16,20 5,21 11,22 1,24 26,25 14,26 2,28 5,29 7,30 1,31 1,32 30,35 12.5,36 0.172,37 10,38 38,39 57.571,40 64.168,41 35.915,42 34.016,44 6.076}
{0 CHEMBL130916,1 10.933,2 23.8,3 32.1,4 1.085,5 1.15,6 0.673,7 0.67,8 918.4,9 9.5,10 20,11 84,13 25,14 62,16 89,17 20,20 10,21 10,22 5,24 27,25 37,26 5,28 8,29 24,30 5,32 57,35 28.6,36 0.18,37 16,38 77,39 91.146,40 96.613,41 56.499,42 56.266,44 8.824}
{0 CHEMBL131091,1 11.231,2 33.3,3 27.8,4 1.082,5 1.129,6 0.702,7 0.714,8 606.48,9 7.4,10 17,11 54,13 26,14 41,16 56,17 18,20 16,21 2,22 9,24 15,25 21,26 3,28 4,29 14,30 1,31 2,32 39,35 25.9,36 0.161,37 9,38 58.5,39 58.418,40 60.98,41 37.931,42 38.551,44 7.854}
{0 CHEMBL131271,1 11.59,2 41.8,3 25.5,4 1.063,5 1.118,6 0.754,7 0.755,8 637.47,9 10.9,10 24,11 55,13 30,14 45,16 59,17 23,18 2,20 23,22 6,24 14,25 18,26 4,28 6,29 8,31 2,32 41,34 2,35 14.5,36 0.102,37 6,38 63,39 58.447,40 61.469,41 41.488,42 41.51,43 3.6,44 5.056}
{0 CHEMBL133572,1 11.59,2 41.8,3 25.5,4 1.063,5 1.118,6 0.754,7 0.755,8 637.47,9 10.9,10 24,11 55,13 30,14 45,16 59,17 23,18 2,20 23,22 6,24 14,25 18,26 4,28 6,29 8,31 2,32 41,34 2,35 14.5,36 0.102,37 6,38 63,39 58.447,40 61.469,41 41.488,42 41.51,43 3.6,44 5.796}
{0 CHEMBL133576,1 8.559,2 45.1,3 39.2,4 1.017,5 1.112,6 0.702,7 0.677,8 436.52,9 3.9,10 18,11 51,13 22,14 34,16 54,17 23,20 20,21 3,22 4,24 20,25 8,26 1,28 2,29 5,31 1,32 31,35 9.8,36 0.056,37 3,38 47,39 51.869,40 56.7,41 35.784,42 34.545,44 4}
{0 CHEMBL134193,1 10.905,2 40.8,3 28.2,4 1.057,5 1.118,6 0.735,7 0.734,8 774.22,9 9.9,10 30,11 71,13 38,14 56,16 76,17 29,18 1,20 29,22 8,24 20,25 22,26 4,28 7,29 11,31 3,32 51,34 1,35 15.5,36 0.118,37 9,38 79,39 75.051,40 79.402,41 52.17,42 52.089,43 1.4,44 5.407}
{0 CHEMBL1672104,1 11.59,2 41.8,3 25.5,4 1.063,5 1.118,6 0.754,7 0.755,8 637.47,9 10.9,10 24,11 55,13 30,14 45,16 59,17 23,18 2,20 23,22 6,24 14,25 18,26 4,28 6,29 8,31 2,32 41,34 2,35 14.5,36 0.102,37 6,38 63,39 58.447,40 61.469,41 41.488,42 41.51,43 3.6,44 6.375}
{0 CHEMBL265502,1 10.297,2 40.5,3 31.7,4 1.053,5 1.114,6 0.717,7 0.711,8 1297.39,9 4.8,10 46,11 126,13 63,14 93,16 133,17 51,20 49,21 2,22 17,24 40,25 35,26 6,28 6,29 23,31 6,32 86,35 18.3,36 0.12,37 16,38 133,39 132.618,40 140.384,41 90.318,42 89.647,44 6}
{0 CHEMBL304765,1 11.009,2 31.1,3 31.1,4 1.074,5 1.13,6 0.701,7 0.697,8 495.42,9 6.7,10 12,11 45,13 18,14 33,16 47,17 14,20 11,21 3,22 6,24 14,25 17,26 3,28 3,29 11,30 1,31 2,32 31,35 24.4,36 0.085,37 4,38 45,39 48.335,40 50.853,41 31.562,42 31.386,44 4.991}
{0 CHEMBL331250,1 9.887,2 33.3,3 35.7,4 1.049,5 1.132,6 0.699,7 0.674,8 415.26,9 7.1,10 12,11 42,13 16,14 28,16 43,17 14,20 12,21 2,22 4,24 15,25 13,26 2,28 3,29 8,30 2,32 27,35 19,36 0.14,37 6,38 38,39 44.058,40 47.524,41 29.347,42 28.318,44 7.921}
{0 CHEMBL331358,1 9.844,2 37.2,3 32.6,4 1.059,5 1.13,6 0.683,7 0.688,8 423.3,9 7,10 12,11 43,13 17,14 30,16 44,17 16,20 14,21 2,22 5,24 14,25 13,26 1,28 3,29 9,30 1,32 29,35 20.9,36 0.159,37 7,38 41,39 45.527,40 48.594,41 29.358,42 29.582,44 7.432}
{0 CHEMBL337062,1 9.977,2 27.3,3 37.9,4 1.054,5 1.142,6 0.682,7 0.654,8 658.47,9 9.1,10 16,11 66,13 19,14 44,16 69,17 18,20 11,21 7,22 3,24 25,25 23,26 4,28 6,29 13,30 3,31 1,32 41,35 19.7,36 0.174,37 12,38 55,39 69.586,40 75.37,41 45.011,42 43.174,44 7.009}
{0 CHEMBL69234,1 11.118,2 30.4,3 30.4,4 1.08,5 1.132,6 0.696,7 0.698,8 511.42,9 6.5,10 12,11 46,13 19,14 33,16 47,17 14,20 12,21 2,22 7,24 14,25 18,26 3,28 3,29 12,30 1,31 2,32 32,35 26.1,36 0.17,37 8,38 46,39 49.662,40 52.063,41 32.017,42 32.101,44 7.004}
{0 CHEMBL69727,1 11.118,2 30.4,3 30.4,4 1.08,5 1.132,6 0.696,7 0.698,8 511.42,9 6.5,10 12,11 46,13 19,14 33,16 47,17 14,20 12,21 2,22 7,24 14,25 18,26 3,28 3,29 12,30 1,31 2,32 32,35 26.1,36 0.17,37 8,38 46,39 49.662,40 52.063,41 32.017,42 32.101,44 7.367}
{0 CHEMBL74121,1 9.246,2 32,3 40,4 1.045,5 1.134,6 0.671,7 0.646,8 231.16,9 4,10 6,11 25,13 7,14 16,16 26,17 8,20 5,21 3,22 1,24 10,25 7,26 1,28 1,29 5,30 1,32 15,35 20,38 20,39 26.131,40 28.345,41 16.767,42 16.153,44 4.991}
{0 CHEMBL82202,1 9.506,2 30.8,3 38.5,4 1.056,5 1.137,6 0.662,7 0.649,8 247.16,9 3.8,10 6,11 26,13 8,14 16,16 26,17 8,20 6,21 2,22 2,24 10,25 8,26 1,28 1,29 6,30 1,32 16,35 23.1,36 0.154,37 4,38 21,39 27.458,40 29.554,41 17.222,42 16.868,44 5.523}
