"molecule_id","AMW","C.","H.","Me","Mi","Mp","Mv","MW","N.","nAB","nAT","nB","nBM","nBO","nBR","nBT","nC","nCL","nCsp","nCsp2","nCsp3","nDB","nF","nH","nHet","nHM","nI","nN","nO","nP","nS","nSK","nTB","nX","O.","RBF","RBN","SCBO","Se","Si","Sp","Sv","X.","pXC50"
{1 9.21,2 48.6,3 35.1,4 1.022,5 1.11,6 0.724,7 0.707,8 340.78,9 5.4,10 17,11 37,13 19,14 26,16 39,17 18,18 1,20 18,22 2,24 13,25 6,26 1,28 2,29 3,32 24,34 1,35 8.1,36 0.077,37 3,38 36.5,39 37.811,40 41.06,41 26.801,42 26.176,43 2.7,44 7.569}
{0 CHEMBL152640,1 7.51,2 46.7,3 43.3,4 0.996,5 1.116,6 0.688,7 0.655,8 450.58,9 6.7,10 22,11 60,13 25,14 37,16 63,17 28,19 1,20 22,21 5,22 2,24 26,25 6,28 4,29 2,32 34,33 1,35 3.3,36 0.079,37 5,38 52,39 59.781,40 66.979,41 41.307,42 39.31,44 9.394}
{0 CHEMBL152765,1 7.638,2 43.5,3 43.5,4 1.009,5 1.121,6 0.668,7 0.645,8 473.57,9 4.8,10 18,11 62,13 21,14 37,16 64,17 27,19 1,20 20,21 6,22 2,24 27,25 8,28 3,29 5,32 35,33 1,35 8.1,36 0.141,37 9,38 50,39 62.545,40 69.524,41 41.426,42 39.96,44 9}
{0 CHEMBL1644183,1 9.803,2 45.8,3 33.9,4 1.043,5 1.132,6 0.707,7 0.704,8 578.4,9 5.1,10 23,11 59,13 25,14 42,16 62,17 27,18 2,20 23,21 4,22 2,23 3,24 20,25 12,26 2,28 3,29 4,32 39,34 5,35 6.8,36 0.145,37 9,38 55.5,39 61.52,40 66.807,41 41.739,42 41.523,43 8.5,44 5.585}
{0 CHEMBL1933349,1 8.655,2 47.1,3 39.7,4 1.011,5 1.112,6 0.712,7 0.683,8 588.52,9 4.4,10 28,11 68,13 30,14 45,16 72,17 32,18 2,20 27,21 5,22 2,24 27,25 9,26 2,28 3,29 4,32 41,34 2,35 5.9,36 0.125,37 9,38 61,39 68.749,40 75.618,41 48.449,42 46.427,43 2.9,44 6.138}
{0 CHEMBL198736,1 7.417,2 38.2,3 47.4,4 1.018,5 1.145,6 0.629,7 0.609,8 563.68,9 3.9,10 12,11 76,13 15,14 42,16 78,17 29,20 15,21 14,22 3,23 3,24 36,25 11,28 3,29 5,32 40,34 3,35 6.6,36 0.128,37 10,38 51,39 77.385,40 87.035,41 47.807,42 46.27,43 3.9,44 7.638}
{0 CHEMBL2114176,1 7.339,2 33,3 48.1,4 1.019,5 1.146,6 0.617,7 0.597,8 3405.24,9 8.8,10 40,11 464,13 77,14 247,16 470,17 153,20 75,21 78,22 37,24 223,25 88,26 1,28 41,29 46,31 1,32 241,35 9.9,36 0.236,37 111,38 304,39 472.714,40 531.766,41 286.076,42 276.884,44 7.462}
{0 CHEMBL2114177,1 7.333,2 32.4,3 48.2,4 1.02,5 1.147,6 0.614,7 0.594,8 3329.14,9 9,10 34,11 454,13 71,14 240,16 459,17 147,20 69,21 78,22 37,24 219,25 88,26 1,28 41,29 46,31 1,32 235,35 10.1,36 0.237,37 109,38 294,39 462.946,40 520.936,41 278.553,42 269.83,44 6.403}
{0 CHEMBL2115191,1 7.339,2 33,3 48.1,4 1.019,5 1.146,6 0.617,7 0.597,8 3405.24,9 8.8,10 40,11 464,13 77,14 247,16 470,17 153,20 75,21 78,22 37,24 223,25 88,26 1,28 41,29 46,31 1,32 241,35 9.9,36 0.236,37 111,38 304,39 472.714,40 531.766,41 286.076,42 276.884,44 8.387}
{0 CHEMBL2115192,1 7.333,2 32.4,3 48.2,4 1.02,5 1.147,6 0.614,7 0.594,8 3329.14,9 9,10 34,11 454,13 71,14 240,16 459,17 147,20 69,21 78,22 37,24 219,25 88,26 1,28 41,29 46,31 1,32 235,35 10.1,36 0.237,37 109,38 294,39 462.946,40 520.936,41 278.553,42 269.83,44 6.292}
{0 CHEMBL262418,1 7.271,2 33.3,3 48.5,4 1.016,5 1.145,6 0.619,7 0.596,8 2639.36,9 8.8,10 34,11 363,13 62,14 192,16 368,17 121,20 60,21 61,22 28,24 176,25 66,26 1,28 32,29 33,31 1,32 187,35 9.1,36 0.231,37 85,38 237,39 368.754,40 415.67,41 224.649,42 216.39,44 6.604}
{0 CHEMBL263603,1 7.482,2 32.5,3 47.6,4 1.02,5 1.146,6 0.62,7 0.599,8 3501.39,9 9.2,10 39,11 468,13 77,14 251,16 474,17 152,20 73,21 79,22 38,24 223,25 93,26 3,28 43,29 47,31 3,32 245,35 10,36 0.238,37 113,38 308.5,39 477.514,40 536.397,41 290.076,42 280.489,44 8.252}
{0 CHEMBL266411,1 7.387,2 32.6,3 47.8,4 1.02,5 1.147,6 0.616,7 0.597,8 3464.28,9 9.4,10 39,11 469,13 77,14 252,16 476,17 153,20 73,21 80,22 38,24 224,25 92,26 1,28 44,29 47,31 1,32 245,35 10,36 0.187,37 89,38 309.5,39 478.463,40 538.055,41 288.786,42 280.136,44 6.411}
{0 CHEMBL266412,1 7.358,2 32.8,3 48,4 1.02,5 1.147,6 0.616,7 0.597,8 3436.26,9 9,10 39,11 467,13 76,14 250,16 474,17 153,20 72,21 81,22 37,24 224,25 90,26 1,28 42,29 47,31 1,32 243,35 10.1,36 0.213,37 101,38 306.5,39 476.143,40 535.474,41 287.536,42 278.62,44 5.824}
{0 CHEMBL266481,1 7.395,2 32.5,3 47.8,4 1.021,5 1.147,6 0.615,7 0.597,8 3483.28,9 9.1,10 39,11 471,13 77,14 252,16 477,17 153,20 73,21 80,22 38,24 225,25 93,26 1,28 43,29 49,31 1,32 246,35 10.4,36 0.237,37 113,38 309.5,39 480.899,40 540.391,41 289.451,42 281.071,44 8.301}
{0 CHEMBL267189,1 7.436,2 32.3,3 48,4 1.02,5 1.146,6 0.619,7 0.597,8 3517.44,9 9.1,10 39,11 473,13 76,14 252,16 479,17 153,20 72,21 81,22 37,24 227,25 93,26 3,28 43,29 47,31 3,32 246,35 9.9,36 0.236,37 113,38 308.5,39 482.281,40 542.227,41 292.598,42 282.543,44 8.444}
{0 CHEMBL267876,1 7.577,2 32.5,3 46.5,4 1.025,5 1.148,6 0.617,7 0.603,8 3735.45,9 9.9,10 45,11 493,13 90,14 271,16 500,17 160,20 80,21 80,22 45,24 229,25 104,26 1,28 49,29 54,31 1,32 264,35 11,36 0.238,37 119,38 338.5,39 505.263,40 566.012,41 303.996,42 297.247,44 7.824}
{0 CHEMBL267885,1 7.353,2 32.2,3 48.1,4 1.021,5 1.148,6 0.613,7 0.594,8 3375.17,9 8.9,10 34,11 459,13 71,14 243,16 464,17 148,20 69,21 79,22 37,24 221,25 90,26 1,28 41,29 48,31 1,32 238,35 10.5,36 0.237,37 110,38 297,39 468.485,40 526.77,41 281.223,42 272.787,44 6.2}
{0 CHEMBL268534,1 7.387,2 32.6,3 47.8,4 1.02,5 1.147,6 0.616,7 0.597,8 3464.28,9 9.4,10 39,11 469,13 77,14 252,16 476,17 153,20 73,21 80,22 38,24 224,25 92,26 1,28 44,29 47,31 1,32 245,35 10,36 0.212,37 101,38 309.5,39 478.463,40 538.055,41 288.786,42 280.136,44 5.921}
{0 CHEMBL268636,1 7.333,2 31.7,3 48.4,4 1.021,5 1.149,6 0.61,7 0.592,8 3211.98,9 9.1,10 28,11 438,13 64,14 230,16 442,17 139,20 62,21 77,22 36,24 212,25 87,26 1,28 40,29 46,31 1,32 226,35 10.5,36 0.24,37 106,38 280,39 447.194,40 503.192,41 267.263,42 259.229,44 7.319}
{0 CHEMBL269490,1 7.313,2 32.1,3 48.4,4 1.02,5 1.148,6 0.612,7 0.593,8 3444.3,9 9.3,10 33,11 471,13 71,14 249,16 477,17 151,20 67,21 84,22 38,24 228,25 92,26 1,28 44,29 47,31 1,32 243,35 10,36 0.212,37 101,38 303.5,39 480.23,40 540.885,41 288.309,42 279.19,44 6.186}
{0 CHEMBL328942,1 7.002,2 37.9,3 49.2,4 1.005,5 1.134,6 0.634,7 0.603,8 924.22,9 5.3,10 22,11 132,13 30,14 70,16 135,17 50,20 28,21 22,22 8,24 65,25 17,28 7,29 10,32 67,35 7.6,36 0.185,37 25,38 89,39 132.61,40 149.623,41 83.666,42 79.575,44 6.77}
{0 CHEMBL386446,1 8.331,2 44.1,3 42.6,4 1.009,5 1.118,6 0.694,7 0.661,8 566.52,9 4.4,10 18,11 68,13 22,14 42,16 71,17 30,18 2,20 23,21 7,22 4,24 29,25 9,26 2,28 3,29 4,32 39,34 2,35 5.9,36 0.127,37 9,38 55,39 68.632,40 76.033,41 47.21,42 44.954,43 2.9,44 6.914}
{0 CHEMBL409611,1 7.396,2 32,3 47.9,4 1.022,5 1.149,6 0.612,7 0.595,8 3306.06,9 9.4,10 33,11 447,13 70,14 238,16 452,17 143,20 66,21 77,22 37,24 214,25 90,26 1,28 42,29 47,31 1,32 233,35 10.5,36 0.239,37 108,38 291.5,39 456.725,40 513.398,41 273.729,42 265.986,44 6.276}
{0 CHEMBL409654,1 7.555,2 32.3,3 47.2,4 1.022,5 1.147,6 0.62,7 0.601,8 3505.33,9 9.3,10 39,11 464,13 77,14 251,16 470,17 150,20 73,21 77,22 38,24 219,25 95,26 3,28 43,29 49,31 3,32 245,35 10.6,36 0.24,37 113,38 308.5,39 474.401,40 531.985,41 287.462,42 278.865,44 7.863}
{0 CHEMBL409896,1 7.223,2 34,3 48.7,4 1.014,5 1.144,6 0.622,7 0.597,8 2701.48,9 8.6,10 39,11 374,13 67,14 198,16 380,17 127,20 64,21 63,22 28,24 182,25 65,26 1,28 32,29 32,31 1,32 192,35 8.6,36 0.229,37 87,38 245.5,39 379.078,40 427.706,41 232.479,42 223.255,44 6.107}
{0 CHEMBL410553,1 7.583,2 32.5,3 47,4 1.023,5 1.146,6 0.621,7 0.602,8 3503.31,9 9.3,10 39,11 462,13 77,14 252,16 469,17 150,20 73,21 77,22 38,24 217,25 95,26 3,28 43,29 49,31 3,32 245,35 10.6,36 0.215,37 101,38 309.5,39 472.518,40 529.57,41 286.7,42 278.338,44 6.25}
{0 CHEMBL411289,1 7.322,2 32.4,3 48.3,4 1.02,5 1.147,6 0.613,7 0.594,8 3302.11,9 8.9,10 34,11 451,13 70,14 238,16 456,17 146,20 68,21 78,22 36,24 218,25 87,26 1,28 40,29 46,31 1,32 233,35 10.2,36 0.237,37 108,38 291,39 459.845,40 517.437,41 276.547,42 267.809,44 6.05}
{0 CHEMBL411785,1 7.249,2 33.9,3 48.5,4 1.014,5 1.144,6 0.622,7 0.598,8 2631.38,9 8.8,10 38,11 363,13 66,14 193,16 369,17 123,20 62,21 61,22 28,24 176,25 64,26 1,28 32,29 31,31 1,32 187,35 8.5,36 0.225,37 83,38 240,39 368.1,40 415.251,41 225.74,42 216.96,44 6.097}
{0 CHEMBL412352,1 7.361,2 31.9,3 48.1,4 1.021,5 1.149,6 0.612,7 0.594,8 3349.14,9 9.5,10 33,11 455,13 70,14 241,16 460,17 145,20 66,21 79,22 37,24 219,25 91,26 1,28 43,29 47,31 1,32 236,35 10.3,36 0.239,37 110,38 294.5,39 464.594,40 522.726,41 278.257,42 270.061,44 6.574}
{0 CHEMBL412488,1 7.359,2 32.8,3 48,4 1.02,5 1.146,6 0.616,7 0.597,8 3451.27,9 8.7,10 39,11 469,13 76,14 251,16 476,17 154,20 72,21 82,22 37,24 225,25 90,26 1,28 41,29 48,31 1,32 244,35 10.2,36 0.208,37 99,38 307.5,39 478.252,40 537.6,41 288.746,42 279.84,44 9.62}
{0 CHEMBL412604,1 7.276,2 31.7,3 48.8,4 1.02,5 1.149,6 0.609,7 0.59,8 3325.16,9 9,10 28,11 457,13 65,14 238,16 461,17 145,20 63,21 82,22 37,24 223,25 89,26 1,28 41,29 47,31 1,32 234,35 10.3,36 0.241,37 111,38 289,39 466.041,40 524.975,41 278.53,42 269.599,44 7.319}
{0 CHEMBL412679,1 7.23,2 31.8,3 49.2,4 1.016,5 1.149,6 0.614,7 0.59,8 1706.22,9 10.2,10 16,11 236,13 36,14 122,16 238,17 75,20 34,21 41,22 20,24 116,25 45,26 1,28 24,29 20,31 1,32 120,35 8.5,36 0.231,37 55,38 150,39 239.711,40 271.166,41 144.899,42 139.229,44 5.638}
{0 CHEMBL413030,1 7.321,2 33.1,3 48.2,4 1.018,5 1.146,6 0.617,7 0.597,8 3404.25,9 8.6,10 39,11 465,13 75,14 249,16 473,17 154,20 71,21 83,22 36,24 224,25 87,26 1,28 40,29 46,31 1,32 241,35 9.9,36 0.184,37 87,38 304.5,39 473.495,40 532.683,41 286.831,42 277.389,44 6.602}
{0 CHEMBL413208,1 7.229,2 33.3,3 48.8,4 1.015,5 1.145,6 0.618,7 0.595,8 2667.42,9 8.7,10 34,11 369,13 62,14 194,16 374,17 123,20 60,21 63,22 28,24 180,25 66,26 1,28 32,29 33,31 1,32 189,35 8.9,36 0.233,37 87,38 239,39 374.521,40 422.501,41 228.172,42 219.443,44 7.674}
{0 CHEMBL413209,1 7.358,2 32.9,3 48,4 1.019,5 1.146,6 0.616,7 0.597,8 3421.24,9 8.8,10 40,11 465,13 77,14 248,16 471,17 153,20 75,21 78,22 37,24 223,25 89,26 1,28 41,29 47,31 1,32 242,35 10.1,36 0.236,37 111,38 305,39 474.041,40 532.975,41 286.53,42 277.599,44 8.638}
{0 CHEMBL413666,1 7.358,2 32.9,3 48,4 1.019,5 1.146,6 0.616,7 0.597,8 3421.24,9 8.8,10 40,11 465,13 77,14 248,16 471,17 153,20 75,21 78,22 37,24 223,25 89,26 1,28 41,29 47,31 1,32 242,35 10.1,36 0.236,37 111,38 305,39 474.041,40 532.975,41 286.53,42 277.599,44 7.131}
{0 CHEMBL413890,1 7.334,2 32.3,3 48.3,4 1.02,5 1.148,6 0.613,7 0.594,8 3359.17,9 9,10 34,11 458,13 71,14 242,16 463,17 148,20 69,21 79,22 37,24 221,25 89,26 1,28 41,29 47,31 1,32 237,35 10.3,36 0.238,37 110,38 296,39 467.157,40 525.56,41 280.769,42 272.072,44 8.426}
{0 CHEMBL414077,1 7.555,2 32.5,3 47.2,4 1.022,5 1.146,6 0.621,7 0.602,8 3460.28,9 9.2,10 39,11 458,13 77,14 248,16 464,17 149,20 73,21 76,22 38,24 216,25 93,26 3,28 42,29 48,31 3,32 242,35 10.5,36 0.237,37 110,38 305.5,39 468.088,40 524.862,41 284.24,42 275.602,44 8.194}
{0 CHEMBL414490,1 7.464,2 32.5,3 47.8,4 1.02,5 1.146,6 0.62,7 0.599,8 3515.42,9 9.1,10 39,11 471,13 76,14 253,16 478,17 153,20 72,21 81,22 37,24 225,25 93,26 3,28 43,29 47,31 3,32 246,35 10,36 0.211,37 101,38 309.5,39 480.397,40 539.812,41 291.837,42 282.016,44 7.073}
{0 CHEMBL427644,1 7.313,2 32.9,3 48.3,4 1.019,5 1.146,6 0.615,7 0.595,8 3422.27,9 8.5,10 39,11 468,13 75,14 249,16 475,17 154,20 71,21 83,22 36,24 226,25 88,26 1,28 40,29 47,31 1,32 242,35 10,36 0.213,37 101,38 304.5,39 476.706,40 536.307,41 288.047,42 278.631,44 6.495}
{0 CHEMBL427744,1 7.352,2 31.8,3 48.3,4 1.022,5 1.149,6 0.61,7 0.592,8 3212.96,9 8.9,10 28,11 437,13 64,14 230,16 441,17 139,20 62,21 77,22 36,24 211,25 87,26 1,28 39,29 47,31 1,32 226,35 10.8,36 0.24,37 106,38 280,39 446.419,40 501.903,41 266.712,42 258.922,44 6.1}
{0 CHEMBL428460,1 7.336,2 32.6,3 48.1,4 1.019,5 1.147,6 0.615,7 0.596,8 3506.37,9 9.2,10 39,11 478,13 77,14 255,16 485,17 156,20 73,21 83,22 38,24 230,25 92,26 1,28 44,29 47,31 1,32 248,35 9.8,36 0.21,37 102,38 312.5,39 487.114,40 548.301,41 294.07,42 284.717,44 9.699}
{0 CHEMBL429198,1 7.352,2 31.7,3 48.3,4 1.021,5 1.149,6 0.61,7 0.592,8 3197.95,9 9.2,10 28,11 435,13 64,14 229,16 439,17 138,20 62,21 76,22 36,24 210,25 87,26 1,28 40,29 46,31 1,32 225,35 10.6,36 0.239,37 105,38 279,39 444.31,40 499.776,41 265.502,42 257.702,44 6.572}
{0 CHEMBL429362,1 7.395,2 32.5,3 47.8,4 1.021,5 1.147,6 0.615,7 0.597,8 3483.28,9 9.1,10 39,11 471,13 77,14 252,16 477,17 153,20 73,21 80,22 38,24 225,25 93,26 1,28 43,29 49,31 1,32 246,35 10.4,36 0.237,37 113,38 309.5,39 480.899,40 540.391,41 289.451,42 281.071,44 8.824}
{0 CHEMBL429724,1 7.387,2 32.6,3 47.8,4 1.02,5 1.147,6 0.616,7 0.597,8 3464.28,9 9.4,10 39,11 469,13 77,14 252,16 476,17 153,20 73,21 80,22 38,24 224,25 92,26 1,28 44,29 47,31 1,32 245,35 10,36 0.212,37 101,38 309.5,39 478.463,40 538.055,41 288.786,42 280.136,44 6.886}
{0 CHEMBL437048,1 7.261,2 32.6,3 48.7,4 1.017,5 1.147,6 0.615,7 0.593,8 2563.26,9 9.1,10 28,11 353,13 56,14 185,16 357,17 115,20 54,21 61,22 28,24 172,25 66,26 1,28 32,29 33,31 1,32 181,35 9.3,36 0.232,37 83,38 227,39 358.987,40 404.84,41 217.127,42 209.336,44 7.222}
{0 CHEMBL437095,1 7.328,2 31.7,3 48.4,4 1.021,5 1.149,6 0.61,7 0.592,8 3283.07,9 9.2,10 28,11 448,13 65,14 235,16 452,17 142,20 63,21 79,22 37,24 217,25 89,26 1,28 41,29 47,31 1,32 231,35 10.5,36 0.239,37 108,38 286,39 457.39,40 514.73,41 273.246,42 265.018,44 6.65}
{0 CHEMBL437465,1 7.584,2 32.7,3 46.9,4 1.022,5 1.146,6 0.622,7 0.603,8 3458.26,9 9.2,10 39,11 456,13 77,14 249,16 463,17 149,20 73,21 76,22 38,24 214,25 93,26 3,28 42,29 48,31 3,32 242,35 10.5,36 0.212,37 98,38 306.5,39 466.205,40 522.447,41 283.479,42 275.075,44 6.253}
{0 CHEMBL437648,1 7.37,2 32.7,3 47.9,4 1.02,5 1.147,6 0.616,7 0.597,8 3493.32,9 9.1,10 39,11 474,13 77,14 254,16 481,17 155,20 73,21 82,22 38,24 227,25 92,26 1,28 43,29 48,31 1,32 247,35 10.1,36 0.21,37 101,38 311.5,39 483.455,40 543.597,41 291.758,42 282.883,44 8.222}
{0 CHEMBL437800,1 7.322,2 33,3 48.2,4 1.018,5 1.146,6 0.616,7 0.596,8 3419.27,9 8.8,10 40,11 467,13 77,14 248,16 473,17 154,20 75,21 79,22 37,24 225,25 88,26 1,28 41,29 46,31 1,32 242,35 9.9,36 0.235,37 111,38 305,39 475.597,40 535.181,41 287.837,42 278.411,44 8}
{0 CHEMBL437860,1 7.333,2 32.8,3 48.2,4 1.019,5 1.146,6 0.616,7 0.596,8 3013.76,9 8.8,10 34,11 411,13 67,14 218,16 416,17 135,20 65,21 70,22 33,24 198,25 78,26 1,28 36,29 41,31 1,32 213,35 10,36 0.233,37 97,38 268,39 418.732,40 471.075,41 253.161,42 244.935,44 7.509}
{0 CHEMBL438045,1 7.333,2 31.7,3 48.4,4 1.021,5 1.149,6 0.61,7 0.592,8 3211.98,9 9.1,10 28,11 438,13 64,14 230,16 442,17 139,20 62,21 77,22 36,24 212,25 87,26 1,28 40,29 46,31 1,32 226,35 10.5,36 0.24,37 106,38 280,39 447.194,40 503.192,41 267.263,42 259.229,44 7.319}
{0 CHEMBL438218,1 7.377,2 31.7,3 48.1,4 1.022,5 1.149,6 0.61,7 0.593,8 3327.08,9 9.1,10 28,11 451,13 66,14 238,16 455,17 143,20 64,21 79,22 38,24 217,25 91,26 1,28 41,29 49,31 1,32 234,35 10.9,36 0.242,37 110,38 290,39 461.045,40 518.149,41 275.155,42 267.448,44 5.699}
{0 CHEMBL438574,1 7.379,2 31.9,3 48,4 1.021,5 1.149,6 0.612,7 0.594,8 3335.11,9 9.5,10 33,11 452,13 70,14 240,16 457,17 144,20 66,21 78,22 37,24 217,25 91,26 1,28 43,29 47,31 1,32 235,35 10.4,36 0.239,37 109,38 293.5,39 461.71,40 519.311,41 276.496,42 268.534,44 6.296}
{0 CHEMBL439271,1 7.371,2 31.8,3 48.2,4 1.022,5 1.149,6 0.61,7 0.593,8 3198.93,9 9,10 28,11 434,13 64,14 229,16 438,17 138,20 62,21 76,22 36,24 209,25 87,26 1,28 39,29 47,31 1,32 225,35 10.8,36 0.24,37 105,38 279,39 443.536,40 498.488,41 264.95,42 257.395,44 6.425}
{0 CHEMBL439690,1 7.188,2 33.3,3 49.1,4 1.014,5 1.145,6 0.618,7 0.593,8 2695.48,9 8.5,10 34,11 375,13 62,14 196,16 380,17 125,20 60,21 65,22 28,24 184,25 66,26 1,28 32,29 33,31 1,32 191,35 8.8,36 0.234,37 89,38 241,39 380.289,40 429.331,41 231.695,42 222.497,44 6.883}
{0 CHEMBL439885,1 7.382,2 32.3,3 47.9,4 1.021,5 1.147,6 0.613,7 0.595,8 3403.18,9 8.9,10 33,11 461,13 71,14 246,16 467,17 149,20 67,21 82,22 38,24 221,25 91,26 1,28 41,29 49,31 1,32 240,35 10.6,36 0.212,37 99,38 300.5,39 470.812,40 528.979,41 282.678,42 274.502,44 8.77}
{0 CHEMBL441011,1 7.509,2 32.6,3 47.4,4 1.021,5 1.146,6 0.621,7 0.601,8 3499.37,9 9.2,10 39,11 466,13 77,14 252,16 473,17 152,20 73,21 79,22 38,24 221,25 93,26 3,28 43,29 47,31 3,32 245,35 10.1,36 0.214,37 101,38 309.5,39 475.63,40 533.982,41 289.314,42 279.962,44 6.996}
{0 CHEMBL441209,1 7.311,2 31.2,3 48.7,4 1.021,5 1.15,6 0.607,7 0.589,8 3048.79,9 9.4,10 22,11 417,13 57,14 217,16 420,17 130,20 55,21 75,22 35,24 203,25 84,26 1,28 39,29 44,31 1,32 214,35 10.6,36 0.243,37 102,38 263,39 425.903,40 479.614,41 253.303,42 245.67,44 7.319}
{0 CHEMBL441755,1 7.334,2 32.3,3 48.3,4 1.02,5 1.148,6 0.613,7 0.594,8 3359.17,9 9,10 34,11 458,13 71,14 242,16 463,17 148,20 69,21 79,22 37,24 221,25 89,26 1,28 41,29 47,31 1,32 237,35 10.3,36 0.238,37 110,38 296,39 467.157,40 525.56,41 280.769,42 272.072,44 6.3}
{0 CHEMBL442135,1 7.363,2 32.7,3 47.9,4 1.02,5 1.147,6 0.616,7 0.597,8 3534.38,9 9.2,10 39,11 480,13 78,14 257,16 487,17 157,20 74,21 83,22 39,24 230,25 93,26 1,28 44,29 48,31 1,32 250,35 10,36 0.211,37 103,38 315.5,39 489.441,40 550.51,41 295.525,42 286.431,44 7.866}
{0 CHEMBL442499,1 7.355,2 32.5,3 48.1,4 1.02,5 1.147,6 0.614,7 0.595,8 3398.21,9 9.1,10 38,11 462,13 75,14 246,16 468,17 150,20 71,21 79,22 37,24 222,25 90,26 1,28 42,29 47,31 1,32 240,35 10.2,36 0.235,37 110,38 302,39 471.259,40 530.058,41 283.775,42 275.093,44 6.25}
{0 CHEMBL446821,1 8.681,2 44.8,3 38.8,4 1.026,5 1.129,6 0.689,7 0.673,8 581.66,9 4.5,10 23,11 67,13 25,14 45,16 71,17 30,20 23,21 7,22 2,23 3,24 26,25 11,26 1,28 3,29 4,31 1,32 41,34 3,35 6,36 0.141,37 10,38 58.5,39 68.716,40 75.669,41 46.193,42 45.109,43 4.5,44 5.357}
{0 CHEMBL455323,1 8.869,2 47.9,3 36.6,4 1.024,5 1.122,6 0.707,7 0.692,8 629.7,9 4.2,10 29,11 71,13 31,14 50,16 76,17 34,20 29,21 5,22 2,23 3,24 26,25 11,26 1,28 3,29 4,31 1,32 45,34 3,35 5.6,36 0.132,37 10,38 66.5,39 72.716,40 79.669,41 50.193,42 49.109,43 4.2,44 5.745}
{0 CHEMBL470729,1 9.492,2 45.8,3 35.6,4 1.033,5 1.128,6 0.713,7 0.698,8 560.03,9 5.1,10 23,11 59,13 25,14 41,16 62,17 27,18 1,20 23,21 4,22 2,23 3,24 21,25 11,26 2,28 3,29 3,31 1,32 38,34 4,35 5.1,36 0.145,37 9,38 54.5,39 60.945,40 66.573,41 42.074,42 41.168,43 6.8,44 5.569}
{0 CHEMBL471580,1 9.492,2 45.8,3 35.6,4 1.033,5 1.128,6 0.713,7 0.698,8 560.03,9 5.1,10 23,11 59,13 25,14 41,16 62,17 27,18 1,20 23,21 4,22 2,23 3,24 21,25 11,26 2,28 3,29 3,31 1,32 38,34 4,35 5.1,36 0.145,37 9,38 54.5,39 60.945,40 66.573,41 42.074,42 41.168,43 6.8,44 5.854}
{0 CHEMBL487476,1 8.442,2 43.5,3 42,4 1.014,5 1.119,6 0.691,7 0.662,8 582.52,9 4.3,10 18,11 69,13 22,14 43,16 72,17 30,18 2,20 23,21 7,22 4,24 29,25 10,26 2,28 3,29 5,32 40,34 2,35 7.2,36 0.125,37 9,38 56,39 69.96,40 77.243,41 47.665,42 45.668,43 2.9,44 7.367}
{0 CHEMBL492605,1 8.571,2 45.5,3 39.4,4 1.021,5 1.128,6 0.693,7 0.673,8 565.66,9 4.5,10 23,11 66,13 25,14 44,16 70,17 30,20 23,21 7,22 2,23 3,24 26,25 10,26 1,28 3,29 3,31 1,32 40,34 3,35 4.5,36 0.129,37 9,38 57.5,39 67.389,40 74.46,41 45.739,42 44.394,43 4.5,44 5.268}
{0 CHEMBL492813,1 8.797,2 45.5,3 40.9,4 1.008,5 1.111,6 0.722,7 0.68,8 580.57,9 4.5,10 23,11 66,13 25,14 43,16 70,17 30,18 2,20 23,21 7,22 2,24 27,25 9,26 3,28 3,29 3,31 1,32 39,34 2,35 4.5,36 0.129,37 9,38 56.5,39 66.498,40 73.329,41 47.642,42 44.899,43 3,44 5.796}
{0 CHEMBL501628,1 9.676,2 44.4,3 33.3,4 1.053,5 1.147,6 0.686,7 0.694,8 609.59,9 4.8,10 23,11 63,13 25,14 45,16 66,17 28,20 23,21 5,22 2,23 6,24 21,25 14,26 1,28 3,29 4,31 1,32 42,34 6,35 6.3,36 0.152,37 10,38 58.5,39 66.37,40 72.273,41 43.245,42 43.732,43 9.5,44 5.699}
{0 CHEMBL519776,1 9.6,2 45,3 35,4 1.038,5 1.13,6 0.709,7 0.698,8 576.03,9 5,10 23,11 60,13 25,14 42,16 63,17 27,18 1,20 23,21 4,22 2,23 3,24 21,25 12,26 2,28 3,29 4,31 1,32 39,34 4,35 6.7,36 0.159,37 10,38 55.5,39 62.272,40 67.783,41 42.529,42 41.883,43 6.7,44 5.77}
{0 CHEMBL557974,1 7.988,2 42.3,3 46.2,4 0.996,5 1.124,6 0.695,7 0.645,8 415.4,9 7.7,10 17,11 52,13 18,14 30,16 54,17 22,18 2,20 16,21 6,22 1,24 24,25 6,26 2,28 4,32 28,34 2,36 0.13,37 7,38 39.5,39 51.774,40 58.448,41 36.114,42 33.535,43 3.8,44 5.398}
{0 CHEMBL62444,1 7.417,2 38.2,3 47.4,4 1.018,5 1.145,6 0.629,7 0.609,8 563.68,9 3.9,10 12,11 76,13 15,14 42,16 78,17 29,20 15,21 14,22 3,23 3,24 36,25 11,28 3,29 5,32 40,34 3,35 6.6,36 0.128,37 10,38 51,39 77.385,40 87.035,41 47.807,42 46.27,43 3.9,44 7.252}
