"molecule_id","AMW","C.","pXC50"
{1 6.8,2 25,3 4.523}
{0 CHEMBL189366,1 6.641,2 34.2,3 4}
{0 CHEMBL190311,1 7.489,2 40,3 4.222}
{0 CHEMBL190418,1 7.068,2 39.2,3 4.523}
{0 CHEMBL190634,1 6.536,2 36.8,3 4.77}
{0 CHEMBL190736,1 6.809,2 34.3,3 5.565}
{0 CHEMBL191531,1 7.489,2 40,3 4.411}
{0 CHEMBL193028,1 8.517,2 39.2,3 4.051}
{0 CHEMBL206357,1 6.982,2 33.8,3 4.108}
{0 CHEMBL207481,1 7.269,2 35.8,3 4.187}
{0 CHEMBL2207396,1 6.446,2 25,3 4.398}
{0 CHEMBL363475,1 6.539,2 35.3,3 4.222}
{0 CHEMBL363665,1 6.715,2 39.2,3 4.517}
{0 CHEMBL371197,1 6.416,2 29.6,3 6.398}
{0 CHEMBL425364,1 6.723,2 33.3,3 5.523}
{0 CHEMBL425723,1 6.641,2 34.2,3 6.513}
{0 CHEMBL435112,1 8.707,2 40,3 4.26}
{0 CHEMBL79727,1 6.295,2 23.8,3 4.276}
{0 CHEMBL79763,1 6.295,2 25,3 4.229}
{0 CHEMBL83278,1 6.8,2 25,3 4.097}
{0 CHEMBL84104,1 6.539,2 35.3,3 4.186}
{0 CHEMBL84844,1 6.8,2 25,3 4.745}
{0 CHEMBL84941,1 7.366,2 32.3,3 4.071}
