"molecule_id","Eig04_AEA.ed.","CATS2D_06_DA","MATS6p","Eig04_EA.ed.","SM13_AEA.dm.","GATS6v","GATS6p","CATS2D_07_DL","MATS6v","CATS2D_06_DL","CENT","IDDM","CATS2D_07_DA","RBF","Eig15_AEA.bo.","HDcpx","IDM","S0K","XMOD","JGI6","SpMax2_Bh.v.","NaaO","nOxazoles","SaaO","Chi0_EA.ri.","SpMaxA_EA.ri.","MATS6m","GATS6m","Chi0_AEA.bo.","Chi0_AEA.dm.","Chi0_AEA.ed.","Chi0_AEA.ri.","Chi0_EA","ON1","SpMin2_Bh.i.","SpMax3_Bh.p.","MATS6i","ATS2v","Eig12_AEA.ri.","Eig12_EA.ri.","SpMax2_Bh.p.","MPC04","CID","GMTI","IDET","IDMT","IVDM","LPRS","MPC01","MWC01","nBO","nSK","RDSQ","SMTI","SRW02","X1","Xu","SpMax3_Bh.v.","Chi1_EA.ri.","pXC50"
{1 5.27,3 0.054,4 6.746,5 6.746,6 0.877,7 0.786,8 1,9 0.098,11 800,12 4.551,13 2,14 0.136,15 0.679,16 1.664,17 7.829,18 104.039,19 80.833,20 0.025,21 3.829,22 1,23 1,24 5.603,25 16.852,26 0.115,27 0.152,28 0.656,29 16.091,30 16.091,31 16.091,32 16.091,33 16.091,34 5.319,35 1.858,36 3.729,37 0.021,38 3.728,39 1.085,40 0.135,41 3.836,42 4.078,43 3.907,44 6509,45 994.75,46 11868.9,47 4.498,48 115.585,49 3.296,50 3.296,51 26,52 24,53 189.487,54 6446,55 3.97,56 11.513,57 23.7,58 3.685,59 13.708,60 7.292}
{0 CHEMBL1578465,1 5.499,3 0.117,4 7.412,5 7.412,6 0.763,7 0.718,9 0.186,10 3,11 875,12 4.615,13 2,14 0.102,15 0.613,16 1.674,17 7.95,18 105.342,19 80.965,20 0.024,21 3.893,22 1,23 1,24 5.654,25 16.53,26 0.123,27 0.232,28 0.593,29 15.985,30 15.985,31 15.985,32 15.985,33 15.985,34 5.236,35 1.925,36 3.74,37 0.04,38 3.86,39 0.995,40 0.04,41 3.905,42 4.111,43 3.938,44 7130,45 1080.47,46 13316.3,47 4.523,48 121.944,49 3.332,50 3.332,51 27,52 25,53 203.685,54 7089,55 4.007,56 11.687,57 24.44,58 3.694,59 13.954,60 6.138}
{0 CHEMBL1585484,1 5.507,2 3,3 -0.086,4 6.692,5 6.692,6 1.036,7 0.938,8 2,9 -0.101,10 1,11 1086,12 4.724,14 0.104,15 0.962,16 1.697,17 8.18,18 122.382,19 97.093,20 0.021,21 3.854,25 18.961,26 0.107,27 0.038,28 0.675,29 18.151,30 18.151,31 18.151,32 18.151,33 18.151,34 5.778,35 1.88,36 3.77,37 -0.117,38 3.904,39 1.429,40 0.48,41 3.879,42 4.277,43 4.036,44 9633,45 1291.87,46 16810.3,47 4.685,48 135.114,49 3.434,50 3.434,51 30,52 27,53 231.156,54 9079,55 4.111,56 13.02,57 26.202,58 3.724,59 16.207,60 7.701}
{0 CHEMBL178412,1 5.109,3 -0.228,4 6.148,5 6.148,6 1.191,7 1.348,8 2,9 -0.26,10 1,11 614,12 4.431,14 0.118,15 0.5,16 1.641,17 7.59,18 94.107,19 73.35,20 0.023,21 3.825,25 15.261,26 0.126,27 -0.396,28 1.466,29 14.792,30 14.792,31 14.792,32 14.792,33 14.792,34 4.833,35 1.855,36 3.713,37 -0.007,38 3.614,39 0.654,40 -0.241,41 3.83,42 3.97,43 3.825,44 5229,45 794.889,46 8842.8,47 4.392,48 102.148,49 3.219,50 3.219,51 24,52 22,53 166.851,54 5074,55 3.892,56 10.631,57 21.916,58 3.659,59 12.711,60 5.777}
{0 CHEMBL179848,1 5.257,3 0.005,4 6.588,5 6.588,6 0.982,7 1.125,8 2,9 0.047,10 1,11 669,12 4.496,14 0.105,15 0.512,16 1.654,17 7.724,18 104.042,19 76.336,20 0.017,21 3.852,25 15.928,26 0.121,27 -0.108,28 1.317,29 15.403,30 15.403,31 15.403,32 15.403,33 15.403,34 5.083,35 1.689,36 3.748,37 -0.034,38 3.703,39 0.804,40 -0.111,41 3.87,42 4.078,43 3.863,44 5769,45 877.603,46 10134.1,47 4.443,48 108.517,49 3.258,50 3.258,51 25,52 23,53 178.557,54 5651,55 3.932,56 11.063,57 22.716,58 3.669,59 13.153,60 7.854}
{0 CHEMBL179979,1 5.665,3 -0.14,4 7.842,5 7.842,6 1.17,7 1.379,8 2,9 -0.125,10 2,11 1158,12 4.783,14 0.1,15 0.671,16 1.709,17 8.304,18 125.096,19 88.344,20 0.022,21 3.851,25 18.52,26 0.105,27 -0.253,28 1.603,29 17.736,30 17.736,31 17.736,32 17.736,33 17.736,34 5.833,35 1.878,36 3.729,37 -0.148,38 3.785,39 1.457,40 0.493,41 3.849,42 4.234,43 4.044,44 9331,45 1362.93,46 18293.3,47 4.685,48 141.161,49 3.434,50 3.434,51 30,52 28,53 239.317,54 9258,55 4.111,56 13.054,57 26.722,58 3.673,59 16.28,60 6.86}
{0 CHEMBL180251,1 5.286,3 0.013,4 6.733,5 6.733,6 0.976,7 1.126,8 2,9 0.041,10 2,11 814,12 4.554,14 0.128,15 0.78,16 1.664,17 7.836,18 106.039,19 77.132,20 0.019,21 3.84,25 16.951,26 0.114,27 -0.052,28 1.309,29 16.48,30 16.48,31 16.48,32 16.48,33 16.48,34 5.472,35 1.877,36 3.718,37 -0.01,38 3.679,39 1.303,40 0.357,41 3.841,42 4.025,43 3.909,44 6735,45 997.589,46 12028.9,47 4.522,48 115.921,49 3.296,50 3.296,51 26,52 24,53 185.371,54 6581,55 3.97,56 11.69,57 23.801,58 3.666,59 13.408,60 5.652}
{0 CHEMBL180359,1 5.226,3 -0.246,4 6.429,5 6.429,6 1.176,7 1.53,8 3,9 -0.179,10 2,11 671,12 4.496,14 0.105,15 0.632,16 1.654,17 7.725,18 102.042,19 72.89,20 0.018,21 3.848,25 15.954,26 0.122,27 -0.386,28 1.893,29 15.662,30 15.662,31 15.662,32 15.662,33 15.662,34 5.167,35 1.878,36 3.729,37 -0.187,38 3.674,39 0.81,40 -0.103,41 3.85,42 4.025,43 3.868,44 5820,45 877.689,46 10143.2,47 4.458,48 108.536,49 3.258,50 3.258,51 25,52 23,53 177.359,54 5673,55 3.932,56 11.169,57 22.745,58 3.671,59 12.792,60 8.377}
{0 CHEMBL180692,1 5.251,3 -0.059,4 6.533,5 6.533,6 1.08,7 1.287,8 3,9 -0.07,10 2,11 782,12 4.557,14 0.122,15 0.78,16 1.667,17 7.853,18 110.039,19 76.118,20 0.017,21 3.85,25 16.824,26 0.118,27 -0.223,28 1.637,29 16.533,30 16.533,31 16.533,32 16.533,33 16.533,34 5.5,35 1.878,36 3.734,37 -0.078,38 3.727,39 1.375,40 0.398,41 3.853,42 4.078,43 3.909,44 6447,45 967.04,46 11551.1,47 4.522,48 114.953,49 3.296,50 3.296,51 26,52 24,53 188.236,54 6310,55 3.97,56 11.707,57 23.572,58 3.675,59 13.229,60 8.553}
{0 CHEMBL181250,1 5.511,3 0.055,4 7.345,5 7.345,6 0.988,7 1.032,8 2,9 0.059,10 1,11 863,12 4.619,14 0.1,15 0.512,16 1.677,17 7.967,18 111.342,19 82.272,20 0.022,21 3.855,25 16.771,26 0.112,27 -0.172,28 1.339,29 16.005,30 16.005,31 16.005,32 16.005,33 16.005,34 5.25,35 1.689,36 3.748,37 0.001,38 3.762,39 0.805,40 -0.11,41 3.87,42 4.143,43 3.936,44 7095,45 1061.91,46 13098.3,47 4.532,48 121.545,49 3.332,50 3.332,51 27,52 25,53 202.646,54 6999,55 4.007,56 11.736,57 24.36,58 3.67,59 14.665,60 6.403}
{0 CHEMBL181304,1 5.486,3 -0.124,4 7.202,5 7.202,6 1.172,7 1.373,8 3,9 -0.151,10 2,11 865,12 4.619,14 0.1,15 0.632,16 1.677,17 7.968,18 109.342,19 78.826,20 0.023,21 3.85,25 16.797,26 0.113,27 -0.447,28 1.827,29 16.264,30 16.264,31 16.264,32 16.264,33 16.264,34 5.333,35 1.878,36 3.729,37 -0.04,38 3.734,39 0.811,40 -0.103,41 3.849,42 4.094,43 3.94,44 7150,45 1062.02,46 13107.7,47 4.546,48 121.561,49 3.332,50 3.332,51 27,52 25,53 201.44,54 7023,55 4.007,56 11.842,57 24.388,58 3.671,59 14.303,60 7.201}
{0 CHEMBL181458,1 5.226,3 -0.1,4 6.429,5 6.429,6 1.117,7 1.246,8 2,9 -0.16,10 1,11 671,12 4.496,14 0.114,15 0.632,16 1.654,17 7.725,18 104.042,19 73.756,20 0.018,21 3.84,25 16.005,26 0.121,27 -0.312,28 1.573,29 15.662,30 15.662,31 15.662,32 15.662,33 15.662,34 5.167,35 1.876,36 3.716,37 0.011,38 3.63,39 0.807,40 -0.103,41 3.841,42 4.025,43 3.868,44 5820,45 877.689,46 10143.2,47 4.458,48 108.536,49 3.258,50 3.258,51 25,52 23,53 177.359,54 5673,55 3.932,56 11.169,57 22.745,58 3.663,59 12.899,60 7.721}
{0 CHEMBL186620,1 5.195,2 3,3 -0.064,4 6.246,5 6.246,6 1.116,7 1.058,8 5,9 -0.144,10 3,11 1148,12 4.731,14 0.188,15 1,16 1.692,17 8.161,18 124.382,19 97.987,20 0.016,21 3.911,25 18.665,26 0.106,27 -0.17,28 1.187,29 17.99,30 17.99,31 17.99,32 17.99,33 17.99,34 5.958,35 1.816,36 3.761,37 0.026,38 3.861,39 1.461,40 0.506,41 3.931,42 4.094,43 4.015,44 10229,45 1345.44,46 18785.6,47 4.676,48 138.299,49 3.401,50 3.401,51 29,52 27,53 211.867,54 9870,55 4.078,56 12.971,57 26.777,58 3.703,59 15.417,60 7.959}
{0 CHEMBL186916,1 5.754,2 3,3 -0.034,4 7.882,5 7.882,6 1.089,7 1.028,8 4,9 -0.153,10 3,11 1885,12 5.022,14 0.167,15 1.223,16 1.745,17 8.749,18 157.71,19 113.966,20 0.014,21 3.913,25 21.94,26 0.089,27 -0.021,28 1.123,29 21.117,30 21.117,31 21.117,32 21.117,33 21.117,34 7.069,35 1.914,36 3.761,37 0.205,38 4.011,39 1.86,40 0.845,41 3.931,42 4.317,43 4.203,44 16850,45 2119.41,46 34374.2,47 4.929,48 180.096,49 3.584,50 3.584,51 35,52 33,53 285.03,54 16487,55 4.263,56 15.487,57 31.471,58 3.703,59 18.721,60 8.046}
{0 CHEMBL187507,1 5.4,2 3,3 -0.26,4 7.067,5 7.067,6 1.229,7 1.414,8 5,9 -0.229,10 3,11 1482,12 4.884,14 0.182,15 1.092,16 1.72,17 8.468,18 143.207,19 102.739,20 0.015,21 3.914,25 20.653,26 0.096,27 -0.323,28 1.568,29 20.015,30 20.015,31 20.015,32 20.015,33 20.015,34 6.708,35 1.915,36 3.756,37 -0.193,38 3.949,39 1.609,40 0.618,41 3.941,42 4.19,43 4.117,44 13505,45 1724.42,46 26215.8,47 4.824,48 159.412,49 3.497,50 3.497,51 32,52 30,53 244.755,54 13117,55 4.174,56 14.403,57 29.246,58 3.702,59 16.685,60 7.959}
{0 CHEMBL187607,1 5.754,2 3,3 -0.181,4 7.882,5 7.882,6 1.187,7 1.237,8 4,9 -0.233,10 3,11 1885,12 5.022,14 0.167,15 1.223,16 1.745,17 8.749,18 154.955,19 113.554,20 0.014,21 3.916,25 21.932,26 0.089,27 -0.119,28 1.282,29 21.117,30 21.117,31 21.117,32 21.117,33 21.117,34 7.069,35 1.915,36 3.756,37 0.117,38 4.017,39 1.887,40 0.88,41 3.942,42 4.317,43 4.203,44 16850,45 2119.41,46 34374.2,47 4.929,48 180.096,49 3.584,50 3.584,51 35,52 33,53 285.03,54 16487,55 4.263,56 15.487,57 31.471,58 3.703,59 18.736,60 9.071}
{0 CHEMBL187729,1 5.195,2 3,3 -0.185,4 6.32,5 6.32,6 1.192,7 1.265,8 5,9 -0.201,10 3,11 1374,12 4.834,14 0.176,15 1.092,16 1.711,17 8.366,18 132.881,19 99.262,20 0.015,21 3.914,25 19.667,26 0.099,27 -0.212,28 1.353,29 19.145,30 19.145,31 19.145,32 19.145,33 19.145,34 6.375,35 1.915,36 3.756,37 -0.021,38 3.912,39 1.615,40 0.623,41 3.942,42 4.143,43 4.084,44 12442,45 1601.16,46 23701.6,47 4.772,48 152.493,49 3.466,50 3.466,51 31,52 29,53 233.334,54 12052,55 4.143,56 13.865,57 28.474,58 3.702,59 16.181,60 5.004}
{0 CHEMBL189810,1 5.225,2 3,3 -0.188,4 6.523,5 6.523,6 1.207,7 1.266,8 5,9 -0.21,10 3,11 1359,12 4.835,14 0.176,15 1,16 1.711,17 8.369,18 136.881,19 99.262,20 0.016,21 3.914,25 19.667,26 0.099,27 -0.292,28 1.428,29 19.145,30 19.145,31 19.145,32 19.145,33 19.145,34 6.375,35 1.915,36 3.756,37 -0.104,38 3.912,39 1.609,40 0.618,41 3.942,42 4.159,43 4.084,44 12346,45 1590.11,46 23524.2,47 4.772,48 152.286,49 3.466,50 3.466,51 31,52 29,53 234.02,54 11960,55 4.143,56 13.865,57 28.424,58 3.702,59 16.191,60 8.26}
{0 CHEMBL1956841,1 4.962,3 0.075,4 5.769,5 5.769,6 0.846,7 0.75,9 0.096,11 504,12 4.362,13 2,14 0.108,15 0.5,16 1.629,17 7.46,18 86.239,19 71.334,20 0.023,21 3.819,22 1,23 1,24 5.556,25 14.61,26 0.13,27 0.128,28 0.658,29 14.066,30 14.066,31 14.066,32 14.066,33 14.066,34 4.569,35 1.854,36 3.728,37 0.082,38 3.611,39 0.315,40 -0.616,41 3.833,42 3.97,43 3.781,44 4378,45 698.315,46 7362.96,47 4.311,48 94.973,49 3.178,50 3.178,51 23,52 21,53 160.428,54 4299,55 3.85,56 10.082,57 20.835,58 3.684,59 12.013,60 5.833}
{0 CHEMBL1956842,1 5.084,3 0.079,4 6.173,5 6.173,6 0.859,7 0.75,9 0.092,11 566,12 4.429,13 2,14 0.108,15 0.537,16 1.641,17 7.589,18 92.107,19 76.873,20 0.026,21 3.833,22 1,23 1,24 5.553,25 15.194,26 0.125,27 0.068,28 0.687,29 14.513,30 14.513,31 14.513,32 14.513,33 14.513,34 4.736,35 1.855,36 3.731,37 0.088,38 3.655,39 0.416,40 -0.355,41 3.847,42 4.007,43 3.822,44 4991,45 789.336,46 8658.81,47 4.366,48 101.657,49 3.219,50 3.219,51 24,52 22,53 170.894,54 4923,55 3.892,56 10.475,57 21.764,58 3.686,59 12.755,60 6.483}
{0 CHEMBL1956843,1 5.499,3 0.076,4 7.412,5 7.412,6 0.892,7 0.72,9 0.094,11 875,12 4.615,13 2,14 0.1,15 0.613,16 1.674,17 7.95,18 105.342,19 83.215,20 0.024,21 3.855,22 1,23 1,24 5.432,25 16.781,26 0.111,27 0.174,28 0.613,29 15.985,30 15.985,31 15.985,32 15.985,33 15.985,34 5.236,35 1.878,36 3.734,37 0.177,38 3.73,39 0.985,40 0.039,41 3.86,42 4.111,43 3.938,44 7130,45 1080.47,46 13316.3,47 4.523,48 121.944,49 3.332,50 3.332,51 27,52 25,53 203.685,54 7089,55 4.007,56 11.687,57 24.44,58 3.688,59 14.44,60 7}
{0 CHEMBL1956844,1 5.514,3 0.08,4 7.468,5 7.468,6 0.872,7 0.753,9 0.118,11 855,12 4.617,13 2,14 0.1,15 0.664,16 1.677,17 7.967,18 109.342,19 83.215,20 0.025,21 3.856,22 1,23 1,24 5.4,25 16.781,26 0.111,27 0.056,28 0.789,29 15.985,30 15.985,31 15.985,32 15.985,33 15.985,34 5.236,35 1.878,36 3.733,37 0.009,38 3.73,39 0.892,40 -0.053,41 3.861,42 4.127,43 3.938,44 6858,45 1056.54,46 12867.3,47 4.523,48 121.074,49 3.332,50 3.332,51 27,52 25,53 205.699,54 6833,55 4.007,56 11.687,57 24.236,58 3.688,59 14.455,60 6.842}
{0 CHEMBL1956845,1 5.653,3 0.201,4 7.606,5 7.606,6 0.769,7 0.609,9 0.168,11 835,12 4.618,13 2,14 0.1,15 0.641,16 1.68,17 7.981,18 109.342,19 83.316,20 0.023,21 3.857,22 1,23 1,24 5.357,25 16.83,26 0.112,27 0.174,28 0.664,29 16.038,30 16.038,31 16.038,32 16.038,33 16.038,34 5.264,35 1.878,36 3.732,37 0.278,38 3.73,39 0.985,40 0.039,41 3.862,42 4.174,43 3.939,44 6586,45 1030.41,46 12411,47 4.523,48 120.142,49 3.332,50 3.332,51 27,52 25,53 208.531,54 6578,55 4.007,56 11.704,57 24.04,58 3.687,59 14.445,60 5}
{0 CHEMBL1956846,1 5.537,3 0.098,4 7.521,5 7.521,6 0.89,7 0.732,9 0.106,11 1006,12 4.669,13 2,14 0.122,15 0.725,16 1.684,17 8.058,18 111.457,19 86.816,20 0.029,21 3.827,22 1,23 1,24 5.456,25 17.599,26 0.107,27 0.002,28 0.853,29 16.616,30 16.616,31 16.616,32 16.616,33 16.616,34 5.444,35 1.855,36 3.729,37 0.021,38 3.727,39 1.166,40 0.231,41 3.834,42 4.143,43 3.977,44 8139,45 1201.88,46 15471.2,47 4.584,48 129.323,49 3.367,50 3.367,51 28,52 26,53 211.94,54 8088,55 4.043,56 12.16,57 25.436,58 3.685,59 15.332,60 7.509}
{0 CHEMBL1956847,1 5.342,3 0.022,4 6.968,5 6.968,6 0.922,7 0.825,8 2,9 0.058,11 909,12 4.611,13 2,14 0.128,15 0.713,16 1.674,17 7.945,18 108.096,19 82.877,20 0.027,21 3.831,22 1,23 1,24 5.62,25 17.077,26 0.111,27 0.131,28 0.673,29 16.375,30 16.375,31 16.375,32 16.375,33 16.375,34 5.403,35 1.86,36 3.73,37 -0.009,38 3.785,39 1.154,40 0.209,41 3.838,42 4.111,43 3.943,44 7322,45 1098.2,46 13641.7,47 4.546,48 122.506,49 3.332,50 3.332,51 27,52 25,53 200.002,54 7263,55 4.007,56 11.869,57 24.596,58 3.686,59 14.233,60 8.041}
{0 CHEMBL1956848,1 5.484,3 0.045,4 7.358,5 7.358,6 0.883,7 0.807,9 0.095,11 1095,12 4.725,13 2,14 0.098,15 1,16 1.694,17 8.166,18 118.382,19 90.707,20 0.023,21 3.855,22 1,23 1,24 5.676,25 19.103,26 0.1,27 0.151,28 0.676,29 18.289,30 18.289,31 18.289,32 18.289,33 18.289,34 5.847,35 1.881,36 3.735,37 -0.017,38 3.889,39 1.428,40 0.444,41 3.86,42 4.263,43 4.037,44 9923,45 1314.84,46 17369.4,47 4.685,48 136.067,49 3.434,50 3.434,51 30,52 27,53 229.179,54 9373,55 4.111,56 13.048,57 26.349,58 3.69,59 15.877,60 6.66}
{0 CHEMBL1956849,1 5.499,3 0.08,4 7.412,5 7.412,6 0.851,7 0.781,9 0.139,11 1304,12 4.83,13 2,14 0.088,15 1,16 1.713,17 8.375,18 128.881,19 95.25,20 0.021,21 3.861,22 1,23 1,24 5.704,25 19.982,26 0.093,27 0.187,28 0.636,29 19.184,30 19.184,31 19.184,32 19.184,33 19.184,34 6.181,35 1.886,36 3.736,37 0.019,38 3.985,39 1.428,40 0.444,41 3.866,42 4.357,43 4.1,44 11833,45 1547.8,46 21731.8,47 4.769,48 149.875,49 3.497,50 3.497,51 32,52 29,53 253.76,54 11285,55 4.174,56 13.836,57 27.942,58 3.693,59 16.871,60 7.149}
{0 CHEMBL1956850,1 5.582,3 0.08,4 7.629,5 7.629,6 0.832,7 0.784,9 0.155,11 1406,12 4.879,13 2,14 0.088,15 1,16 1.723,17 8.481,18 139.207,19 98.58,20 0.019,21 3.866,22 1,23 1,24 5.621,25 20.53,26 0.091,27 0.248,28 0.612,29 19.684,30 19.684,31 19.684,32 19.684,33 19.684,34 6.375,35 1.882,36 3.736,37 0.043,38 3.999,39 1.428,40 0.444,41 3.865,42 4.419,43 4.13,44 12522,45 1655.02,46 23518.6,47 4.809,48 156.017,49 3.526,50 3.526,51 33,52 30,53 269.002,54 11997,55 4.205,56 14.246,57 28.59,58 3.693,59 17.456,60 6.81}
{0 CHEMBL1956923,1 5.499,3 0.107,4 7.412,5 7.412,6 0.805,7 0.74,9 0.183,11 1304,12 4.83,13 2,14 0.089,15 1,16 1.713,17 8.375,18 132.881,19 95.704,20 0.021,21 3.809,22 1,23 1,24 5.676,25 20.038,26 0.093,27 0.215,28 0.618,29 19.184,30 19.184,31 19.184,32 19.184,33 19.184,34 6.181,35 1.825,36 3.727,37 0.042,38 3.962,39 1.428,40 0.444,41 3.807,42 4.357,43 4.1,44 11833,45 1547.8,46 21731.8,47 4.769,48 149.875,49 3.497,50 3.497,51 32,52 29,53 253.76,54 11285,55 4.174,56 13.836,57 27.942,58 3.691,59 16.967,60 6.509}
{0 CHEMBL1956925,1 5.267,3 0.075,4 6.741,5 6.741,6 0.86,7 0.756,8 1,9 0.104,11 716,12 4.49,13 2,14 0.122,15 0.557,16 1.651,17 7.704,18 98.042,19 78.202,20 0.026,21 3.827,22 1,23 1,24 5.569,25 15.746,26 0.119,27 0.131,28 0.68,29 15.168,30 15.168,31 15.168,32 15.168,33 15.168,34 4.944,35 1.858,36 3.712,37 0.082,38 3.672,39 0.552,40 -0.356,41 3.834,42 4.043,43 3.866,44 5834,45 898.78,46 10377.5,47 4.433,48 109.038,49 3.258,50 3.258,51 25,52 23,53 178.745,54 5762,55 3.932,56 10.953,57 22.837,58 3.657,59 13.242,60 6.656}
{0 CHEMBL1956926,1 5.339,3 0.037,4 6.76,5 6.76,6 0.89,7 0.81,8 1,9 0.09,11 874,12 4.61,13 2,14 0.128,15 0.68,16 1.675,17 7.949,18 108.096,19 82.805,20 0.026,21 3.831,22 1,23 1,24 5.63,25 17.132,26 0.112,27 0.163,28 0.641,29 16.452,30 16.452,31 16.452,32 16.452,33 16.452,34 5.444,35 1.858,36 3.747,37 -0.025,38 3.793,39 1.085,40 0.135,41 3.838,42 4.111,43 3.943,44 7188,45 1091.06,46 13409.9,47 4.546,48 122.056,49 3.332,50 3.332,51 27,52 25,53 201.655,54 7138,55 4.007,56 11.896,57 24.517,58 3.716,59 14.28,60 7.004}
{0 CHEMBL1956927,1 5.555,3 0.024,4 7.512,5 7.512,6 0.9,7 0.83,8 1,9 0.083,11 938,12 4.667,13 2,14 0.12,15 0.68,16 1.686,17 8.064,18 111.457,19 84.452,20 0.028,21 3.835,22 1,23 1,24 5.655,25 17.382,26 0.116,27 0.169,28 0.631,29 16.731,30 16.731,31 16.731,32 16.731,33 16.731,34 5.507,35 1.858,36 3.763,37 -0.061,38 3.866,39 1.085,40 0.135,41 3.842,42 4.143,43 3.977,44 7871,45 1189.26,46 14998.6,47 4.584,48 128.467,49 3.367,50 3.367,51 28,52 26,53 215.243,54 7838,55 4.043,56 12.203,57 25.298,58 3.745,59 14.786,60 6.192}
{0 CHEMBL1956928,1 5.302,3 0.003,4 6.863,5 6.863,6 0.989,7 0.903,8 1,9 -0.005,11 911,12 4.609,14 0.152,15 0.815,16 1.675,17 7.945,18 110.096,19 84.377,20 0.023,21 3.82,22 1,23 1,24 5.63,25 17.359,26 0.111,27 0.069,28 0.782,29 16.721,30 16.721,31 16.721,32 16.721,33 16.721,34 5.528,35 1.858,36 3.804,37 0.039,38 3.736,39 1.088,40 0.138,41 3.867,42 4.094,43 3.946,44 7448,45 1108.94,46 13848,47 4.56,48 122.846,49 3.332,50 3.332,51 27,52 25,53 197.321,54 7374,55 4.007,56 11.987,57 24.694,58 3.753,59 14.013,60 5.775}
{0 CHEMBL1956929,1 5.27,3 0.057,4 6.746,5 6.746,6 0.874,7 0.783,8 1,9 0.102,11 800,12 4.551,13 2,14 0.136,15 0.679,16 1.664,17 7.829,18 104.039,19 80.833,20 0.025,21 3.829,22 1,23 1,24 5.612,25 16.852,26 0.115,27 0.137,28 0.671,29 16.091,30 16.091,31 16.091,32 16.091,33 16.091,34 5.319,35 1.858,36 3.73,37 0.022,38 3.728,39 1.087,40 0.135,41 3.836,42 4.078,43 3.907,44 6509,45 994.75,46 11868.9,47 4.498,48 115.585,49 3.296,50 3.296,51 26,52 24,53 189.487,54 6446,55 3.97,56 11.513,57 23.7,58 3.686,59 13.709,60 6.311}
{0 CHEMBL1956930,1 5.302,3 0.019,4 6.863,5 6.863,6 0.99,7 0.89,8 1,9 -0.007,11 911,12 4.609,14 0.152,15 0.815,16 1.675,17 7.945,18 110.096,19 84.377,20 0.023,21 3.82,22 1,23 1,24 5.65,25 17.359,26 0.111,27 0.07,28 0.784,29 16.721,30 16.721,31 16.721,32 16.721,33 16.721,34 5.528,35 1.858,36 3.804,37 0.026,38 3.736,39 1.094,40 0.139,41 3.867,42 4.094,43 3.946,44 7448,45 1108.94,46 13848,47 4.56,48 122.846,49 3.332,50 3.332,51 27,52 25,53 197.321,54 7374,55 4.007,56 11.987,57 24.694,58 3.753,59 14.014,60 7.456}
{0 CHEMBL1956931,1 5.512,3 -0.086,4 7.264,5 7.264,6 1.129,7 1.023,8 1,9 -0.143,11 1103,12 4.721,14 0.135,15 0.815,16 1.695,17 8.17,18 117.627,19 87.996,20 0.024,21 3.844,22 1,23 1,24 5.702,25 17.898,26 0.115,27 -0.04,28 0.864,29 17.361,30 17.361,31 17.361,32 17.361,33 17.361,34 5.715,35 1.858,36 3.808,37 -0.047,38 3.873,39 1.094,40 0.14,41 3.894,42 4.127,43 4.014,44 9002,45 1317.97,46 17410.3,47 4.642,48 136.054,49 3.401,50 3.401,51 29,52 27,53 222.531,54 8950,55 4.078,56 12.676,57 26.3,58 3.805,59 15.113,60 8.638}
{0 CHEMBL1956932,1 5.568,3 -0.013,4 7.552,5 7.552,6 1.022,7 0.949,9 -0.018,11 1780,12 4.972,14 0.092,15 1.155,16 1.738,17 8.658,18 143.245,19 102.412,20 0.021,21 3.859,22 1,23 1,24 5.803,25 21.027,26 0.095,27 0.058,28 0.788,29 20.455,30 20.455,31 20.455,32 20.455,33 20.455,34 6.576,35 1.886,36 3.838,37 -0.022,38 4.099,39 2,40 1,41 3.9,42 4.394,43 4.189,44 15490,45 1955.85,46 30007.2,47 4.889,48 171.479,49 3.584,50 3.584,51 35,52 32,53 288.781,54 14886,55 4.263,56 14.998,57 30.434,58 3.825,59 18.276,60 5.277}
{0 CHEMBL1956933,1 4.962,3 -0.001,4 5.769,5 5.769,6 0.951,7 0.827,9 -0.028,11 504,12 4.362,13 2,14 0.093,15 0.18,16 1.629,17 7.46,18 86.239,19 71.334,20 0.023,21 3.749,22 1,23 1,24 5.655,25 14.61,26 0.13,27 0.005,28 0.777,29 14.066,30 14.066,31 14.066,32 14.066,33 14.066,34 4.569,35 1.812,36 3.707,37 0.037,38 3.707,39 0.315,40 -0.616,41 3.78,42 3.97,43 3.781,44 4378,45 698.315,46 7362.96,47 4.311,48 94.973,49 3.178,50 3.178,51 23,52 21,53 160.428,54 4299,55 3.85,56 10.082,57 20.835,58 3.672,59 12.013,60 5.854}
{0 CHEMBL1956934,1 5.499,3 0.111,4 7.412,5 7.412,6 0.764,7 0.697,9 0.157,10 3,11 875,12 4.615,13 2,14 0.091,15 0.581,16 1.674,17 7.95,18 105.342,19 80.965,20 0.024,21 3.828,22 1,23 1,24 5.749,25 16.53,26 0.123,27 0.19,28 0.616,29 15.985,30 15.985,31 15.985,32 15.985,33 15.985,34 5.236,35 1.889,36 3.74,37 0.051,38 3.939,39 0.995,40 0.04,41 3.848,42 4.111,43 3.938,44 7130,45 1080.47,46 13316.3,47 4.523,48 121.944,49 3.332,50 3.332,51 27,52 25,53 203.685,54 7089,55 4.007,56 11.687,57 24.44,58 3.695,59 13.954,60 6.141}
{0 CHEMBL1956935,1 5.117,3 0.055,4 6.225,5 6.225,6 0.835,7 0.764,9 0.095,11 582,12 4.429,13 2,14 0.125,15 0.574,16 1.64,17 7.584,18 92.107,19 74.38,20 0.023,21 3.84,22 1,23 1,24 5.574,25 15.316,26 0.125,27 0.144,28 0.662,29 14.773,30 14.773,31 14.773,32 14.773,33 14.773,34 4.819,35 1.879,36 3.741,37 0.04,38 3.67,39 0.504,40 -0.451,41 3.852,42 3.97,43 3.825,44 5195,45 797.621,46 8881.05,47 4.381,48 102.228,49 3.219,50 3.219,51 24,52 22,53 167.958,54 5078,55 3.892,56 10.582,57 21.929,58 3.694,59 12.485,60 5.967}
{0 CHEMBL1956936,1 5.251,3 0.01,4 6.4,5 6.4,6 0.92,7 0.828,9 0.04,11 746,12 4.557,13 2,14 0.109,15 0.65,16 1.667,17 7.856,18 100.039,19 78.711,20 0.023,21 3.873,22 1,23 1,24 5.71,25 16.136,26 0.127,27 0.115,28 0.676,29 15.59,30 15.59,31 15.59,32 15.59,33 15.59,34 5.111,35 1.908,36 3.741,37 -0.005,38 3.801,39 0.731,40 -0.193,41 3.885,42 4.111,43 3.9,44 6073,45 949.734,46 11037.2,47 4.474,48 113.848,49 3.296,50 3.296,51 26,52 24,53 195.766,54 6008,55 3.97,56 11.316,57 23.323,58 3.694,59 13.47,60 5}
{0 CHEMBL1956937,1 5.499,3 0.029,4 7.412,5 7.412,6 0.935,7 0.774,9 0.086,11 875,12 4.615,13 2,14 0.103,15 0.613,16 1.674,17 7.95,18 109.342,19 83.669,20 0.024,21 3.795,22 1,23 1,24 5.404,25 16.836,26 0.111,27 0.228,28 0.576,29 15.985,30 15.985,31 15.985,32 15.985,33 15.985,34 5.236,35 1.804,36 3.717,37 0.12,38 3.698,39 0.971,40 0.039,41 3.797,42 4.111,43 3.938,44 7130,45 1080.47,46 13316.3,47 4.523,48 121.944,49 3.332,50 3.332,51 27,52 25,53 203.685,54 7089,55 4.007,56 11.687,57 24.44,58 3.682,59 14.535,60 6.1}
{0 CHEMBL1956938,1 5.499,3 0.073,4 7.412,5 7.412,6 0.884,7 0.721,9 0.123,11 875,12 4.615,13 2,14 0.103,15 0.613,16 1.674,17 7.95,18 109.342,19 83.669,20 0.024,21 3.799,22 1,23 1,24 5.392,25 16.84,26 0.111,27 0.21,28 0.601,29 15.985,30 15.985,31 15.985,32 15.985,33 15.985,34 5.236,35 1.808,36 3.724,37 0.139,38 3.699,39 0.97,40 0.039,41 3.797,42 4.111,43 3.938,44 7130,45 1080.47,46 13316.3,47 4.523,48 121.944,49 3.332,50 3.332,51 27,52 25,53 203.685,54 7089,55 4.007,56 11.687,57 24.44,58 3.686,59 14.537,60 5.983}
{0 CHEMBL1956939,1 5.484,3 -0.031,4 7.358,5 7.358,6 0.95,7 0.897,9 0.045,11 1095,12 4.725,13 2,14 0.1,15 1,16 1.694,17 8.166,18 122.382,19 91.161,20 0.023,21 3.799,22 1,23 1,24 5.648,25 19.16,26 0.1,27 0.161,28 0.654,29 18.289,30 18.289,31 18.289,32 18.289,33 18.289,34 5.847,35 1.815,36 3.722,37 -0.133,38 3.863,39 1.428,40 0.444,41 3.8,42 4.263,43 4.037,44 9923,45 1314.84,46 17369.4,47 4.685,48 136.067,49 3.434,50 3.434,51 30,52 27,53 229.179,54 9373,55 4.111,56 13.048,57 26.349,58 3.686,59 15.972,60 6.186}
{0 CHEMBL2016681,1 5.559,2 1,3 -0.101,4 7.381,5 7.381,6 1.248,7 1.016,9 -0.233,11 1132,12 4.727,14 0.096,15 0.5,16 1.694,17 8.166,18 112.872,19 86.85,20 0.017,21 3.806,25 16.907,26 0.119,27 -0.157,28 0.929,29 16.361,30 16.361,31 16.361,32 16.361,33 16.361,34 5.549,35 1.825,36 3.722,37 0.103,38 3.886,39 0.839,40 -0.144,41 3.804,42 3.912,43 3.989,44 8640,45 1320.34,46 17850,47 4.597,48 136.825,49 3.367,50 3.367,51 28,52 27,53 213.798,54 8872,55 4.043,56 12.294,57 26.399,58 3.707,59 14.731,60 8.337}
{0 CHEMBL2069316,1 5.876,2 2,3 -0.093,4 8.131,5 8.131,6 1.036,7 0.979,8 3,9 -0.064,10 3,11 1057,12 4.727,14 0.08,15 1,16 1.7,17 8.202,18 119.627,19 87.881,20 0.018,21 3.948,25 18.668,26 0.102,27 0.025,28 0.795,29 18.135,30 18.135,31 18.135,32 18.135,33 18.135,34 5.819,35 1.988,36 3.795,37 -0.147,38 3.943,39 1.409,40 0.434,41 3.977,42 4.331,43 4.034,44 8779,45 1245.91,46 15740.2,47 4.673,48 133.31,49 3.434,50 3.434,51 30,52 27,53 238.849,54 8402,55 4.111,56 12.975,57 25.754,58 3.753,59 15.426,60 9.699}
{0 CHEMBL2070137,1 5.858,2 2,3 -0.052,4 8.078,5 8.078,6 1.002,7 0.935,8 3,9 -0.037,10 2,11 966,12 4.672,14 0.085,15 0.938,16 1.689,17 8.087,18 116.211,19 85.417,20 0.017,21 3.934,25 18.168,26 0.104,27 0.015,28 0.812,29 17.635,30 17.635,31 17.635,32 17.635,33 17.635,34 5.625,35 1.974,36 3.795,37 -0.05,38 3.894,39 1.409,40 0.433,41 3.962,42 4.277,43 4.001,44 8142,45 1151.65,46 14208.3,47 4.629,48 127.052,49 3.401,50 3.401,51 29,52 26,53 224.905,54 7748,55 4.078,56 12.565,57 25.035,58 3.752,59 14.959,60 9.337}
{0 CHEMBL2070138,1 4.874,2 2,3 -0.112,4 5.156,5 5.156,6 1.094,7 0.998,8 1,9 -0.138,11 507,12 4.361,14 0.103,15 0.563,16 1.631,17 7.469,18 86.239,19 70.619,20 0.019,21 3.846,25 14.517,26 0.13,27 -0.074,28 0.88,29 14.118,30 14.118,31 14.118,32 14.118,33 14.118,34 4.597,35 1.877,36 3.712,37 -0.019,38 3.667,39 0.396,40 -0.545,41 3.888,42 4.025,43 3.781,44 4204,45 688.266,46 7148.3,47 4.311,48 94.307,49 3.178,50 3.178,51 23,52 21,53 162.643,54 4157,55 3.85,56 10.098,57 20.683,58 3.677,59 12.032,60 5.332}
{0 CHEMBL2070139,1 5.658,2 2,3 -0.075,4 7.41,5 7.41,6 1.036,7 0.94,8 2,9 -0.093,10 2,11 1062,12 4.725,14 0.1,15 1,16 1.702,17 8.212,18 122.382,19 88.518,20 0.017,21 3.935,25 18.793,26 0.104,27 -0.065,28 0.866,29 18.394,30 18.394,31 18.394,32 18.394,33 18.394,34 5.903,35 1.977,36 3.785,37 -0.016,38 3.937,39 1.979,40 0.977,41 3.967,42 4.357,43 4.037,44 8573,45 1232.79,46 15446.4,47 4.685,48 132.74,49 3.434,50 3.434,51 30,52 27,53 239.437,54 8224,55 4.111,56 13.082,57 25.658,58 3.746,59 15.503,60 5.391}
{0 CHEMBL2070140,1 5.858,2 2,3 -0.11,4 8.08,5 8.08,6 1.061,7 0.991,8 3,9 -0.109,10 2,11 1080,12 4.725,14 0.1,15 0.938,16 1.699,17 8.194,18 122.382,19 88.417,20 0.017,21 3.935,25 18.74,26 0.1,27 -0.042,28 0.852,29 18.342,30 18.342,31 18.342,32 18.342,33 18.342,34 5.875,35 1.974,36 3.8,37 -0.1,38 3.937,39 1.979,40 0.977,41 3.963,42 4.317,43 4.037,44 9049,45 1267.7,46 16150.9,47 4.685,48 133.997,49 3.434,50 3.434,51 30,52 27,53 235.355,54 8637,55 4.111,56 13.065,57 25.922,58 3.76,59 15.504,60 9.367}
{0 CHEMBL2070141,1 5.891,2 2,3 -0.09,4 8.196,5 8.196,6 1.06,7 0.995,8 3,9 -0.078,10 1,11 1098,12 4.722,14 0.1,15 1,16 1.696,17 8.174,18 118.382,19 88.417,20 0.021,21 3.934,25 18.74,26 0.1,28 0.834,29 18.342,30 18.342,31 18.342,32 18.342,33 18.342,34 5.875,35 1.973,36 3.805,37 -0.086,38 3.937,39 1.984,40 0.982,41 3.961,42 4.304,43 4.037,44 9525,45 1299.99,46 16846.2,47 4.685,48 135.165,49 3.434,50 3.434,51 30,52 27,53 232.388,54 9051,55 4.111,56 13.065,57 26.186,58 3.764,59 15.487,60 8.201}
{0 CHEMBL2070142,1 5.908,2 2,3 -0.007,4 8.27,5 8.27,6 1.047,7 0.87,8 1,9 -0.114,11 822,12 4.614,14 0.095,15 0.631,16 1.679,17 7.976,18 109.342,19 82.5,20 0.02,21 3.87,25 16.687,26 0.112,27 -0.042,28 0.855,29 16.038,30 16.038,31 16.038,32 16.038,33 16.038,34 5.264,35 1.898,36 3.729,37 0.304,38 3.78,39 0.448,40 -0.452,41 3.905,42 4.174,43 3.939,44 6556,45 1042.39,46 12451.1,47 4.523,48 120.179,49 3.332,50 3.332,51 27,52 25,53 208.86,54 6579,55 4.007,56 11.704,57 24.063,58 3.694,59 14.476,60 7.352}
{0 CHEMBL2070143,1 5.933,2 2,3 -0.141,4 8.386,5 8.386,6 1.098,7 1.028,8 1,9 -0.135,11 970,12 4.669,14 0.116,15 0.682,16 1.689,17 8.086,18 115.457,19 86.1,20 0.026,21 3.851,25 17.505,26 0.107,27 -0.072,28 0.875,29 16.668,30 16.668,31 16.668,32 16.668,33 16.668,34 5.472,35 1.877,36 3.713,37 -0.138,38 3.777,39 0.775,40 -0.086,41 3.889,42 4.205,43 3.977,44 7465,45 1159.38,46 14432.9,47 4.584,48 127.423,49 3.367,50 3.367,51 28,52 26,53 217.343,54 7486,55 4.043,56 12.177,57 25.039,58 3.682,59 15.366,60 8.721}
{0 CHEMBL2070144,1 5.858,2 2,3 -0.096,4 8.08,5 8.08,6 1.069,7 0.985,8 3,9 -0.111,10 2,11 1080,12 4.725,14 0.098,15 0.938,16 1.699,17 8.194,18 122.382,19 88.008,20 0.017,21 3.935,25 18.686,26 0.102,27 -0.058,28 0.872,29 18.342,30 18.342,31 18.342,32 18.342,33 18.342,34 5.875,35 1.977,36 3.836,37 -0.089,38 3.964,39 1.99,40 0.989,41 3.969,42 4.317,43 4.037,44 9049,45 1267.7,46 16150.9,47 4.685,48 133.997,49 3.434,50 3.434,51 30,52 27,53 235.355,54 8637,55 4.111,56 13.065,57 25.922,58 3.782,59 15.404,60 7.936}
{0 CHEMBL2070145,1 5.858,3 -0.091,4 8.08,5 8.08,6 1.053,7 0.98,8 3,9 -0.095,10 3,11 1080,12 4.725,14 0.098,15 0.938,16 1.699,17 8.194,18 122.382,19 88.008,20 0.017,21 3.935,25 18.686,26 0.102,27 -0.071,28 0.884,29 18.342,30 18.342,31 18.342,32 18.342,33 18.342,34 5.875,35 1.978,36 3.838,37 -0.09,38 3.964,39 1.99,40 0.989,41 3.969,42 4.317,43 4.037,44 9049,45 1267.7,46 16150.9,47 4.685,48 133.997,49 3.434,50 3.434,51 30,52 27,53 235.355,54 8637,55 4.111,56 13.065,57 25.922,58 3.783,59 15.403,60 6.215}
{0 CHEMBL2070146,1 5.955,2 2,3 -0.053,4 8.324,5 8.324,6 0.991,7 0.938,8 3,9 -0.034,10 2,11 1055,12 4.726,14 0.085,15 1,16 1.701,17 8.205,18 122.382,19 88.848,20 0.018,21 3.936,25 18.761,26 0.103,27 0.001,28 0.841,29 18.187,30 18.187,31 18.187,32 18.187,33 18.187,34 5.847,35 1.971,36 3.795,37 -0.071,38 3.91,39 1.409,40 0.434,41 3.962,42 4.357,43 4.034,44 8651,45 1239.15,46 15515,47 4.673,48 132.903,49 3.434,50 3.434,51 30,52 27,53 240.566,54 8283,55 4.111,56 12.992,57 25.688,58 3.753,59 15.507,60 8.569}
{0 CHEMBL2070147,1 6.023,2 2,3 -0.059,4 8.574,5 8.574,6 0.959,7 0.942,8 3,9 0.007,10 2,11 1079,12 4.726,14 0.085,15 1,16 1.701,17 8.206,18 119.627,19 88.747,20 0.018,21 3.936,25 18.72,26 0.102,27 0.082,28 0.756,29 18.135,30 18.135,31 18.135,32 18.135,33 18.135,34 5.819,35 1.972,36 3.795,37 -0.141,38 3.91,39 1.409,40 0.434,41 3.962,42 4.331,43 4.034,44 8707,45 1241.19,46 15616.6,47 4.673,48 133.066,49 3.434,50 3.434,51 30,52 27,53 239.359,54 8334,55 4.111,56 12.975,57 25.722,58 3.753,59 15.533,60 9.268}
{0 CHEMBL2070148,1 5.876,2 2,3 -0.048,4 8.131,5 8.131,6 1.008,7 0.934,8 3,9 -0.051,10 2,11 1057,12 4.727,14 0.085,15 1,16 1.7,17 8.202,18 122.382,19 88.747,20 0.018,21 3.936,25 18.72,26 0.101,27 0.018,28 0.824,29 18.135,30 18.135,31 18.135,32 18.135,33 18.135,34 5.819,35 1.971,36 3.795,37 0.063,38 3.91,39 1.409,40 0.434,41 3.962,42 4.331,43 4.034,44 8779,45 1245.91,46 15740.2,47 4.673,48 133.31,49 3.434,50 3.434,51 30,52 27,53 238.849,54 8402,55 4.111,56 12.975,57 25.754,58 3.752,59 15.534,60 9.796}
{0 CHEMBL2070149,1 5.955,2 2,3 -0.04,4 8.324,5 8.324,6 0.995,7 0.933,8 3,9 -0.031,10 2,11 1055,12 4.726,14 0.085,15 1,16 1.701,17 8.205,18 122.382,19 91.157,20 0.018,21 3.941,25 18.806,26 0.102,27 -0.016,28 0.943,29 18.187,30 18.187,31 18.187,32 18.187,33 18.187,34 5.847,35 1.974,36 3.795,37 -0.044,38 3.927,39 1.409,40 0.434,41 3.971,42 4.357,43 4.034,44 8651,45 1239.15,46 15515,47 4.673,48 132.903,49 3.434,50 3.434,51 30,52 27,53 240.566,54 8283,55 4.111,56 12.992,57 25.688,58 3.753,59 15.611,60 7.393}
{0 CHEMBL2070150,1 6.023,2 2,3 0.045,4 8.574,5 8.574,6 0.912,7 0.844,8 3,9 0.056,10 2,11 1079,12 4.726,14 0.085,15 1,16 1.701,17 8.206,18 122.382,19 91.056,20 0.018,21 3.938,25 18.779,26 0.101,27 0.106,28 0.766,29 18.135,30 18.135,31 18.135,32 18.135,33 18.135,34 5.819,35 1.974,36 3.796,37 -0.028,38 3.927,39 1.409,40 0.434,41 3.969,42 4.331,43 4.034,44 8707,45 1241.19,46 15616.6,47 4.673,48 133.066,49 3.434,50 3.434,51 30,52 27,53 239.359,54 8334,55 4.111,56 12.975,57 25.722,58 3.755,59 15.659,60 7.507}
{0 CHEMBL2070151,1 5.876,2 2,3 -0.105,4 8.131,5 8.131,6 1.03,7 0.996,8 3,9 -0.067,10 3,11 1057,12 4.727,14 0.085,15 1,16 1.7,17 8.202,18 122.382,19 91.056,20 0.018,21 3.941,25 18.779,26 0.101,27 0.01,28 0.918,29 18.135,30 18.135,31 18.135,32 18.135,33 18.135,34 5.819,35 1.974,36 3.795,37 -0.074,38 3.927,39 1.409,40 0.434,41 3.97,42 4.331,43 4.034,44 8779,45 1245.91,46 15740.2,47 4.673,48 133.31,49 3.434,50 3.434,51 30,52 27,53 238.849,54 8402,55 4.111,56 12.975,57 25.754,58 3.753,59 15.66,60 9.796}
{0 CHEMBL2070152,1 5.955,2 2,3 -0.017,4 8.324,5 8.324,6 0.985,7 0.91,8 3,9 0.006,10 2,11 1055,12 4.726,14 0.08,15 1,16 1.701,17 8.205,18 122.382,19 87.982,20 0.018,21 3.947,25 18.721,26 0.105,27 0.056,28 0.775,29 18.187,30 18.187,31 18.187,32 18.187,33 18.187,34 5.847,35 1.989,36 3.796,37 -0.028,38 3.943,39 1.409,40 0.434,41 3.978,42 4.357,43 4.034,44 8651,45 1239.15,46 15515,47 4.673,48 132.903,49 3.434,50 3.434,51 30,52 27,53 240.566,54 8283,55 4.111,56 12.992,57 25.688,58 3.755,59 15.415,60 7.662}
{0 CHEMBL2070153,1 6.023,2 2,3 -0.029,4 8.574,5 8.574,6 0.978,7 0.914,8 3,9 -0.012,10 2,11 1079,12 4.726,14 0.08,15 1,16 1.701,17 8.206,18 122.382,19 87.881,20 0.018,21 3.943,25 18.668,26 0.102,27 0.028,28 0.789,29 18.135,30 18.135,31 18.135,32 18.135,33 18.135,34 5.819,35 1.985,36 3.797,37 -0.027,38 3.943,39 1.409,40 0.434,41 3.974,42 4.331,43 4.034,44 8707,45 1241.19,46 15616.6,47 4.673,48 133.066,49 3.434,50 3.434,51 30,52 27,53 239.359,54 8334,55 4.111,56 12.975,57 25.722,58 3.758,59 15.425,60 6.417}
{0 CHEMBL2070154,1 5.858,2 2,3 -0.031,4 8.078,5 8.078,6 0.976,7 0.906,8 3,9 -0.021,10 2,11 966,12 4.672,14 0.087,15 0.938,16 1.689,17 8.087,18 116.211,19 85.825,20 0.017,21 3.904,25 18.221,26 0.103,27 0.004,28 0.829,29 17.635,30 17.635,31 17.635,32 17.635,33 17.635,34 5.625,35 1.933,36 3.794,37 -0.02,38 3.863,39 1.409,40 0.433,41 3.921,42 4.277,43 4.001,44 8142,45 1151.65,46 14208.3,47 4.629,48 127.052,49 3.401,50 3.401,51 29,52 26,53 224.905,54 7748,55 4.078,56 12.565,57 25.035,58 3.747,59 15.059,60 7.41}
{0 CHEMBL2070155,1 5.858,2 2,3 -0.004,4 8.078,5 8.078,6 0.931,7 0.872,8 3,9 0.021,10 2,11 966,12 4.672,14 0.087,15 0.938,16 1.689,17 8.087,18 116.211,19 85.871,20 0.017,21 3.916,25 18.232,26 0.103,27 0.039,28 0.811,29 17.635,30 17.635,31 17.635,32 17.635,33 17.635,34 5.625,35 1.947,36 3.791,37 -0.025,38 3.867,39 1.409,40 0.433,41 3.935,42 4.277,43 4.001,44 8142,45 1151.65,46 14208.3,47 4.629,48 127.052,49 3.401,50 3.401,51 29,52 26,53 224.905,54 7748,55 4.078,56 12.565,57 25.035,58 3.743,59 15.058,60 9.26}
{0 CHEMBL2070156,1 5.858,2 2,3 -0.061,4 8.078,5 8.078,6 0.991,7 0.932,8 3,9 -0.043,10 2,11 966,12 4.672,14 0.087,15 0.938,16 1.689,17 8.087,18 116.211,19 85.917,20 0.017,21 3.914,25 18.225,26 0.104,27 0.002,28 0.827,29 17.635,30 17.635,31 17.635,32 17.635,33 17.635,34 5.625,35 1.946,36 3.794,37 -0.076,38 3.871,39 1.409,40 0.433,41 3.935,42 4.277,43 4.001,44 8142,45 1151.65,46 14208.3,47 4.629,48 127.052,49 3.401,50 3.401,51 29,52 26,53 224.905,54 7748,55 4.078,56 12.565,57 25.035,58 3.748,59 15.043,60 8.745}
{0 CHEMBL2070157,1 5.858,2 2,3 -0.074,4 8.078,5 8.078,6 1.018,7 0.959,8 3,9 -0.05,10 2,11 966,12 4.672,14 0.087,15 0.938,16 1.689,17 8.087,18 116.211,19 85.871,20 0.017,21 3.905,25 18.231,26 0.104,27 0.016,28 0.81,29 17.635,30 17.635,31 17.635,32 17.635,33 17.635,34 5.625,35 1.936,36 3.795,37 -0.097,38 3.867,39 1.409,40 0.433,41 3.926,42 4.277,43 4.001,44 8142,45 1151.65,46 14208.3,47 4.629,48 127.052,49 3.401,50 3.401,51 29,52 26,53 224.905,54 7748,55 4.078,56 12.565,57 25.035,58 3.751,59 15.056,60 9.509}
{0 CHEMBL2070158,1 5.876,2 3,3 -0.137,4 8.134,5 8.134,6 1.093,7 1.022,8 3,9 -0.142,10 2,11 1184,12 4.778,14 0.1,15 1,16 1.71,17 8.305,18 126.606,19 91.995,20 0.018,21 3.869,25 19.312,26 0.097,27 -0.036,28 0.844,29 18.842,30 18.842,31 18.842,32 18.842,33 18.842,34 6.069,35 1.894,36 3.797,37 -0.144,38 3.931,39 1.976,40 0.974,41 3.886,42 4.369,43 4.069,44 9734,45 1367.73,46 17823.1,47 4.728,48 140.335,49 3.466,50 3.466,51 31,52 28,53 249.46,54 9341,55 4.143,56 13.475,57 26.635,58 3.759,59 16.086,60 8.721}
{0 CHEMBL2070159,1 6.062,2 3,3 -0.067,4 8.343,5 8.343,6 1.011,7 0.966,8 5,9 -0.024,10 2,11 1257,12 4.831,14 0.075,15 1,16 1.719,17 8.409,18 128.127,19 92.614,20 0.021,21 3.877,25 19.27,26 0.102,27 0.084,28 0.754,29 18.775,30 18.775,31 18.775,32 18.775,33 18.775,34 6.007,35 1.894,36 3.814,37 -0.145,38 4.007,39 1.976,40 0.974,41 3.896,42 4.382,43 4.096,44 10461,45 1466.9,46 19549.9,47 4.749,48 146.706,49 3.497,50 3.497,51 32,52 29,53 265.991,54 10080,55 4.174,56 13.665,57 27.326,58 3.792,59 16.619,60 8.125}
{0 CHEMBL2070160,1 6.062,2 3,3 -0.089,4 8.343,5 8.343,6 1.106,7 0.96,8 2,9 -0.15,10 2,11 1257,12 4.831,14 0.068,15 1,16 1.719,17 8.409,18 130.127,19 94.864,20 0.021,21 3.867,25 19.552,26 0.095,27 -0.05,28 0.873,29 18.775,30 18.775,31 18.775,32 18.775,33 18.775,34 6.007,35 1.894,36 3.782,37 0.036,38 3.891,39 1.976,40 0.974,41 3.881,42 4.382,43 4.096,44 10461,45 1466.9,46 19549.9,47 4.749,48 146.706,49 3.497,50 3.497,51 32,52 29,53 265.991,54 10080,55 4.174,56 13.665,57 27.326,58 3.743,59 17.183,60 8.602}
{0 CHEMBL2070161,1 6.302,2 3,3 -0.077,4 9.569,5 9.569,6 1.072,7 0.964,8 2,9 -0.11,10 2,11 1402,12 4.878,14 0.085,15 1,16 1.727,17 8.504,18 136.452,19 98.124,20 0.019,21 3.869,25 20.079,26 0.091,27 -0.105,28 0.949,29 19.367,30 19.367,31 19.367,32 19.367,33 19.367,34 6.194,35 1.894,36 3.793,37 -0.09,38 3.932,39 1.976,40 0.974,41 3.885,42 4.443,43 4.129,44 11656,45 1607.57,46 22160.4,47 4.801,48 154.133,49 3.526,50 3.526,51 33,52 30,53 274.97,54 11243,55 4.205,56 14.122,57 28.248,58 3.755,59 17.638,60 9.538}
{0 CHEMBL2070162,1 6.024,2 2,3 -0.124,4 8.576,5 8.576,6 1.037,7 1.012,8 3,9 -0.078,10 2,11 1204,12 4.777,14 0.1,15 1,16 1.711,17 8.309,18 128.606,19 92.033,20 0.018,21 3.869,25 19.311,26 0.099,27 0.014,28 0.794,29 18.842,30 18.842,31 18.842,32 18.842,33 18.842,34 6.069,35 1.894,36 3.797,37 -0.145,38 3.933,39 1.972,40 0.969,41 3.886,42 4.369,43 4.069,44 9654,45 1362.6,46 17681.9,47 4.728,48 140.08,49 3.466,50 3.466,51 31,52 28,53 250,54 9265,55 4.143,56 13.475,57 26.602,58 3.759,59 16.08,60 6.237}
{0 CHEMBL2070163,1 5.955,2 2,3 -0.131,4 8.326,5 8.326,6 1.074,7 1.017,8 3,9 -0.123,10 2,11 1180,12 4.777,14 0.1,15 1,16 1.71,17 8.307,18 126.606,19 92.096,20 0.017,21 3.869,25 19.376,26 0.1,27 -0.05,28 0.857,29 18.894,30 18.894,31 18.894,32 18.894,33 18.894,34 6.097,35 1.894,36 3.8,37 -0.145,38 3.931,39 1.97,40 0.967,41 3.885,42 4.394,43 4.069,44 9598,45 1360.63,46 17578.5,47 4.728,48 139.93,49 3.466,50 3.466,51 31,52 28,53 251.208,54 9214,55 4.143,56 13.492,57 26.57,58 3.762,59 16.087,60 6}
{0 CHEMBL2158014,1 5.876,2 2,3 -0.168,4 8.134,5 8.134,6 1.123,7 1.073,8 3,9 -0.139,10 2,11 1184,12 4.778,14 0.088,15 1,16 1.71,17 8.305,18 128.606,19 92.115,20 0.018,21 3.875,25 19.453,26 0.096,27 -0.031,28 0.841,29 18.842,30 18.842,31 18.842,32 18.842,33 18.842,34 6.069,35 1.908,36 3.791,37 -0.208,38 3.99,39 1.981,40 0.979,41 3.886,42 4.369,43 4.069,44 9734,45 1367.73,46 17823.1,47 4.728,48 140.335,49 3.466,50 3.466,51 31,52 28,53 249.46,54 9341,55 4.143,56 13.475,57 26.635,58 3.741,59 16.318,60 8.302}
{0 CHEMBL2159156,1 5.858,2 2,3 -0.158,4 8.08,5 8.08,6 1.115,7 1.059,8 3,9 -0.137,10 2,11 1080,12 4.725,14 0.094,15 0.834,16 1.699,17 8.194,18 122.382,19 89.9,20 0.017,21 3.863,25 18.979,26 0.099,27 -0.04,28 0.85,29 18.342,30 18.342,31 18.342,32 18.342,33 18.342,34 5.875,35 1.898,36 3.791,37 -0.175,38 3.934,39 1.902,40 0.895,41 3.873,42 4.317,43 4.037,44 9049,45 1267.7,46 16150.9,47 4.685,48 133.997,49 3.434,50 3.434,51 30,52 27,53 235.355,54 8637,55 4.111,56 13.065,57 25.922,58 3.741,59 15.896,60 9.222}
{0 CHEMBL2159157,1 5.858,2 2,3 -0.143,4 8.08,5 8.08,6 1.1,7 1.039,8 5,9 -0.125,10 2,11 1080,12 4.725,14 0.093,15 0.834,16 1.699,17 8.194,18 122.382,19 89.446,20 0.017,21 3.87,25 18.91,26 0.099,27 -0.042,28 0.855,29 18.342,30 18.342,31 18.342,32 18.342,33 18.342,34 5.875,35 1.904,36 3.791,37 -0.144,38 3.947,39 1.929,40 0.927,41 3.881,42 4.317,43 4.037,44 9049,45 1267.7,46 16150.9,47 4.685,48 133.997,49 3.434,50 3.434,51 30,52 27,53 235.355,54 8637,55 4.111,56 13.065,57 25.922,58 3.741,59 15.787,60 8.166}
{0 CHEMBL2159158,1 5.858,2 2,3 -0.125,4 8.08,5 8.08,6 1.082,7 1.014,8 3,9 -0.115,10 2,11 1080,12 4.725,14 0.091,15 0.834,16 1.699,17 8.194,18 122.382,19 88.991,20 0.017,21 3.888,25 18.845,26 0.099,27 -0.045,28 0.86,29 18.342,30 18.342,31 18.342,32 18.342,33 18.342,34 5.875,35 1.927,36 3.791,37 -0.107,38 3.976,39 1.954,40 0.951,41 3.903,42 4.317,43 4.037,44 9049,45 1267.7,46 16150.9,47 4.685,48 133.997,49 3.434,50 3.434,51 30,52 27,53 235.355,54 8637,55 4.111,56 13.065,57 25.922,58 3.742,59 15.686,60 9.538}
{0 CHEMBL2159159,1 5.858,2 2,3 -0.136,4 8.08,5 8.08,6 1.112,7 1.041,8 3,9 -0.127,10 2,11 1080,12 4.725,14 0.093,15 0.834,16 1.699,17 8.194,18 122.382,19 89.325,20 0.017,21 3.873,25 18.87,26 0.1,27 -0.031,28 0.838,29 18.342,30 18.342,31 18.342,32 18.342,33 18.342,34 5.875,35 1.913,36 3.804,37 -0.168,38 3.97,39 1.927,40 0.918,41 3.893,42 4.317,43 4.037,44 9049,45 1267.7,46 16150.9,47 4.685,48 133.997,49 3.434,50 3.434,51 30,52 27,53 235.355,54 8637,55 4.111,56 13.065,57 25.922,58 3.758,59 15.705,60 7.764}
{0 CHEMBL2159160,1 5.858,2 2,3 -0.082,4 8.08,5 8.08,6 1.026,7 0.965,8 3,9 -0.063,10 2,11 1080,12 4.725,14 0.094,15 0.834,16 1.699,17 8.194,18 122.382,19 89.9,20 0.017,21 3.845,25 18.977,26 0.099,27 -0.002,28 0.839,29 18.342,30 18.342,31 18.342,32 18.342,33 18.342,34 5.875,35 1.877,36 3.797,37 -0.115,38 3.932,39 1.92,40 0.912,41 3.856,42 4.317,43 4.037,44 9049,45 1267.7,46 16150.9,47 4.685,48 133.997,49 3.434,50 3.434,51 30,52 27,53 235.355,54 8637,55 4.111,56 13.065,57 25.922,58 3.749,59 15.894,60 7.799}
{0 CHEMBL2159161,1 5.876,2 3,3 -0.148,4 8.134,5 8.134,6 1.126,7 1.05,8 3,9 -0.144,10 2,11 1184,12 4.778,14 0.093,15 1,16 1.71,17 8.305,18 128.606,19 91.995,20 0.018,21 3.859,25 19.312,26 0.097,27 -0.023,28 0.832,29 18.842,30 18.842,31 18.842,32 18.842,33 18.842,34 6.069,35 1.89,36 3.8,37 -0.169,38 3.979,39 1.976,40 0.974,41 3.876,42 4.369,43 4.069,44 9734,45 1367.73,46 17823.1,47 4.728,48 140.335,49 3.466,50 3.466,51 31,52 28,53 249.46,54 9341,55 4.143,56 13.475,57 26.635,58 3.759,59 16.086,60 6.714}
{0 CHEMBL2159162,1 5.858,2 2,3 -0.118,4 8.078,5 8.078,6 1.061,7 1.008,8 3,9 -0.083,10 2,11 966,12 4.672,14 0.08,15 0.834,16 1.689,17 8.087,18 116.211,19 86.9,20 0.017,21 3.862,25 18.408,26 0.102,27 0.006,28 0.813,29 17.635,30 17.635,31 17.635,32 17.635,33 17.635,34 5.625,35 1.898,36 3.784,37 -0.148,38 3.892,39 1.408,40 0.433,41 3.873,42 4.277,43 4.001,44 8142,45 1151.65,46 14208.3,47 4.629,48 127.052,49 3.401,50 3.401,51 29,52 26,53 224.905,54 7748,55 4.078,56 12.565,57 25.035,58 3.73,59 15.351,60 9.367}
{0 CHEMBL2159163,1 5.869,2 2,3 -0.112,4 8.098,5 8.098,6 1.051,7 1.008,8 4,9 -0.066,10 2,11 1059,12 4.727,14 0.075,15 0.834,16 1.699,17 8.196,18 120.382,19 88.872,20 0.018,21 3.863,25 18.688,26 0.1,27 0.03,28 0.791,29 17.996,30 17.996,31 17.996,32 17.996,33 17.996,34 5.75,35 1.898,36 3.801,37 -0.166,38 3.947,39 1.899,40 0.892,41 3.874,42 4.304,43 4.034,44 8937,45 1256.67,46 15957.7,47 4.673,48 133.7,49 3.434,50 3.434,51 30,52 27,53 237.589,54 8537,55 4.111,56 12.948,57 25.844,58 3.758,59 15.923,60 8.876}
{0 CHEMBL2159164,1 6.039,2 2,3 -0.108,4 8.281,5 8.281,6 1.043,7 1.009,8 5,9 -0.054,10 2,11 1142,12 4.78,14 0.071,15 0.834,16 1.709,17 8.302,18 123.851,19 90.518,20 0.02,21 3.865,25 18.937,26 0.105,27 0.047,28 0.774,29 18.275,30 18.275,31 18.275,32 18.275,33 18.275,34 5.813,35 1.898,36 3.817,37 -0.182,38 4.01,39 1.903,40 0.896,41 3.876,42 4.331,43 4.065,44 9736,45 1363.14,46 17757,47 4.708,48 140.281,49 3.466,50 3.466,51 31,52 28,53 251.695,54 9334,55 4.143,56 13.254,57 26.618,58 3.786,59 16.429,60 8.37}
{0 CHEMBL2159165,1 5.859,2 2,3 -0.192,4 8.085,5 8.085,6 1.163,7 1.106,8 3,9 -0.181,10 2,11 1182,12 4.777,14 0.089,15 0.837,16 1.709,17 8.299,18 126.606,19 92.035,20 0.018,21 3.863,25 19.235,26 0.096,27 -0.079,28 0.885,29 18.626,30 18.626,31 18.626,32 18.626,33 18.626,34 5.958,35 1.898,36 3.799,37 -0.198,38 3.985,39 1.906,40 0.898,41 3.873,42 4.357,43 4.069,44 9960,45 1382.12,46 18150.3,47 4.728,48 140.853,49 3.466,50 3.466,51 31,52 28,53 247.236,54 9534,55 4.143,56 13.421,57 26.754,58 3.756,59 16.407,60 9.553}
{0 CHEMBL2159166,1 6.039,2 2,3 -0.123,4 8.281,5 8.281,6 1.108,7 1.001,8 2,9 -0.115,10 2,11 1142,12 4.78,14 0.064,15 0.834,16 1.709,17 8.302,18 123.851,19 92.768,20 0.02,21 3.862,25 19.219,26 0.098,27 0.003,28 0.826,29 18.275,30 18.275,31 18.275,32 18.275,33 18.275,34 5.813,35 1.898,36 3.767,37 -0.011,38 3.895,39 1.902,40 0.895,41 3.872,42 4.331,43 4.065,44 9736,45 1363.14,46 17757,47 4.708,48 140.281,49 3.466,50 3.466,51 31,52 28,53 251.695,54 9334,55 4.143,56 13.254,57 26.618,58 3.717,59 16.992,60 9.137}
{0 CHEMBL2159167,1 6.157,2 2,3 -0.116,4 9.129,5 9.129,6 1.085,7 1.006,8 2,9 -0.099,10 2,11 1272,12 4.829,14 0.08,15 0.864,16 1.718,17 8.401,18 127.372,19 96.028,20 0.018,21 3.863,25 19.746,26 0.093,27 -0.058,28 0.897,29 18.867,30 18.867,31 18.867,32 18.867,33 18.867,34 6,35 1.898,36 3.784,37 -0.126,38 3.935,39 1.906,40 0.898,41 3.873,42 4.394,43 4.099,44 10875,45 1497.42,46 20203.8,47 4.761,48 147.636,49 3.497,50 3.497,51 32,52 29,53 260.542,54 10439,55 4.174,56 13.711,57 27.546,58 3.735,59 17.448,60 9.678}
{0 CHEMBL2159168,1 6.164,2 2,3 -0.107,4 9.142,5 9.142,6 1.06,7 1.006,8 4,9 -0.058,10 2,11 1456,12 4.927,14 0.071,15 1,16 1.735,17 8.597,18 140.825,19 100.268,20 0.021,21 3.865,25 20.721,26 0.101,27 0.012,28 0.828,29 19.838,30 19.838,31 19.838,32 19.838,33 19.838,34 6.375,35 1.898,36 3.816,37 -0.142,38 4.049,39 1.972,40 0.968,41 3.876,42 4.443,43 4.156,44 12517,45 1721.98,46 24114.6,47 4.833,48 160.566,49 3.555,50 3.555,51 34,52 31,53 292.253,54 12091,55 4.234,56 14.504,57 28.956,58 3.792,59 18.314,60 8.845}
{0 CHEMBL2159169,1 5.86,2 2,3 -0.116,4 8.089,5 8.089,6 1.07,7 1.004,8 3,9 -0.084,10 2,11 1084,12 4.725,14 0.08,15 1,16 1.699,17 8.192,18 122.382,19 90.129,20 0.019,21 3.867,25 18.918,26 0.099,27 0.029,28 0.792,29 18.082,30 18.082,31 18.082,32 18.082,33 18.082,34 5.792,35 1.894,36 3.784,37 -0.104,38 3.907,39 1.408,40 0.433,41 3.872,42 4.304,43 4.034,44 9027,45 1268.93,46 16162.8,47 4.673,48 134.034,49 3.434,50 3.434,51 30,52 27,53 236.434,54 8633,55 4.111,56 12.959,57 25.904,58 3.73,59 15.943,60 8.979}
{0 CHEMBL2159170,1 5.86,2 2,3 -0.131,4 8.089,5 8.089,6 1.056,7 1.011,8 3,9 -0.08,10 2,11 1084,12 4.725,14 0.08,15 1,16 1.699,17 8.192,18 122.382,19 92.438,20 0.019,21 3.873,25 18.991,26 0.099,27 0.038,28 0.756,29 18.082,30 18.082,31 18.082,32 18.082,33 18.082,34 5.792,35 1.899,36 3.786,37 -0.152,38 3.925,39 1.408,40 0.433,41 3.885,42 4.304,43 4.034,44 9027,45 1268.93,46 16162.8,47 4.673,48 134.034,49 3.434,50 3.434,51 30,52 27,53 236.434,54 8633,55 4.111,56 12.959,57 25.904,58 3.731,59 16.094,60 9.071}
{0 CHEMBL2159171,1 5.86,2 2,3 -0.151,4 8.089,5 8.089,6 1.081,7 1.051,8 3,9 -0.105,10 2,11 1084,12 4.725,14 0.075,15 1,16 1.699,17 8.192,18 122.382,19 89.263,20 0.019,21 3.886,25 18.855,26 0.099,28 0.817,29 18.082,30 18.082,31 18.082,32 18.082,33 18.082,34 5.792,35 1.919,36 3.787,37 -0.176,38 3.941,39 1.408,40 0.433,41 3.896,42 4.304,43 4.034,44 9027,45 1268.93,46 16162.8,47 4.673,48 134.034,49 3.434,50 3.434,51 30,52 27,53 236.434,54 8633,55 4.111,56 12.959,57 25.904,58 3.732,59 15.818,60 9.097}
{0 CHEMBL2159172,1 5.861,2 2,3 -0.082,4 8.095,5 8.095,6 1.023,7 0.982,8 3,9 -0.033,10 2,11 1212,12 4.776,14 0.093,15 1,16 1.708,17 8.293,18 128.606,19 93.606,20 0.018,21 3.868,25 19.904,26 0.096,27 0.061,28 0.77,29 18.952,30 18.952,31 18.952,32 18.952,33 18.952,34 6.125,35 1.899,36 3.785,37 -0.118,38 3.945,39 1.408,40 0.433,41 3.874,42 4.331,43 4.07,44 10032,45 1395.05,46 18377.2,47 4.728,48 141.203,49 3.466,50 3.466,51 31,52 28,53 246.892,54 9630,55 4.143,56 13.497,57 26.801,58 3.73,59 16.436,60 8.519}
{0 CHEMBL2159174,1 5.844,2 2,3 -0.126,4 8.029,5 8.029,6 1.064,7 1.02,8 3,9 -0.089,10 2,11 964,12 4.669,14 0.096,15 0.824,16 1.687,17 8.075,18 116.211,19 85.991,20 0.018,21 3.891,25 18.138,26 0.103,27 0.011,28 0.814,29 17.635,30 17.635,31 17.635,32 17.635,33 17.635,34 5.625,35 1.898,36 3.789,37 -0.155,38 3.936,39 1.628,40 0.637,41 3.906,42 4.304,43 3.999,44 8357,45 1173.18,46 14598.7,47 4.629,48 127.749,49 3.401,50 3.401,51 29,52 26,53 223.144,54 7961,55 4.078,56 12.565,57 25.198,58 3.741,59 15.184,60 8.996}
{0 CHEMBL2312063,1 5.148,2 2,3 0.041,4 6.309,5 6.309,6 0.895,7 0.824,8 3,9 0.027,10 1,11 680,12 4.495,14 0.125,15 0.693,16 1.652,17 7.714,18 102.042,19 83.597,20 0.025,21 3.855,25 16.093,26 0.118,27 0.073,28 0.689,29 15.22,30 15.22,31 15.22,32 15.22,33 15.22,34 4.986,35 1.88,36 3.783,37 0.018,38 3.746,39 0.501,40 -0.253,41 3.883,42 4.025,43 3.865,44 5820,45 885.494,46 10251.7,47 4.433,48 108.79,49 3.258,50 3.258,51 25,52 23,53 178.986,54 5716,55 3.932,56 10.975,57 22.779,58 3.72,59 13.571,60 7.917}
{0 CHEMBL2312064,1 5.148,2 2,3 -0.001,4 6.309,5 6.309,6 0.872,7 0.842,8 3,9 0.048,10 1,11 680,12 4.495,14 0.125,15 0.693,16 1.652,17 7.714,18 102.042,19 79.964,20 0.025,21 3.85,25 16.024,26 0.118,27 0.056,28 0.668,29 15.22,30 15.22,31 15.22,32 15.22,33 15.22,34 4.986,35 1.877,36 3.773,37 0.004,38 3.712,39 0.513,40 -0.253,41 3.863,42 4.025,43 3.865,44 5820,45 885.494,46 10251.7,47 4.433,48 108.79,49 3.258,50 3.258,51 25,52 23,53 178.986,54 5716,55 3.932,56 10.975,57 22.779,58 3.715,59 13.454,60 7.095}
{0 CHEMBL2312065,1 5.152,2 2,3 -0.066,4 6.317,5 6.317,6 0.929,7 0.948,8 3,9 0.024,10 2,11 707,12 4.493,14 0.14,15 0.605,16 1.651,17 7.703,18 98.042,19 77.426,20 0.019,21 3.848,25 16.165,26 0.118,27 0.105,28 0.775,29 15.48,30 15.48,31 15.48,32 15.48,33 15.48,34 5.069,35 1.888,36 3.776,37 -0.119,38 3.723,39 0.887,40 -0.036,41 3.86,42 3.989,43 3.868,44 6108,45 903.237,46 10607.7,47 4.448,48 109.579,49 3.258,50 3.258,51 25,52 23,53 175.648,54 5949,55 3.932,56 11.082,57 23.003,58 3.718,59 13.221,60 7.602}
{0 CHEMBL2312066,1 5.175,2 2,3 -0.066,4 6.342,5 6.342,6 0.924,7 0.953,8 3,9 0.021,10 2,11 865,12 4.617,14 0.14,15 0.681,16 1.676,17 7.963,18 108.096,19 83.33,20 0.027,21 3.854,25 17.095,26 0.112,27 0.029,28 0.874,29 16.297,30 16.297,31 16.297,32 16.297,33 16.297,34 5.361,35 1.883,36 3.776,37 -0.133,38 3.768,39 1.293,40 0.315,41 3.859,42 4.094,43 3.94,44 7130,45 1069.09,46 13099,47 4.537,48 121.53,49 3.332,50 3.332,51 27,52 25,53 203.012,54 7019,55 4.007,56 11.816,57 24.4,58 3.718,59 14.433,60 8.358}
{0 CHEMBL2312067,1 5.653,2 2,3 0.072,4 7.606,5 7.606,6 0.867,7 0.765,8 1,9 0.068,10 1,11 835,12 4.618,14 0.1,15 0.641,16 1.68,17 7.981,18 109.342,19 83.316,20 0.023,21 3.848,25 16.951,26 0.111,27 0.059,28 0.805,29 16.038,30 16.038,31 16.038,32 16.038,33 16.038,34 5.264,35 1.871,36 3.763,37 0.324,38 3.73,39 0.941,40 0.037,41 3.853,42 4.174,43 3.939,44 6586,45 1030.41,46 12411,47 4.523,48 120.142,49 3.332,50 3.332,51 27,52 25,53 208.531,54 6578,55 4.007,56 11.704,57 24.04,58 3.709,59 14.669,60 5.496}
{0 CHEMBL2312068,1 5.514,2 2,3 -0.031,4 7.468,5 7.468,6 0.941,7 0.896,8 1,9 0.062,10 1,11 855,12 4.617,14 0.1,15 0.664,16 1.677,17 7.967,18 109.342,19 83.215,20 0.025,21 3.847,25 16.906,26 0.109,27 0.052,28 0.812,29 15.985,30 15.985,31 15.985,32 15.985,33 15.985,34 5.236,35 1.871,36 3.764,37 -0.053,38 3.73,39 0.845,40 -0.05,41 3.852,42 4.127,43 3.938,44 6858,45 1056.54,46 12867.3,47 4.523,48 121.074,49 3.332,50 3.332,51 27,52 25,53 205.699,54 6833,55 4.007,56 11.687,57 24.236,58 3.71,59 14.684,60 7.385}
{0 CHEMBL2312069,1 5.499,2 2,3 0.046,4 7.412,5 7.412,6 0.916,7 0.804,8 1,9 0.081,10 1,11 875,12 4.615,14 0.1,15 0.613,16 1.674,17 7.95,18 105.342,19 83.215,20 0.024,21 3.847,25 16.906,26 0.109,27 0.145,28 0.715,29 15.985,30 15.985,31 15.985,32 15.985,33 15.985,34 5.236,35 1.871,36 3.764,37 0.117,38 3.73,39 0.941,40 0.037,41 3.852,42 4.111,43 3.938,44 7130,45 1080.47,46 13316.3,47 4.523,48 121.944,49 3.332,50 3.332,51 27,52 25,53 203.685,54 7089,55 4.007,56 11.687,57 24.44,58 3.71,59 14.67,60 7.008}
{0 CHEMBL2312070,1 5.607,2 3,3 0.012,4 7.761,5 7.761,6 0.925,7 0.856,8 1,9 0.048,10 1,11 986,12 4.672,14 0.122,15 0.801,16 1.687,17 8.077,18 115.457,19 86.816,20 0.021,21 3.818,25 17.724,26 0.106,27 0.106,28 0.778,29 16.616,30 16.616,31 16.616,32 16.616,33 16.616,34 5.444,35 1.847,36 3.756,37 0.037,38 3.727,39 0.849,40 -0.049,41 3.827,42 4.159,43 3.977,44 7799,45 1174.64,46 14902.7,47 4.584,48 128.331,49 3.367,50 3.367,51 28,52 26,53 214.109,54 7768,55 4.043,56 12.16,57 25.209,58 3.707,59 15.574,60 8.148}
{0 CHEMBL2312071,1 5.537,2 2,3 0.017,4 7.521,5 7.521,6 0.938,7 0.858,8 1,9 0.074,11 1006,12 4.669,13 1,14 0.122,15 0.725,16 1.684,17 8.058,18 111.457,19 86.816,20 0.029,21 3.818,25 17.724,26 0.106,27 -0.029,28 0.939,29 16.616,30 16.616,31 16.616,32 16.616,33 16.616,34 5.444,35 1.847,36 3.756,37 0.024,38 3.727,39 1.137,40 0.224,41 3.827,42 4.143,43 3.977,44 8139,45 1201.88,46 15471.2,47 4.584,48 129.323,49 3.367,50 3.367,51 28,52 26,53 211.94,54 8088,55 4.043,56 12.16,57 25.436,58 3.707,59 15.562,60 7.65}
{0 CHEMBL2312072,1 5.469,2 2,3 -0.041,4 7.294,5 7.294,6 0.944,7 0.928,8 3,9 0.017,10 2,11 1077,12 4.727,14 0.104,15 1,16 1.697,17 8.186,18 122.382,19 89.132,20 0.019,21 3.937,25 18.959,26 0.099,27 0.061,28 0.806,29 18.289,30 18.289,31 18.289,32 18.289,33 18.289,34 5.847,35 1.963,36 3.778,37 -0.033,38 3.894,39 1.41,40 0.435,41 3.947,42 4.277,43 4.037,44 9447,45 1284.24,46 16675.3,47 4.685,48 134.937,49 3.434,50 3.434,51 30,52 27,53 231.879,54 8959,55 4.111,56 13.048,57 26.094,58 3.725,59 15.712,60 8.02}
{0 CHEMBL2312073,1 5.484,2 2,3 -0.023,4 7.358,5 7.358,6 0.939,7 0.92,8 2,9 0.046,10 1,11 1095,12 4.725,14 0.104,15 1,16 1.694,17 8.166,18 118.382,19 89.132,20 0.023,21 3.937,25 18.959,26 0.099,27 0.092,28 0.794,29 18.289,30 18.289,31 18.289,32 18.289,33 18.289,34 5.847,35 1.963,36 3.779,37 0.037,38 3.894,39 1.411,40 0.435,41 3.947,42 4.263,43 4.037,44 9923,45 1314.84,46 17369.4,47 4.685,48 136.067,49 3.434,50 3.434,51 30,52 27,53 229.179,54 9373,55 4.111,56 13.048,57 26.349,58 3.726,59 15.698,60 8.55}
{0 CHEMBL2312074,1 5.484,2 2,3 -0.028,4 7.358,5 7.358,6 0.969,7 0.933,8 1,9 0.028,10 1,11 1095,12 4.725,14 0.106,15 1,16 1.694,17 8.166,18 122.382,19 89.586,20 0.023,21 3.904,25 19.022,26 0.099,27 0.082,28 0.803,29 18.289,30 18.289,31 18.289,32 18.289,33 18.289,34 5.847,35 1.926,36 3.775,37 0.049,38 3.867,39 1.41,40 0.435,41 3.908,42 4.263,43 4.037,44 9923,45 1314.84,46 17369.4,47 4.685,48 136.067,49 3.434,50 3.434,51 30,52 27,53 229.179,54 9373,55 4.111,56 13.048,57 26.349,58 3.72,59 15.798,60 8.39}
{0 CHEMBL2312075,1 5.484,2 2,3 -0.043,4 7.358,5 7.358,6 0.948,7 0.943,8 2,9 0.041,11 1095,12 4.725,14 0.106,15 1,16 1.694,17 8.166,18 122.382,19 89.586,20 0.023,21 3.903,25 19.014,26 0.098,27 0.098,28 0.793,29 18.289,30 18.289,31 18.289,32 18.289,33 18.289,34 5.847,35 1.926,36 3.779,37 -0.02,38 3.867,39 1.41,40 0.435,41 3.907,42 4.263,43 4.037,44 9923,45 1314.84,46 17369.4,47 4.685,48 136.067,49 3.434,50 3.434,51 30,52 27,53 229.179,54 9373,55 4.111,56 13.048,57 26.349,58 3.724,59 15.791,60 8.535}
{0 CHEMBL2312076,1 5.484,2 2,3 -0.029,4 7.358,5 7.358,6 0.916,7 0.914,8 2,9 0.051,10 1,11 1095,12 4.725,14 0.106,15 1,16 1.694,17 8.166,18 122.382,19 89.586,20 0.023,21 3.913,25 19.02,26 0.098,27 0.085,28 0.81,29 18.289,30 18.289,31 18.289,32 18.289,33 18.289,34 5.847,35 1.937,36 3.778,37 0.004,38 3.869,39 1.41,40 0.435,41 3.919,42 4.263,43 4.037,44 9923,45 1314.84,46 17369.4,47 4.685,48 136.067,49 3.434,50 3.434,51 30,52 27,53 229.179,54 9373,55 4.111,56 13.048,57 26.349,58 3.722,59 15.799,60 7.016}
{0 CHEMBL2312077,1 5.484,2 2,3 -0.059,4 7.358,5 7.358,6 0.983,7 0.93,8 2,9 -0.023,10 1,11 1095,12 4.725,14 0.093,15 1,16 1.694,17 8.166,18 118.382,19 89.132,20 0.023,21 3.901,25 18.959,26 0.099,27 0.034,28 0.816,29 18.289,30 18.289,31 18.289,32 18.289,33 18.289,34 5.847,35 1.94,36 3.779,37 0.009,38 3.97,39 1.411,40 0.435,41 3.913,42 4.263,43 4.037,44 9923,45 1314.84,46 17369.4,47 4.685,48 136.067,49 3.434,50 3.434,51 30,52 27,53 229.179,54 9373,55 4.111,56 13.048,57 26.349,58 3.724,59 15.698,60 8.426}
{0 CHEMBL2312078,1 5.484,2 2,3 0.028,4 7.358,5 7.358,6 0.945,7 0.872,8 2,9 0.041,10 1,11 1095,12 4.725,14 0.1,15 1,16 1.694,17 8.166,18 118.382,19 88.315,20 0.023,21 3.945,25 18.83,26 0.099,27 0.059,28 0.807,29 18.289,30 18.289,31 18.289,32 18.289,33 18.289,34 5.847,35 1.977,36 3.803,37 0.067,38 3.937,39 1.411,40 0.436,41 3.963,42 4.263,43 4.037,44 9923,45 1314.84,46 17369.4,47 4.685,48 136.067,49 3.434,50 3.434,51 30,52 27,53 229.179,54 9373,55 4.111,56 13.048,57 26.349,58 3.754,59 15.463,60 6.951}
{0 CHEMBL2312079,1 6.076,2 2,3 0.043,4 8.752,5 8.752,6 0.919,7 0.858,8 2,9 0.066,10 1,11 1212,12 4.776,14 0.102,15 1.044,16 1.706,17 8.282,18 124.606,19 91.458,20 0.025,21 3.946,25 19.351,26 0.099,27 0.059,28 0.824,29 18.842,30 18.842,31 18.842,32 18.842,33 18.842,34 6.069,35 1.976,36 3.802,37 0.085,38 3.943,39 1.74,40 0.719,41 3.962,42 4.317,43 4.068,44 10480,45 1410.58,46 18816.1,47 4.728,48 141.909,49 3.466,50 3.466,51 31,52 28,53 244.694,54 9954,55 4.143,56 13.475,57 26.993,58 3.757,59 15.841,60 8.583}
{0 CHEMBL2312080,1 6.136,2 2,3 0.024,4 9.029,5 9.029,6 0.919,7 0.881,8 2,9 0.061,10 1,11 1358,12 4.826,14 0.1,15 1.01,16 1.717,17 8.392,18 128.881,19 94.381,20 0.027,21 3.946,25 19.837,26 0.1,27 0.045,28 0.859,29 19.184,30 19.184,31 19.184,32 19.184,33 19.184,34 6.181,35 1.975,36 3.803,37 -0.035,38 3.973,39 1.944,40 0.925,41 3.962,42 4.369,43 4.098,44 11041,45 1508.01,46 20299.5,47 4.761,48 147.75,49 3.497,50 3.497,51 32,52 29,53 261.631,54 10543,55 4.174,56 13.809,57 27.626,58 3.758,59 16.648,60 7.313}
{0 CHEMBL2312081,1 6.139,2 2,3 0.021,4 9.038,5 9.038,6 0.958,7 0.881,8 2,9 0.031,10 1,11 1356,12 4.825,14 0.091,15 1.23,16 1.717,17 8.391,18 128.881,19 94.123,20 0.022,21 3.97,25 20.266,26 0.111,27 0.048,28 0.8,29 19.736,30 19.736,31 19.736,32 19.736,33 19.736,34 6.181,35 1.973,36 3.858,37 0.058,38 4.032,39 2,40 1,41 4.009,42 4.466,43 4.106,44 11663,45 1508.56,46 20288.8,47 4.783,48 147.736,49 3.526,50 3.526,51 33,52 29,53 269.924,54 10845,55 4.205,56 14.016,57 27.605,58 3.831,59 16.864,60 6.216}
{0 CHEMBL359685,1 5.51,3 0.001,4 7.317,5 7.317,6 1.087,7 1.186,8 3,9 -0.057,10 2,11 954,12 4.675,14 0.116,15 0.671,16 1.688,17 8.085,18 117.457,19 82.054,20 0.022,21 3.852,25 17.667,26 0.11,27 -0.279,28 1.589,29 17.135,30 17.135,31 17.135,32 17.135,33 17.135,34 5.667,35 1.878,36 3.734,37 -0.011,38 3.784,39 1.392,40 0.398,41 3.852,42 4.143,43 3.979,44 7873,45 1161.08,46 14787.2,47 4.606,48 128.155,49 3.367,50 3.367,51 28,52 26,53 212.639,54 7760,55 4.043,56 12.38,57 25.2,58 3.675,59 14.741,60 7.495}
{0 CHEMBL362131,1 5.739,2 3,3 0.091,4 7.702,5 7.702,6 1.012,7 0.847,8 4,9 -0.107,10 3,11 1585,12 4.932,14 0.172,15 1.092,16 1.729,17 8.568,18 149.58,19 105.616,20 0.016,21 3.912,25 21.144,26 0.095,27 -0.266,28 1.291,29 20.515,30 20.515,31 20.515,32 20.515,33 20.515,34 6.903,35 1.914,36 3.761,37 0.198,38 3.99,39 1.62,40 0.629,41 3.93,42 4.277,43 4.147,44 14384,45 1833.45,46 28436.5,47 4.862,48 165.895,49 3.526,50 3.526,51 33,52 31,53 259.241,54 14013,55 4.205,56 14.814,57 29.917,58 3.703,59 17.131,60 8.222}
{0 CHEMBL362795,1 5.37,3 -0.003,4 6.961,5 6.961,6 1.07,7 1.123,8 1,9 -0.055,10 2,11 876,12 4.618,14 0.108,15 0.67,16 1.677,17 7.965,18 111.342,19 79.591,20 0.021,21 3.842,25 16.807,26 0.11,27 -0.23,28 1.438,29 16.212,30 16.212,31 16.212,32 16.212,33 16.212,34 5.306,35 1.876,36 3.716,37 -0.061,38 3.692,39 0.806,40 -0.11,41 3.84,42 4.078,43 3.94,44 7230,45 1068.82,46 13246.4,47 4.546,48 121.821,49 3.332,50 3.332,51 27,52 25,53 200.396,54 7098,55 4.007,56 11.826,57 24.446,58 3.664,59 14.44,60 6.053}
{0 CHEMBL363279,1 5.225,2 3,3 -0.018,4 6.523,5 6.523,6 1.102,7 1.023,8 5,9 -0.125,10 3,11 1359,12 4.835,14 0.176,15 1,16 1.711,17 8.369,18 136.881,19 99.675,20 0.016,21 3.911,25 19.674,26 0.099,27 -0.166,28 1.212,29 19.145,30 19.145,31 19.145,32 19.145,33 19.145,34 6.375,35 1.914,36 3.761,37 0.036,38 3.905,39 1.609,40 0.618,41 3.93,42 4.159,43 4.084,44 12346,45 1590.11,46 23524.2,47 4.772,48 152.286,49 3.466,50 3.466,51 31,52 29,53 234.02,54 11960,55 4.143,56 13.865,57 28.424,58 3.703,59 16.175,60 7.194}
{0 CHEMBL364386,1 5.195,2 3,3 -0.23,4 6.246,5 6.246,6 1.227,7 1.29,8 5,9 -0.234,10 3,11 1148,12 4.731,14 0.188,15 1,16 1.692,17 8.161,18 124.382,19 97.574,20 0.016,21 3.914,25 18.657,26 0.105,27 -0.288,28 1.385,29 17.99,30 17.99,31 17.99,32 17.99,33 17.99,34 5.958,35 1.816,36 3.756,37 -0.165,38 3.867,39 1.462,40 0.506,41 3.943,42 4.094,43 4.015,44 10229,45 1345.44,46 18785.6,47 4.676,48 138.299,49 3.401,50 3.401,51 29,52 27,53 211.867,54 9870,55 4.078,56 12.971,57 26.777,58 3.702,59 15.433,60 9}
{0 CHEMBL364796,1 5.754,2 3,3 -0.173,4 7.803,5 7.803,6 1.154,7 1.269,8 4,9 -0.181,10 3,11 1730,12 4.978,14 0.186,15 1.453,16 1.738,17 8.662,18 156,19 109.547,20 0.015,21 3.915,25 22.185,26 0.092,27 -0.317,28 1.51,29 21.386,30 21.386,31 21.386,32 21.386,33 21.386,34 7.236,35 1.915,36 3.756,37 -0.105,38 3.999,39 1.64,40 0.656,41 3.941,42 4.304,43 4.179,44 15587,45 1974.5,46 31330.6,47 4.91,48 172.97,49 3.555,50 3.555,51 34,52 32,53 270.653,54 15218,55 4.234,56 15.352,57 30.702,58 3.702,59 17.763,60 8.796}
{0 CHEMBL365021,1 5.754,2 3,3 -0.045,4 7.803,5 7.803,6 1.076,7 1.082,8 4,9 -0.12,10 3,11 1730,12 4.978,14 0.186,15 1.453,16 1.738,17 8.662,18 156,19 109.96,20 0.015,21 3.911,25 22.193,26 0.092,27 -0.223,28 1.343,29 21.386,30 21.386,31 21.386,32 21.386,33 21.386,34 7.236,35 1.914,36 3.761,37 0.032,38 3.994,39 1.64,40 0.656,41 3.93,42 4.304,43 4.179,44 15587,45 1974.5,46 31330.6,47 4.91,48 172.97,49 3.555,50 3.555,51 34,52 32,53 270.653,54 15218,55 4.234,56 15.352,57 30.702,58 3.703,59 17.747,60 7.77}
{0 CHEMBL369763,1 5.504,3 -0.257,4 7.259,5 7.259,6 1.172,7 1.53,8 2,9 -0.167,10 2,11 986,12 4.673,14 0.105,15 0.78,16 1.689,17 8.09,18 117.457,19 82.408,20 0.018,21 3.849,25 17.677,26 0.113,27 -0.129,28 1.557,29 17.135,30 17.135,31 17.135,32 17.135,33 17.135,34 5.667,35 1.878,36 3.729,37 -0.222,38 3.728,39 1.375,40 0.405,41 3.849,42 4.174,43 3.979,44 7713,45 1151.14,46 14505.6,47 4.606,48 127.607,49 3.367,50 3.367,51 28,52 26,53 214.265,54 7608,55 4.043,56 12.38,57 25.117,58 3.673,59 14.768,60 7.699}
{0 CHEMBL413359,1 5.226,3 -0.128,4 6.429,5 6.429,6 1.096,7 1.224,8 2,9 -0.135,10 1,11 671,12 4.496,14 0.132,15 0.603,16 1.654,17 7.725,18 104.042,19 74.518,20 0.018,21 3.82,25 16.174,26 0.121,27 -0.169,28 1.366,29 15.662,30 15.662,31 15.662,32 15.662,33 15.662,34 5.167,35 1.856,36 3.71,37 0.027,38 3.642,39 0.807,40 -0.103,41 3.818,42 4.025,43 3.868,44 5820,45 877.689,46 10143.2,47 4.458,48 108.536,49 3.258,50 3.258,51 25,52 23,53 177.359,54 5673,55 3.932,56 11.169,57 22.745,58 3.658,59 13.066,60 6}
{0 CHEMBL441850,1 5.739,2 3,3 -0.037,4 7.702,5 7.702,6 1.089,7 1.034,8 4,9 -0.167,10 3,11 1585,12 4.932,14 0.172,15 1.092,16 1.729,17 8.568,18 149.58,19 105.204,20 0.016,21 3.915,25 21.136,26 0.095,27 -0.36,28 1.459,29 20.515,30 20.515,31 20.515,32 20.515,33 20.515,34 6.903,35 1.915,36 3.756,37 0.061,38 3.996,39 1.62,40 0.629,41 3.942,42 4.277,43 4.147,44 14384,45 1833.45,46 28436.5,47 4.862,48 165.895,49 3.526,50 3.526,51 33,52 31,53 259.241,54 14013,55 4.205,56 14.814,57 29.917,58 3.703,59 17.147,60 9.149}
{0 CHEMBL491930,1 6.022,2 1,3 -0.006,4 8.527,5 8.527,6 1.011,7 0.958,8 4,9 -0.029,10 3,11 1438,12 4.878,14 0.037,15 1.327,16 1.721,17 8.47,18 137.207,19 91.675,20 0.018,21 3.884,25 20.998,26 0.102,27 -0.025,28 1.067,29 20.645,30 20.645,31 20.645,32 20.645,33 20.645,34 6.486,35 1.905,36 3.608,37 -0.052,38 4.004,39 2,40 0.993,41 3.883,42 4.522,43 4.152,44 14027,45 1671.33,46 23877.4,47 4.852,48 156.495,49 3.555,50 3.555,51 34,52 30,53 274.374,54 12783,55 4.234,56 14.645,57 28.807,58 3.624,59 17.328,60 8.77}
{0 CHEMBL540466,1 6.128,2 3,3 -0.093,4 8.785,5 8.785,6 1.111,7 1.112,9 -0.098,11 3642,12 5.362,14 0.077,15 2.204,16 1.811,17 9.478,18 203.722,19 126.411,20 0.021,21 3.878,25 28.623,26 0.079,27 -0.078,28 1.046,29 28.048,30 28.048,31 28.048,32 28.048,33 28.048,34 9.181,35 1.916,36 3.816,37 -0.052,38 4.442,39 2.206,40 1.204,41 3.88,42 4.771,43 4.461,44 30435,45 3519.46,46 63235.2,47 5.303,48 241.1,49 3.85,50 3.85,51 46,52 42,53 438.61,54 28795,55 4.533,56 20.142,57 37.443,58 3.81,59 23.335,60 5}
