"molecule_id","MW","nBT","Sp","Sv","pXC50"
{1 463.56,2 63,3 39.705,4 38.429,5 5.676}
{0 CHEMBL242437,1 520.62,2 70,3 43.926,4 42.692,5 5.06}
{0 CHEMBL242486,1 560.66,2 70,3 45.051,4 43.826,5 5.71}
{0 CHEMBL242862,1 421.52,2 58,3 36.489,4 35.188,5 5.592}
{0 CHEMBL243116,1 614.16,2 75,3 48.438,4 46.728,5 6.268}
{0 CHEMBL243134,1 563.67,2 71,3 45.057,4 43.847,5 6.409}
{0 CHEMBL243180,1 610.72,2 77,3 49.813,4 48.353,5 6.347}
{0 CHEMBL243342,1 595.74,2 72,3 46.705,4 45.034,5 6.638}
{0 CHEMBL243343,1 577.7,2 74,3 46.818,4 45.374,5 6.469}
{0 CHEMBL244165,1 461.54,2 62,3 38.943,4 37.903,5 6.161}
{0 CHEMBL244589,1 504.62,2 70,3 43.472,4 41.978,5 5.684}
{0 CHEMBL244590,1 497.6,2 63,3 40.046,4 38.805,5 5.903}
{0 CHEMBL244802,1 526.65,2 68,3 42.813,4 41.353,5 6.018}
{0 CHEMBL245018,1 565.69,2 72,3 45.818,4 44.374,5 6.201}
{0 CHEMBL389111,1 419.5,2 57,3 35.728,4 34.661,5 5.807}
{0 CHEMBL389494,1 612.14,2 74,3 47.676,4 46.202,5 6.538}
{0 CHEMBL394368,1 578.68,2 73,3 46.267,4 45.068,5 6.102}
{0 CHEMBL394621,1 577.7,2 74,3 46.818,4 45.374,5 6.62}
{0 CHEMBL396498,1 436.54,2 60,3 37.495,4 36.209,5 5.248}
{0 CHEMBL397513,1 515.51,2 62,3 38.756,4 39.053,5 5.745}
{0 CHEMBL428567,1 517.53,2 63,3 39.517,4 39.579,5 5.638}
