"molecule_id","AMW","C.","H.","Me","Mi","Mp","Mv","MW","N.","nAB","nAT","nB","nBM","nBO","nBR","nBT","nC","nCL","nCsp","nCsp2","nCsp3","nDB","nF","nH","nHet","nHM","nI","nN","nO","nP","nS","nSK","nTB","nX","O.","RBF","RBN","SCBO","Se","Si","Sp","Sv","X.","pXC50"
{1 6.654,2 39.5,3 51.3,4 0.994,5 1.129,6 0.639,7 0.597,8 505.72,9 3.9,10 12,11 76,13 16,14 38,16 77,17 30,19 1,20 15,21 14,22 3,24 39,25 7,28 3,29 4,32 37,33 1,35 5.3,36 0.195,37 15,38 49,39 75.519,40 85.806,41 48.54,42 45.406,44 8.585}
{0 CHEMBL108343,1 7.328,2 38.7,3 50.7,4 0.999,5 1.128,6 0.653,7 0.608,8 549.59,9 2.7,10 12,11 75,13 15,14 38,16 76,17 29,18 2,20 15,21 14,22 3,24 38,25 8,26 2,28 2,29 4,32 37,34 2,35 5.3,36 0.197,37 15,38 47,39 74.949,40 84.611,41 49.012,42 45.566,43 2.7,44 5.155}
{0 CHEMBL108540,1 7.343,2 45.2,3 45.2,4 0.998,5 1.118,6 0.675,7 0.642,8 682.88,9 4.3,10 24,11 93,13 30,14 54,16 96,17 42,19 2,20 28,21 12,22 4,24 42,25 9,28 4,29 5,32 51,33 2,35 5.4,36 0.167,37 16,38 74,39 92.832,40 103.929,41 62.762,42 59.669,44 8.678}
{0 CHEMBL108931,1 6.889,2 38.7,3 50.7,4 1.004,5 1.139,6 0.629,7 0.596,8 516.69,9 2.7,10 12,11 75,13 15,14 38,16 76,17 29,20 15,21 14,22 3,23 2,24 38,25 8,28 2,29 4,32 37,34 2,35 5.3,36 0.197,37 15,38 47,39 75.327,40 85.402,41 47.171,42 44.678,43 2.7,44 5.824}
{0 CHEMBL109236,1 6.112,2 34.6,3 56.4,4 0.992,5 1.138,6 0.606,7 0.56,8 476.73,9 2.6,10 6,11 78,13 9,14 34,16 78,17 27,20 9,21 18,22 3,24 44,25 7,28 2,29 5,32 34,35 6.4,36 0.205,37 16,38 40,39 77.396,40 88.763,41 47.273,42 43.68,44 6}
{0 CHEMBL109291,1 7.025,2 40.6,3 48.4,4 1,5 1.127,6 0.648,7 0.614,8 449.6,9 4.7,10 12,11 64,13 16,14 34,16 65,17 26,19 1,20 15,21 10,22 3,24 31,25 7,28 3,29 4,32 33,33 1,35 6.3,36 0.169,37 11,38 45,39 63.985,40 72.145,41 41.495,42 39.299,44 5.469}
{0 CHEMBL109601,1 6.824,2 40,3 50,4 0.996,5 1.128,6 0.643,7 0.605,8 477.66,9 4.3,10 12,11 70,13 16,14 36,16 71,17 28,19 1,20 15,21 12,22 3,24 35,25 7,28 3,29 4,32 35,33 1,35 5.7,36 0.183,37 13,38 47,39 69.752,40 78.976,41 45.017,42 42.352,44 4.569}
{0 CHEMBL110995,1 6.735,2 39.7,3 50.7,4 0.995,5 1.129,6 0.641,7 0.601,8 491.69,9 4.1,10 12,11 73,13 16,14 37,16 74,17 29,19 1,20 15,21 13,22 3,24 37,25 7,28 3,29 4,32 36,33 1,35 5.5,36 0.189,37 14,38 48,39 72.636,40 82.391,41 46.779,42 43.879,44 5.959}
{0 CHEMBL111705,1 6.579,2 39.2,3 51.9,4 0.992,5 1.129,6 0.637,7 0.594,8 519.75,9 3.8,10 12,11 79,13 16,14 39,16 80,17 31,19 1,20 15,21 15,22 3,24 41,25 7,28 3,29 4,32 38,33 1,35 5.1,36 0.188,37 15,38 50,39 78.403,40 89.221,41 50.302,42 46.933,44 7.066}
{0 CHEMBL111745,1 6.51,2 39,3 52.4,4 0.991,5 1.13,6 0.635,7 0.591,8 533.78,9 3.7,10 12,11 82,13 16,14 40,16 83,17 32,19 1,20 15,21 16,22 3,24 43,25 7,28 3,29 4,32 39,33 1,35 4.9,36 0.205,37 17,38 51,39 81.287,40 92.637,41 52.063,42 48.459,44 5.066}
{0 CHEMBL320132,1 6.579,2 39.2,3 51.9,4 0.992,5 1.129,6 0.637,7 0.594,8 519.75,9 3.8,10 12,11 79,13 16,14 39,16 80,17 31,19 1,20 15,21 15,22 3,24 41,25 7,28 3,29 4,32 38,33 1,35 5.1,36 0.2,37 16,38 50,39 78.403,40 89.221,41 50.302,42 46.933,44 6.638}
{0 CHEMBL320510,1 6.276,2 38.3,3 54.3,4 0.987,5 1.131,6 0.629,7 0.58,8 589.9,9 3.2,10 12,11 94,13 16,14 44,16 95,17 36,19 1,20 15,21 20,22 3,24 51,25 7,28 3,29 4,32 43,33 1,35 4.3,36 0.221,37 21,38 55,39 92.821,40 106.297,41 59.109,42 54.567,44 5.377}
{0 CHEMBL320712,1 6.51,2 39,3 52.4,4 0.991,5 1.13,6 0.635,7 0.591,8 533.78,9 3.7,10 12,11 82,13 16,14 40,16 83,17 32,19 1,20 15,21 16,22 3,24 43,25 7,28 3,29 4,32 39,33 1,35 4.9,36 0.181,37 15,38 51,39 81.287,40 92.637,41 52.063,42 48.459,44 4.137}
{0 CHEMBL320750,1 6.92,2 40.3,3 49.3,4 0.998,5 1.128,6 0.646,7 0.609,8 463.63,9 4.5,10 12,11 67,13 16,14 35,16 68,17 27,19 1,20 15,21 11,22 3,24 33,25 7,28 3,29 4,32 34,33 1,35 6,36 0.162,37 11,38 46,39 66.869,40 75.561,41 43.256,42 40.825,44 5.658}
{0 CHEMBL323480,1 6.537,2 37.5,3 52.8,4 0.996,5 1.132,6 0.625,7 0.585,8 470.67,9 2.8,10 11,11 72,13 14,14 35,16 73,17 27,20 13,21 14,22 3,24 38,25 7,28 2,29 5,32 34,35 6.9,36 0.205,37 15,38 43.5,39 71.745,40 81.517,41 44.989,42 42.099,44 4.921}
{0 CHEMBL432621,1 6.409,2 38.7,3 53.3,4 0.991,5 1.13,6 0.631,7 0.585,8 480.71,9 2.7,10 12,11 75,13 15,14 36,16 76,17 29,20 15,21 14,22 3,24 40,25 6,28 2,29 4,32 35,35 5.3,36 0.197,37 15,38 45,39 74.301,40 84.723,41 47.296,42 43.911,44 4.77}
{0 CHEMBL445116,1 7.104,2 43.2,3 47.3,4 0.997,5 1.121,6 0.662,7 0.626,8 525.7,9 4.1,10 18,11 74,13 22,14 41,16 76,17 32,19 1,20 21,21 10,22 3,24 35,25 7,28 3,29 4,32 39,33 1,35 5.4,36 0.171,37 13,38 55,39 73.752,40 82.976,41 49.017,42 46.352,44 6.602}
