{
  "data_qualities": {
    "quality": [
      {
        "name": "AutoCorrelation",
        "value": "-0.06630851063829807"
      },
      {
        "name": "ClassEntropy",
        "value": []
      },
      {
        "name": "Dimensionality",
        "value": "3.580901856763926"
      },
      {
        "name": "EquivalentNumberOfAtts",
        "value": []
      },
      {
        "name": "MajorityClassPercentage",
        "value": []
      },
      {
        "name": "MajorityClassSize",
        "value": []
      },
      {
        "name": "MaxAttributeEntropy",
        "value": []
      },
      {
        "name": "MaxKurtosisOfNumericAtts",
        "value": "377.00000000000716"
      },
      {
        "name": "MaxMeansOfNumericAtts",
        "value": "58097.2944297082"
      },
      {
        "name": "MaxMutualInformation",
        "value": []
      },
      {
        "name": "MaxNominalAttDistinctValues",
        "value": []
      },
      {
        "name": "MaxSkewnessOfNumericAtts",
        "value": "19.416487838948377"
      },
      {
        "name": "MaxStdDevOfNumericAtts",
        "value": "44677.03196644373"
      },
      {
        "name": "MeanAttributeEntropy",
        "value": []
      },
      {
        "name": "MeanKurtosisOfNumericAtts",
        "value": "17.326637269715132"
      },
      {
        "name": "MeanMeansOfNumericAtts",
        "value": "164.9033127751572"
      },
      {
        "name": "MeanMutualInformation",
        "value": []
      },
      {
        "name": "MeanNoiseToSignalRatio",
        "value": []
      },
      {
        "name": "MeanNominalAttDistinctValues",
        "value": []
      },
      {
        "name": "MeanSkewnessOfNumericAtts",
        "value": "1.5814979722383093"
      },
      {
        "name": "MeanStdDevOfNumericAtts",
        "value": "134.6659412621957"
      },
      {
        "name": "MinAttributeEntropy",
        "value": []
      },
      {
        "name": "MinKurtosisOfNumericAtts",
        "value": "-2.009982054267101"
      },
      {
        "name": "MinMeansOfNumericAtts",
        "value": "-3.772917771883289"
      },
      {
        "name": "MinMutualInformation",
        "value": []
      },
      {
        "name": "MinNominalAttDistinctValues",
        "value": []
      },
      {
        "name": "MinSkewnessOfNumericAtts",
        "value": "-13.681436271212734"
      },
      {
        "name": "MinStdDevOfNumericAtts",
        "value": "1.3579638037130497E-4"
      },
      {
        "name": "MinorityClassPercentage",
        "value": []
      },
      {
        "name": "MinorityClassSize",
        "value": []
      },
      {
        "name": "NumberOfBinaryFeatures",
        "value": "0.0"
      },
      {
        "name": "NumberOfClasses",
        "value": "0.0"
      },
      {
        "name": "NumberOfFeatures",
        "value": "1350.0"
      },
      {
        "name": "NumberOfInstances",
        "value": "377.0"
      },
      {
        "name": "NumberOfInstancesWithMissingValues",
        "value": "0.0"
      },
      {
        "name": "NumberOfMissingValues",
        "value": "0.0"
      },
      {
        "name": "NumberOfNumericFeatures",
        "value": "1349.0"
      },
      {
        "name": "NumberOfSymbolicFeatures",
        "value": "1.0"
      },
      {
        "name": "PercentageOfBinaryFeatures",
        "value": "0.0"
      },
      {
        "name": "PercentageOfInstancesWithMissingValues",
        "value": "0.0"
      },
      {
        "name": "PercentageOfMissingValues",
        "value": "0.0"
      },
      {
        "name": "PercentageOfNumericFeatures",
        "value": "99.92592592592592"
      },
      {
        "name": "PercentageOfSymbolicFeatures",
        "value": "0.07407407407407407"
      },
      {
        "name": "Quartile1AttributeEntropy",
        "value": []
      },
      {
        "name": "Quartile1KurtosisOfNumericAtts",
        "value": "-0.15382980816543634"
      },
      {
        "name": "Quartile1MeansOfNumericAtts",
        "value": "0.3037135278514588"
      },
      {
        "name": "Quartile1MutualInformation",
        "value": []
      },
      {
        "name": "Quartile1SkewnessOfNumericAtts",
        "value": "-0.19695244532284809"
      },
      {
        "name": "Quartile1StdDevOfNumericAtts",
        "value": "0.19858436224098547"
      },
      {
        "name": "Quartile2AttributeEntropy",
        "value": []
      },
      {
        "name": "Quartile2KurtosisOfNumericAtts",
        "value": "0.8940104699218936"
      },
      {
        "name": "Quartile2MeansOfNumericAtts",
        "value": "2.0844535809018567"
      },
      {
        "name": "Quartile2MutualInformation",
        "value": []
      },
      {
        "name": "Quartile2SkewnessOfNumericAtts",
        "value": "0.5086190167546738"
      },
      {
        "name": "Quartile2StdDevOfNumericAtts",
        "value": "0.43406260271768615"
      },
      {
        "name": "Quartile3AttributeEntropy",
        "value": []
      },
      {
        "name": "Quartile3KurtosisOfNumericAtts",
        "value": "3.8538376858268"
      },
      {
        "name": "Quartile3MeansOfNumericAtts",
        "value": "7.462864721485414"
      },
      {
        "name": "Quartile3MutualInformation",
        "value": []
      },
      {
        "name": "Quartile3SkewnessOfNumericAtts",
        "value": "1.603077256865559"
      },
      {
        "name": "Quartile3StdDevOfNumericAtts",
        "value": "1.5984531159740982"
      },
      {
        "name": "StdvNominalAttDistinctValues",
        "value": []
      }
    ]
  }
}