"molecule_id","MWC08","MWC07","MPC06","SM06_EA.bo.","MWC06","SpMax1_Bh.v.","SM05_EA.bo.","SpMax1_Bh.i.","Eig02_AEA.dm.","piPC09","GGI4","piPC07","Eig02_AEA.ed.","Eig01_EA.bo.","SM11_AEA.ri.","SM11_EA.bo.","SM12_EA.bo.","SM13_EA.bo.","SM14_EA.bo.","SM15_EA.bo.","SpDiam_EA.bo.","SpMax_EA.bo.","X5A","nCIR","SM03_EA.bo.","MWC09","TWC","SRW10","piPC05","Eig04_EA.bo.","SM14_AEA.ri.","MWC10","SM03_EA.ed.","SM05_AEA.ed.","SM06_AEA.ed.","SM07_AEA.ed.","SM07_EA","SM08_AEA.ed.","MPC04","piPC06","SaaaC","X4A","SM08_EA","piPC08","Eig03_AEA.bo.","GATS8m","Eta_epsi_A","AAC","AECC","ALOGP","ALOGP2","AMR","AMW","ARR","ATS1e","ATS1i","ATS1m","ATS1p","ATS1s","ATS1v","ATS2e","ATS2i","ATS2m","ATS2p","ATS2s","ATS2v","ATS3e","ATS3i","ATS3m","ATS3p","ATS3s","ATS3v","ATS4e","ATS4i","ATS4m","ATS4p","ATS4s","ATS4v","ATS5e","ATS5i","ATS5m","ATS5p","ATS5s","ATS5v","ATS6e","ATS6i","ATS6m","ATS6p","ATS6s","ATS6v","ATS7e","ATS7i","ATS7m","ATS7p","ATS7s","ATS7v","ATS8e","ATS8i","ATS8m","ATS8p","ATS8s","ATS8v","ATSC1e","ATSC1i","ATSC1m","ATSC1p","ATSC1s","ATSC1v","ATSC2e","ATSC2i","ATSC2m","ATSC2p","ATSC2s","ATSC2v","ATSC3e","ATSC3i","ATSC3m","ATSC3p","ATSC3s","ATSC3v","ATSC4e","ATSC4i","ATSC4m","ATSC4p","pXC50"
{1 10.503,2 9.605,3 4.883,4 9.687,5 8.714,6 3.938,7 7.81,8 4.078,9 3.184,10 7.062,11 1.791,12 6.557,13 6.23,14 4.314,15 4.314,16 16.357,17 17.837,18 19.216,19 20.676,20 22.088,21 7.314,22 4.314,23 0.072,24 6,25 4.82,26 11.399,27 12.823,28 10.468,29 6.02,30 2.928,31 2.928,32 12.301,33 7.796,34 10.999,35 12.774,36 14.578,37 8.964,38 16.404,39 4.564,40 6.229,42 0.113,43 10.245,44 6.859,45 4.079,46 0.851,47 0.595,48 1.613,49 13.545,50 4.227,51 17.868,52 130.717,53 7.865,54 0.459,55 4.188,56 4.305,57 3.815,58 3.737,59 5.256,60 3.715,61 4.744,62 4.924,63 4.189,64 4.137,65 5.745,66 4.099,67 5.009,68 5.225,69 4.265,70 4.285,71 6,72 4.216,73 5.078,74 5.299,75 4.237,76 4.28,77 6.101,78 4.192,79 5.077,80 5.319,81 4.134,82 4.262,83 5.981,84 4.157,85 5.062,86 5.301,87 4.084,88 4.229,89 5.992,90 4.115,91 4.964,92 5.207,93 3.925,94 4.116,95 5.904,96 3.995,97 4.873,98 5.121,99 3.774,100 4.009,101 5.802,102 3.876,103 0.09,104 0.888,105 11.378,106 5.248,107 8.702,108 6.884,109 0.229,110 1.468,111 23.256,112 8.459,113 17.877,114 11.571,115 0.452,116 1.781,117 34.803,118 11.434,119 40.129,120 15.759,121 0.653,122 1.823,123 37.587,124 12.818,125 6}
{0 CHEMBL114166,1 9.674,2 8.801,3 4.111,4 8.975,5 7.942,6 3.934,7 7.199,8 4.032,9 2.873,10 5.789,11 0.929,12 5.437,13 5.607,14 4.157,15 4.157,16 15.684,17 17.148,18 18.527,19 19.971,20 21.373,21 7.157,22 4.157,23 0.076,24 3,25 4.29,26 10.541,27 11.958,28 9.661,29 5.129,30 2.451,31 2.451,32 11.416,33 7.018,34 10.243,35 11.992,36 13.772,37 8.161,38 15.576,39 3.738,40 5.324,42 0.119,43 9.411,44 5.589,45 3.573,46 0.865,47 0.531,48 1.404,49 7.842,50 4.413,51 19.475,52 83.051,53 6.825,54 0.3,55 3.764,56 3.892,57 3.257,58 3.31,59 4.695,60 3.242,61 4.342,62 4.556,63 3.595,64 3.69,65 5.189,66 3.596,67 4.569,68 4.766,69 3.773,70 3.92,71 5.417,72 3.796,73 4.764,74 5.017,75 3.664,76 3.927,77 5.519,78 3.743,79 4.711,80 4.989,81 3.578,82 3.743,83 5.503,84 3.566,85 4.282,86 4.519,87 3.272,88 3.55,89 5.085,90 3.376,91 4.298,92 4.546,93 3.046,94 3.499,95 5.096,96 3.287,97 4.18,98 4.466,99 2.811,100 3.339,101 4.837,102 3.1,103 0.034,104 0.538,105 9.671,106 4.15,107 5.772,108 5.759,109 0.158,110 0.864,111 18.775,112 6.701,113 15.292,114 9.459,115 0.162,116 1.062,117 24.501,118 9.09,119 18.103,120 12.501,121 0.221,122 1.148,123 31.825,124 11.054,125 6.504}
{0 CHEMBL122404,1 10.59,2 9.651,3 5.124,4 9.675,5 8.717,6 4.095,7 7.873,8 4.213,9 3.536,10 7.338,11 2.031,12 6.738,13 6.764,14 4.586,15 4.586,16 16.834,17 18.361,18 19.85,19 21.37,20 22.876,21 7.586,22 4.586,23 0.062,24 15,25 4.808,26 11.527,27 12.963,28 10.51,29 5.954,30 2.804,31 2.804,32 12.467,33 7.915,34 11.054,35 12.866,36 14.703,37 9.091,38 16.557,39 4.575,40 6.315,41 2.555,42 0.099,43 10.371,44 7.153,45 3.947,46 0.96,47 0.57,48 1.463,49 8.731,50 2.664,51 7.098,52 99.835,53 7.049,54 0.333,55 4.029,56 4.14,57 3.57,58 3.566,59 5.014,60 3.544,61 4.646,62 4.812,63 3.987,64 4.038,65 5.584,66 3.994,67 4.95,68 5.148,69 4.12,70 4.271,71 5.802,72 4.191,73 5.135,74 5.354,75 4.093,76 4.325,77 6.027,78 4.211,79 5.123,80 5.378,81 3.95,82 4.238,83 5.904,84 4.106,85 5.029,86 5.279,87 3.853,88 4.112,89 5.894,90 3.987,91 4.866,92 5.121,93 3.682,94 3.958,95 5.752,96 3.821,97 4.682,98 4.949,99 3.454,100 3.721,101 5.572,102 3.593,103 0.016,104 0.716,105 11.217,106 4.963,107 8.396,108 6.503,109 0.288,110 1.25,111 22.635,112 8.634,113 29.132,114 11.659,115 0.235,116 1.664,117 31.035,118 12.078,119 29.405,120 16.626,121 0.631,122 1.884,123 39.045,124 13.948,125 5.917}
{0 CHEMBL124444,1 10.184,2 9.319,3 4.466,4 9.651,5 8.457,6 4.014,7 7.75,8 4.109,9 3.288,10 6.317,11 1.272,12 6.314,13 6.338,14 4.424,15 4.424,16 16.562,17 18.069,18 19.493,19 20.981,20 22.432,21 7.424,22 4.424,23 0.081,24 5,25 4.663,26 11.048,27 12.461,28 10.176,29 5.89,30 2.62,31 2.62,32 11.914,33 7.424,34 10.686,35 12.424,36 14.191,37 8.587,38 15.977,39 4.304,40 6.072,41 1.699,42 0.121,43 9.872,44 6.582,45 3.871,46 0.914,47 0.563,48 1.469,49 14.467,50 4.027,51 16.218,52 118.794,53 6.908,54 0.485,55 4.165,56 4.287,57 3.675,58 3.668,59 5.179,60 3.643,61 4.732,62 4.921,63 3.995,64 4.048,65 5.69,66 4.001,67 4.982,68 5.211,69 4.036,70 4.187,71 5.904,72 4.095,73 5.031,74 5.269,75 3.924,76 4.181,77 5.886,78 4.061,79 5.051,80 5.317,81 3.802,82 4.128,83 5.864,84 3.985,85 4.99,86 5.258,87 3.68,88 4.037,89 5.82,90 3.879,91 4.893,92 5.193,93 3.478,94 3.896,95 5.624,96 3.715,97 4.714,98 5.003,99 3.433,100 3.778,101 5.444,102 3.622,103 0.026,104 0.843,105 13.359,106 5.518,107 8.024,108 7.52,109 0.271,110 1.368,111 25.43,112 8.678,113 25.357,114 12.354,115 0.538,116 1.636,117 33.726,118 11.558,119 45.112,120 16.607,121 0.328,122 1.655,123 35.43,124 12.513,125 7.268}
{0 CHEMBL125916,1 10.184,2 9.319,3 4.466,4 9.651,5 8.457,6 4.042,7 7.75,8 4.16,9 3.288,10 6.317,11 1.272,12 6.314,13 6.338,14 4.424,15 4.424,16 16.562,17 18.069,18 19.493,19 20.981,20 22.432,21 7.424,22 4.424,23 0.081,24 5,25 4.663,26 11.048,27 12.461,28 10.176,29 5.89,30 2.62,31 2.62,32 11.914,33 7.424,34 10.686,35 12.424,36 14.191,37 8.587,38 15.977,39 4.304,40 6.072,41 2.06,42 0.121,43 9.872,44 6.582,45 3.871,46 0.906,47 0.552,48 1.453,49 14.467,50 4.017,51 16.137,52 121.039,53 6.776,54 0.485,55 4.176,56 4.31,57 3.669,58 3.683,59 5.174,60 3.651,61 4.743,62 4.94,63 3.986,64 4.073,65 5.676,66 4.013,67 5.001,68 5.24,69 4.029,70 4.219,71 5.881,72 4.115,73 5.064,74 5.313,75 3.924,76 4.211,77 5.91,78 4.081,79 5.076,80 5.351,81 3.802,82 4.153,83 5.87,84 4,85 5.011,86 5.288,87 3.678,88 4.057,89 5.823,90 3.89,91 4.91,92 5.217,93 3.475,94 3.916,95 5.624,96 3.727,97 4.733,98 5.032,99 3.429,100 3.798,101 5.441,102 3.634,103 0.049,104 0.886,105 13.863,106 5.416,107 8.606,108 7.715,109 0.279,110 1.43,111 25.905,112 8.626,113 24.57,114 12.811,115 0.445,116 1.717,117 34.207,118 11.673,119 37.009,120 17.277,121 0.336,122 1.731,123 36.666,124 12.616,125 7.119}
{0 CHEMBL126889,1 10.259,2 9.387,3 4.575,4 9.756,5 8.525,6 4.048,7 7.915,8 4.159,9 3.362,10 6.5,11 1.614,12 6.435,13 6.353,14 4.453,15 4.453,16 16.673,17 18.177,18 19.608,19 21.097,20 22.553,21 7.453,22 4.453,23 0.077,24 5,25 4.89,26 11.125,27 12.541,28 10.257,29 5.976,30 2.904,31 2.904,32 11.999,33 7.506,34 10.779,35 12.508,36 14.263,37 8.696,38 16.037,39 4.344,40 6.224,41 1.852,42 0.12,43 9.953,44 6.728,45 3.925,46 1.078,47 0.6,48 1.649,49 15.645,50 6.027,51 36.321,52 128.991,53 8.569,54 0.471,55 4.12,56 4.241,57 3.806,58 3.705,59 5.146,60 3.664,61 4.687,62 4.865,63 4.208,64 4.124,65 5.698,66 4.054,67 4.983,68 5.206,69 4.271,70 4.276,71 5.945,72 4.155,73 5.012,74 5.25,75 4.242,76 4.24,77 5.944,78 4.09,79 4.974,80 5.239,81 3.998,82 4.123,83 5.842,84 3.956,85 4.872,86 5.134,87 3.864,88 3.992,89 5.759,90 3.833,91 4.739,92 5.001,93 3.822,94 3.878,95 5.671,96 3.719,97 4.613,98 4.863,99 3.658,100 3.819,101 5.467,102 3.652,103 0.043,104 0.806,105 9.758,106 4.837,107 5.294,108 6.426,109 0.236,110 1.331,111 21.569,112 8.439,113 20.466,114 11.368,115 0.523,116 1.604,117 39.625,118 12.499,119 44.488,120 16.688,121 0.477,122 1.576,123 44.399,124 13.577,125 5}
{0 CHEMBL127400,1 10.175,2 9.317,3 4.489,4 9.648,5 8.462,6 4.015,7 7.716,8 4.104,9 3.288,10 6.954,11 1.32,12 6.462,13 6.25,14 4.352,15 4.352,16 16.431,17 17.934,18 19.325,19 20.802,20 22.225,21 7.352,22 4.352,23 0.081,24 5,25 4.663,26 11.033,27 12.443,28 10.226,29 5.97,30 2.62,31 2.62,32 11.892,33 7.424,34 10.691,35 12.425,36 14.187,37 8.553,38 15.97,39 4.304,40 6.141,41 2.083,42 0.123,43 9.843,44 6.692,45 3.967,46 0.951,47 0.555,48 1.45,49 15.129,50 3.619,51 13.094,52 123.997,53 6.862,54 0.5,55 4.189,56 4.319,57 3.694,58 3.711,59 5.205,60 3.678,61 4.752,62 4.948,63 4.002,64 4.094,65 5.699,66 4.034,67 5.013,68 5.248,69 4.079,70 4.259,71 5.924,72 4.16,73 5.074,74 5.318,75 3.967,76 4.246,77 5.938,78 4.116,79 5.104,80 5.378,81 3.854,82 4.182,83 5.926,84 4.037,85 5.01,86 5.284,87 3.702,88 4.075,89 5.822,90 3.91,91 4.921,92 5.223,93 3.55,94 3.934,95 5.693,96 3.76,97 4.747,98 5.04,99 3.467,100 3.823,101 5.496,102 3.667,103 0.04,104 0.892,105 13.734,106 5.581,107 8.822,108 7.809,109 0.285,110 1.445,111 25.877,112 8.772,113 25.38,114 12.819,115 0.436,116 1.764,117 34.355,118 12.075,119 40.773,120 17.606,121 0.302,122 1.784,123 36.714,124 13.087,125 7.119}
{0 CHEMBL134,1 9.304,2 8.453,3 3.332,4 8.756,5 7.612,6 3.859,7 6.924,8 3.971,9 2.995,10 4.961,11 0.728,12 4.732,13 5.325,14 3.997,15 3.997,16 15.257,17 16.707,18 18.024,19 19.444,20 20.792,21 6.997,22 3.997,23 0.081,24 2,25 3.98,26 10.147,27 11.556,28 9.342,29 4.797,30 2.048,31 2.048,32 10.997,33 6.605,34 9.894,35 11.629,36 13.393,37 7.816,38 15.176,39 3.434,40 4.758,42 0.128,43 9.054,44 4.904,45 3.232,46 0.253,47 0.655,48 1.749,49 5.714,50 3.021,51 9.127,52 59.089,53 10.005,54 0.4,55 3.268,56 3.388,57 3.077,58 2.855,59 4.381,60 2.832,61 3.763,62 3.928,63 3.47,64 3.227,65 4.896,66 3.167,67 3.94,68 4.158,69 3.53,70 3.227,71 5.039,72 3.123,73 3.686,74 3.867,75 3.516,76 3.07,77 4.884,78 2.948,79 3.52,80 3.715,81 3.252,82 2.838,83 4.733,84 2.766,85 3.414,86 3.582,87 3.043,88 2.858,89 4.476,90 2.723,91 3.358,92 3.58,93 1.839,94 2.525,95 4.268,96 2.226,97 2.683,98 3.062,99 0.45,100 1.524,101 3.045,102 1.165,103 0.065,104 0.347,105 2.612,106 1.691,107 4.191,108 2.05,109 0.175,110 0.525,111 6.094,112 3.065,113 11.216,114 3.814,115 0.308,116 0.503,117 14.586,118 4.039,119 21.907,120 4.921,121 0.279,122 0.365,123 17.383,124 3.414,125 6.069}
{0 CHEMBL14376,1 10.31,2 9.431,3 4.654,4 9.802,5 8.557,6 4.01,7 7.96,8 4.127,9 3.306,10 6.578,11 1.654,12 6.538,13 6.222,14 4.515,15 4.515,16 16.812,17 18.325,18 19.776,19 21.277,20 22.751,21 7.515,22 4.515,23 0.076,24 5,25 4.89,26 11.186,27 12.603,28 10.297,29 6.004,30 3.196,31 3.196,32 12.067,33 7.612,34 10.838,35 12.588,36 14.364,37 8.773,38 16.159,39 4.382,40 6.268,41 1.43,42 0.117,43 10.033,44 6.718,45 3.844,46 1.026,47 0.6,48 1.575,49 14.839,50 4.017,51 16.133,52 116.645,53 7.354,54 0.471,55 4.159,56 4.265,57 3.715,58 3.666,59 5.252,60 3.654,61 4.73,62 4.901,63 4.059,64 4.053,65 5.764,66 4.026,67 4.981,68 5.182,69 4.124,70 4.192,71 6.015,72 4.135,73 5.054,74 5.274,75 4.046,76 4.192,77 6.044,78 4.102,79 5.054,80 5.298,81 3.913,82 4.129,83 5.979,84 4.011,85 4.967,86 5.214,87 3.749,88 4.026,89 5.823,90 3.889,91 4.868,92 5.132,93 3.63,94 3.896,95 5.728,96 3.766,97 4.734,98 4.992,99 3.606,100 3.807,101 5.658,102 3.702,103 0.092,104 0.859,105 12.144,106 5.813,107 9.392,108 7.22,109 0.295,110 1.395,111 24.257,112 9.351,113 27.854,114 12.08,115 0.58,116 1.711,117 33.021,118 11.888,119 59.069,120 15.586,121 0.7,122 1.733,123 36.284,124 12.576,125 9.398}
{0 CHEMBL1729,1 10.188,2 9.328,3 4.431,4 9.377,5 8.474,6 3.892,7 7.573,8 4.017,9 3.186,10 5.615,11 2.16,12 5.499,13 6.176,14 4.119,15 4.119,16 15.821,17 17.279,18 18.595,19 20.027,20 21.381,21 7.119,22 4.119,23 0.082,24 3,25 4.718,26 11.046,27 12.457,28 10.235,29 5.624,30 2.9,31 2.9,32 11.907,33 7.496,34 10.764,35 12.493,36 14.245,37 8.655,38 16.015,39 4.263,40 5.585,42 0.122,43 9.899,44 5.432,45 3.955,46 1.122,47 0.609,48 1.707,49 14.688,50 2.786,51 7.761,52 122.437,53 7.639,54 0.353,55 4.201,56 4.317,57 3.769,58 3.666,59 5.31,60 3.657,61 4.764,62 4.938,63 4.118,64 4.04,65 5.833,66 4.012,67 5.024,68 5.222,69 4.255,70 4.208,71 6.103,72 4.152,73 5.134,74 5.36,75 4.156,76 4.225,77 6.164,78 4.127,79 5.143,80 5.389,81 4.157,82 4.187,83 6.191,84 4.082,85 5.095,86 5.338,87 4.014,88 4.156,89 6.089,90 4.038,91 5.078,92 5.325,93 4.007,94 4.124,95 6.018,96 4.009,97 4.963,98 5.187,99 4.024,100 4.096,101 5.938,102 3.985,103 0.111,104 0.898,105 12.736,106 5.7,107 14.008,108 7.283,109 0.496,110 1.379,111 26.325,112 9.181,113 40.792,114 12.009,115 0.744,116 1.687,117 37.154,118 11.809,119 70.154,120 15.747,121 0.986,122 1.698,123 44.093,124 13.387,125 7.523}
{0 CHEMBL2,1 10.339,2 9.445,3 4.745,4 9.804,5 8.555,6 3.985,7 7.98,8 4.113,9 3.306,10 7.512,11 2.031,12 6.792,13 6.395,14 4.54,15 4.54,16 16.813,17 18.326,18 19.785,19 21.29,20 22.773,21 7.54,22 4.54,23 0.07,24 5,25 4.89,26 11.232,27 12.653,28 10.327,29 6.047,30 3.102,31 3.102,32 12.128,33 7.667,34 10.879,35 12.648,36 14.44,37 8.836,38 16.247,39 4.382,40 6.44,41 1.377,42 0.114,43 10.082,44 7.146,45 4.072,46 0.858,47 0.632,48 1.685,49 11.607,50 2.108,51 4.442,52 104,53 7.826,54 0.516,55 4.028,56 4.139,57 3.636,58 3.458,59 5.186,60 3.489,61 4.566,62 4.738,63 3.996,64 3.83,65 5.677,66 3.851,67 4.727,68 4.902,69 4.09,70 3.977,71 5.869,72 3.972,73 4.831,74 5.018,75 4.066,76 3.995,77 6.002,78 3.977,79 4.89,80 5.106,81 3.938,82 3.972,83 5.966,84 3.923,85 4.772,86 4.987,87 3.785,88 3.938,89 5.758,90 3.84,91 4.787,92 5.066,93 3.612,94 3.794,95 5.741,96 3.669,97 4.551,98 4.826,99 3.491,100 3.527,101 5.488,102 3.46,103 0.12,104 0.748,105 9.553,106 3.968,107 10.433,108 5.073,109 0.542,110 1.15,111 19.934,112 6.344,113 30.037,114 8.279,115 0.658,116 1.346,117 23.145,118 7.489,119 40.31,120 10.295,121 0.6,122 1.427,123 26.205,124 8.186,125 5.778}
{0 CHEMBL209324,1 10.08,2 9.218,3 4.263,4 9.817,5 8.372,6 3.981,7 8.054,8 4.071,9 3.288,10 5.396,11 1.107,12 5.525,13 6.498,14 4.697,15 4.697,16 17.139,17 18.682,18 20.193,19 21.732,20 23.26,21 7.697,22 4.697,23 0.083,24 3,25 4.934,26 10.928,27 12.342,28 10.157,29 5.509,30 2.62,31 2.62,32 11.791,33 7.811,34 10.834,35 12.656,36 14.517,37 8.972,38 16.405,39 4.127,40 5.526,42 0.126,43 10.249,44 5.317,45 3.835,46 1.061,47 0.556,48 1.554,49 14.241,50 3.816,51 14.561,52 118.694,53 6.96,54 0.387,55 4.164,56 4.285,57 3.814,58 3.692,59 5.102,60 3.628,61 4.752,62 4.947,63 4.059,64 4.068,65 5.846,66 3.982,67 4.999,68 5.224,69 4.112,70 4.245,71 5.927,72 4.115,73 5.109,74 5.35,75 4,76 4.24,77 6.044,78 4.087,79 5.115,80 5.386,81 3.868,82 4.175,83 5.957,84 4.005,85 5.004,86 5.271,87 3.718,88 4.081,89 5.807,90 3.887,91 4.958,92 5.26,93 3.571,94 3.929,95 5.777,96 3.726,97 4.721,98 5.01,99 3.554,100 3.814,101 5.456,102 3.623,103 0.092,104 0.883,105 17.336,106 6.033,107 14.941,108 8.048,109 0.447,110 1.403,111 29.053,112 9.555,113 59.714,114 13.186,115 0.377,116 1.713,117 39.222,118 13.192,119 43.279,120 17.705,121 0.407,122 1.761,123 43.38,124 14.329,125 7.921}
{0 CHEMBL214986,1 9.906,2 9.053,3 4.127,4 9.21,5 8.203,6 3.856,7 7.295,8 3.977,9 3.318,10 5.553,11 1.209,12 5.433,13 6.183,14 4.018,15 4.018,16 15.702,17 17.165,18 18.466,19 19.892,20 21.225,21 7.018,22 4.018,23 0.084,24 4,25 4.311,26 10.757,27 12.166,28 9.979,29 5.455,30 2.443,31 2.443,32 11.61,33 7.182,34 10.432,35 12.169,36 13.935,37 8.299,38 15.723,39 4.06,40 5.361,42 0.126,43 9.594,44 5.463,45 3.388,46 0.839,47 0.597,48 1.494,49 11.44,50 2.847,51 8.104,52 92.889,53 7.196,54 0.444,55 3.978,56 4.074,57 3.515,58 3.415,59 5.054,60 3.423,61 4.526,62 4.68,63 3.804,64 3.733,65 5.537,66 3.736,67 4.702,68 4.874,69 3.909,70 3.833,71 5.747,72 3.813,73 4.693,74 4.878,75 3.755,76 3.817,77 5.653,78 3.759,79 4.746,80 4.956,81 3.567,82 3.807,83 5.605,84 3.706,85 4.722,86 4.963,87 3.413,88 3.726,89 5.562,90 3.581,91 4.618,92 4.904,93 3.269,94 3.589,95 5.372,96 3.429,97 4.455,98 4.738,99 3.214,100 3.459,101 5.206,102 3.335,103 0.059,104 0.627,105 10.636,106 4.688,107 8.528,108 5.792,109 0.387,110 0.951,111 20.963,112 7.048,113 27.954,114 8.856,115 0.803,116 1.086,117 25.882,118 8.381,119 44.974,120 10.911,121 0.558,122 1.091,123 25.33,124 8.57,125 6.34}
{0 CHEMBL215188,1 10.214,2 9.34,3 4.575,4 9.739,5 8.469,6 4.041,7 7.838,8 4.11,9 3.353,10 7.197,11 1.733,12 6.57,13 6.375,14 4.405,15 4.405,16 16.636,17 18.14,18 19.553,19 21.036,20 22.476,21 7.405,22 4.405,23 0.078,24 7,25 4.745,26 11.087,27 12.502,28 10.259,29 6.047,30 2.604,31 2.604,32 11.963,33 7.466,34 10.703,35 12.448,36 14.22,37 8.598,38 16.012,39 4.331,40 6.252,41 2.29,42 0.119,43 9.888,44 6.895,45 3.943,46 0.875,47 0.593,48 1.463,49 12.897,50 3.755,51 14.101,52 109.339,53 7.324,54 0.531,55 4.099,56 4.193,57 3.658,58 3.588,59 5.174,60 3.589,61 4.646,62 4.793,63 3.974,64 3.938,65 5.661,66 3.932,67 4.842,68 5.008,69 4.086,70 4.065,71 5.88,72 4.033,73 4.855,74 5.038,75 3.955,76 4.041,77 5.816,78 3.975,79 4.902,80 5.109,81 3.813,82 3.986,83 5.788,84 3.902,85 4.851,86 5.073,87 3.659,88 3.902,89 5.726,90 3.786,91 4.766,92 5.031,93 3.483,94 3.811,95 5.537,96 3.658,97 4.656,98 4.937,99 3.407,100 3.688,101 5.401,102 3.551,103 0.043,104 0.707,105 11.514,106 5.364,107 9.178,108 6.488,109 0.353,110 1.118,111 22.757,112 8.43,113 28.535,114 10.219,115 0.778,116 1.323,117 28.677,118 10.335,119 45.793,120 13.042,121 0.498,122 1.349,123 28.869,124 10.754,125 5}
{0 CHEMBL215421,1 9.906,2 9.053,3 4.127,4 9.21,5 8.203,6 3.856,7 7.295,8 3.977,9 3.318,10 5.553,11 1.209,12 5.433,13 6.183,14 4.018,15 4.018,16 15.702,17 17.165,18 18.466,19 19.892,20 21.225,21 7.018,22 4.018,23 0.084,24 4,25 4.311,26 10.757,27 12.166,28 9.979,29 5.455,30 2.443,31 2.443,32 11.61,33 7.182,34 10.432,35 12.169,36 13.935,37 8.299,38 15.723,39 4.06,40 5.361,42 0.126,43 9.594,44 5.463,45 3.388,46 0.839,47 0.597,48 1.494,49 11.44,50 2.847,51 8.104,52 92.889,53 7.196,54 0.444,55 3.978,56 4.074,57 3.515,58 3.415,59 5.054,60 3.423,61 4.526,62 4.68,63 3.804,64 3.733,65 5.537,66 3.736,67 4.702,68 4.874,69 3.909,70 3.833,71 5.747,72 3.813,73 4.693,74 4.878,75 3.755,76 3.817,77 5.653,78 3.759,79 4.746,80 4.956,81 3.567,82 3.807,83 5.605,84 3.706,85 4.722,86 4.963,87 3.413,88 3.726,89 5.562,90 3.581,91 4.618,92 4.904,93 3.269,94 3.589,95 5.372,96 3.429,97 4.455,98 4.738,99 3.214,100 3.459,101 5.206,102 3.335,103 0.059,104 0.627,105 10.636,106 4.688,107 8.528,108 5.792,109 0.387,110 0.951,111 20.963,112 7.048,113 27.954,114 8.856,115 0.803,116 1.086,117 25.882,118 8.381,119 44.974,120 10.911,121 0.558,122 1.091,123 25.33,124 8.57,125 6.92}
{0 CHEMBL217469,1 10.129,2 9.258,3 4.466,4 9.689,5 8.39,6 4.036,7 7.753,8 4.101,9 3.318,10 6.969,11 1.382,12 6.445,13 6.183,14 4.5,15 4.5,16 16.69,17 18.218,18 19.662,19 21.17,20 22.642,21 7.5,22 4.5,23 0.079,24 6,25 4.62,26 10.999,27 12.413,28 10.183,29 5.989,30 2.563,31 2.563,32 11.872,33 7.38,34 10.614,35 12.365,36 14.147,37 8.506,38 15.951,39 4.263,40 6.152,41 2.185,42 0.119,43 9.813,44 6.714,45 3.773,46 0.91,47 0.585,48 1.441,49 12.111,50 3.772,51 14.224,52 102.876,53 7.309,54 0.567,55 4.021,56 4.117,57 3.582,58 3.541,59 5.083,60 3.533,61 4.564,62 4.708,63 3.899,64 3.897,65 5.572,66 3.878,67 4.79,68 4.969,69 3.992,70 4.007,71 5.795,72 3.963,73 4.768,74 4.958,75 3.835,76 3.956,77 5.7,78 3.885,79 4.777,80 4.987,81 3.671,82 3.912,83 5.635,84 3.808,85 4.743,86 4.981,87 3.531,88 3.837,89 5.576,90 3.694,91 4.674,92 4.946,93 3.39,94 3.725,95 5.457,96 3.568,97 4.512,98 4.783,99 3.304,100 3.604,101 5.269,102 3.465,103 0.021,104 0.654,105 10.576,106 4.953,107 8.17,108 6.046,109 0.238,110 1.054,111 20.52,112 7.933,113 23.983,114 9.665,115 0.625,116 1.267,117 27.358,118 9.924,119 41.972,120 12.607,121 0.365,122 1.246,123 26.599,124 9.898,125 5.87}
{0 CHEMBL2333732,1 10.064,2 9.201,3 4.431,4 9.381,5 8.345,6 3.92,7 7.459,8 4.089,9 3.088,10 6.674,11 0.957,12 6.117,13 6.148,14 3.976,15 3.976,16 15.63,17 17.086,18 18.334,19 19.748,20 21.041,21 6.976,22 3.976,23 0.078,24 4,25 4.543,26 10.922,27 12.334,28 10.063,29 5.716,30 2.899,31 2.899,32 11.786,33 7.248,34 10.541,35 12.241,36 13.964,37 8.401,38 15.705,39 4.174,40 5.867,42 0.119,43 9.662,44 6.385,45 3.889,46 0.943,47 0.586,48 1.583,49 12.923,50 4.157,51 17.276,52 106.01,53 7.849,54 0.586,55 3.96,56 4.082,57 3.582,58 3.511,59 5.029,60 3.486,61 4.492,62 4.671,63 3.943,64 3.907,65 5.504,66 3.863,67 4.755,68 4.97,69 3.926,70 4.048,71 5.695,72 3.946,73 4.822,74 5.08,75 3.747,76 4.02,77 5.646,78 3.874,79 4.746,80 5.014,81 3.678,82 3.941,83 5.523,84 3.788,85 4.667,86 4.941,87 3.627,88 3.789,89 5.487,90 3.648,91 4.478,92 4.744,93 3.495,94 3.597,95 5.377,96 3.48,97 4.259,98 4.477,99 3.356,100 3.55,101 5.194,102 3.429,103 0.045,104 0.707,105 9.267,106 4.096,107 8.42,108 5.414,109 0.13,110 1.159,111 18.04,112 6.404,113 16.203,114 8.846,115 0.268,116 1.383,117 27.387,118 9.218,119 31.184,120 12.642,121 0.325,122 1.414,123 30.857,124 10.535,125 5.19}
{0 CHEMBL25236,1 10.175,2 9.317,3 4.489,4 9.648,5 8.462,6 4.045,7 7.716,8 4.113,9 3.288,10 6.954,11 1.32,12 6.462,13 6.25,14 4.352,15 4.352,16 16.431,17 17.934,18 19.325,19 20.802,20 22.225,21 7.352,22 4.352,23 0.081,24 5,25 4.663,26 11.033,27 12.443,28 10.226,29 5.97,30 2.62,31 2.62,32 11.892,33 7.424,34 10.691,35 12.425,36 14.187,37 8.553,38 15.97,39 4.304,40 6.141,41 2.257,42 0.123,43 9.843,44 6.692,45 3.967,46 0.942,47 0.544,48 1.397,49 15.129,50 4.341,51 18.841,52 126.526,53 6.735,54 0.5,55 4.199,56 4.327,57 3.688,58 3.738,59 5.196,60 3.697,61 4.762,62 4.956,63 3.995,64 4.127,65 5.69,66 4.057,67 5.032,68 5.266,69 4.07,70 4.295,71 5.903,72 4.187,73 5.101,74 5.344,75 3.964,76 4.284,77 5.955,78 4.146,79 5.126,80 5.398,81 3.851,82 4.223,83 5.926,84 4.066,85 5.042,86 5.319,87 3.702,88 4.111,89 5.831,90 3.935,91 4.944,92 5.247,93 3.547,94 3.963,95 5.697,96 3.779,97 4.766,98 5.059,99 3.463,100 3.849,101 5.494,102 3.685,103 0.052,104 0.878,105 14.15,106 5.879,107 8.789,108 8.171,109 0.282,110 1.446,111 26.33,112 9.372,113 24.639,114 13.499,115 0.355,116 1.791,117 34.952,118 12.821,119 33.633,120 18.489,121 0.315,122 1.829,123 37.731,124 13.942,125 7.081}
{0 CHEMBL25554,1 9.906,2 9.053,3 4.127,4 9.21,5 8.203,6 3.856,7 7.295,8 3.977,9 3.318,10 5.553,11 1.209,12 5.433,13 6.183,14 4.018,15 4.018,16 15.702,17 17.165,18 18.466,19 19.892,20 21.225,21 7.018,22 4.018,23 0.084,24 4,25 4.311,26 10.757,27 12.166,28 9.979,29 5.455,30 2.443,31 2.443,32 11.61,33 7.182,34 10.432,35 12.169,36 13.935,37 8.299,38 15.723,39 4.06,40 5.361,42 0.126,43 9.594,44 5.463,45 3.388,46 0.839,47 0.597,48 1.494,49 11.44,50 2.847,51 8.104,52 92.889,53 7.196,54 0.444,55 3.978,56 4.074,57 3.515,58 3.415,59 5.054,60 3.423,61 4.526,62 4.68,63 3.804,64 3.733,65 5.537,66 3.736,67 4.702,68 4.874,69 3.909,70 3.833,71 5.747,72 3.813,73 4.693,74 4.878,75 3.755,76 3.817,77 5.653,78 3.759,79 4.746,80 4.956,81 3.567,82 3.807,83 5.605,84 3.706,85 4.722,86 4.963,87 3.413,88 3.726,89 5.562,90 3.581,91 4.618,92 4.904,93 3.269,94 3.589,95 5.372,96 3.429,97 4.455,98 4.738,99 3.214,100 3.459,101 5.206,102 3.335,103 0.059,104 0.627,105 10.636,106 4.688,107 8.528,108 5.792,109 0.387,110 0.951,111 20.963,112 7.048,113 27.954,114 8.856,115 0.803,116 1.086,117 25.882,118 8.381,119 44.974,120 10.911,121 0.558,122 1.091,123 25.33,124 8.57,125 6.59}
{0 CHEMBL25856,1 10.231,2 9.308,3 4.718,4 9.357,5 8.387,6 4.027,7 7.515,8 4.119,9 3.083,10 7.034,11 1.636,12 6.316,13 6.196,14 4.139,15 4.139,16 15.971,17 17.433,18 18.772,19 20.207,20 21.576,21 7.139,22 4.139,23 0.066,24 10,25 4.543,26 11.154,27 12.584,28 10.233,29 5.773,30 2.498,31 2.498,32 12.078,33 7.548,34 10.707,35 12.507,36 14.332,37 8.705,38 16.178,39 4.248,40 5.981,42 0.102,43 9.989,44 6.699,45 3.773,46 1.141,47 0.568,48 1.399,49 7,50 2.819,51 7.945,52 78.151,53 7.226,54 0.522,55 3.732,56 3.837,57 3.277,58 3.335,59 4.804,60 3.304,61 4.276,62 4.421,63 3.683,64 3.799,65 5.27,66 3.74,67 4.637,68 4.828,69 3.816,70 4.003,71 5.666,72 3.91,73 4.725,74 4.949,75 3.68,76 3.992,77 5.597,78 3.862,79 4.683,80 4.936,81 3.556,82 3.868,83 5.538,84 3.73,85 4.492,86 4.734,87 3.324,88 3.61,89 5.498,90 3.478,91 4.227,92 4.487,93 2.92,94 3.218,95 5.282,96 3.07,97 3.789,98 4.071,99 2.249,100 2.574,101 4.874,102 2.42,103 0.053,104 0.495,105 7.982,106 3.658,107 9.689,108 4.607,109 0.052,110 0.864,111 14.196,112 6.446,113 10.639,114 8.505,115 0.231,116 1.192,117 22.053,118 9.245,119 42.041,120 12.46,121 0.176,122 1.283,123 24.944,124 10.184,125 5.523}
{0 CHEMBL26828,1 9.087,2 8.237,3 3.219,4 8.532,5 7.394,6 3.93,7 6.648,8 4.018,9 2.63,10 4.514,11 0.556,12 4.538,13 4.961,14 3.905,15 3.905,16 14.953,17 16.409,18 17.69,19 19.107,20 20.422,21 6.905,22 3.905,23 0.084,24 3,25 3.726,26 9.931,27 11.34,28 9.226,29 4.787,30 1.472,31 1.472,32 10.781,33 6.293,34 9.595,35 11.303,36 13.038,37 7.452,38 14.793,39 3.258,40 4.667,42 0.124,43 8.742,44 4.547,45 2.923,47 0.517,48 1.452,49 4.636,50 2.021,51 4.083,52 55.023,53 12.338,54 0.5,55 3.131,56 3.256,57 3.168,58 2.888,59 4.041,60 2.752,61 3.675,62 3.858,63 3.643,64 3.325,65 4.528,66 3.131,67 3.912,68 4.142,69 3.651,70 3.452,71 4.667,72 3.172,73 3.8,74 4.066,75 3.454,76 3.212,77 4.477,78 2.87,79 3.497,80 3.814,81 3.372,82 2.839,83 4.114,84 2.395,85 2.708,86 3.029,87 2.683,88 2.293,89 3.234,90 1.669,91 1.333,92 1.548,93 1.024,94 1.241,95 1.831,96 0.643,103 0.025,104 0.281,105 0.638,106 1.821,107 2.605,108 2.624,109 0.057,110 0.495,111 4.144,112 3.738,113 6.005,114 4.804,115 0.06,116 0.615,117 27.419,118 7.012,119 8.09,120 7.287,121 0.053,122 0.538,123 20.091,124 6.171,125 6.658}
{0 CHEMBL284213,1 9.63,2 8.742,3 3.85,4 8.853,5 7.857,6 3.97,7 6.995,8 4.072,9 2.711,10 5.66,11 0.323,12 5.457,13 5.766,14 3.964,15 3.964,16 15.335,17 16.733,18 18.059,19 19.437,20 20.784,21 6.642,22 3.964,23 0.073,24 4,25 3.861,26 10.517,27 11.935,28 9.559,29 4.845,30 1.816,31 1.816,32 11.405,33 6.917,34 10.112,35 11.893,36 13.705,37 8.103,38 15.538,39 3.761,40 5.153,42 0.114,43 9.378,44 5.668,45 3.065,47 0.556,48 1.505,49 5,50 2.264,51 5.127,52 59.523,53 7.858,54 0.625,55 3.376,56 3.492,57 3.092,58 3.055,59 4.337,60 2.971,61 3.928,62 4.091,63 3.44,64 3.496,65 4.796,66 3.369,67 4.142,68 4.373,69 3.265,70 3.524,71 4.844,72 3.339,73 4.088,74 4.307,75 3.241,76 3.465,77 4.884,78 3.285,79 4.021,80 4.284,81 3.029,82 3.23,83 4.825,84 3.031,85 3.687,86 3.989,87 2.58,88 2.785,89 4.409,90 2.542,91 3.039,92 3.384,93 0.874,94 1.937,95 3.531,96 1.546,97 1.844,98 2.277,99 0.042,100 0.626,101 1.946,102 0.348,103 0.025,104 0.392,105 5.757,106 2.56,107 4.717,108 3.298,109 0.086,110 0.674,111 11.817,112 4.88,113 8.358,114 6.169,115 0.089,116 0.779,117 17.352,118 6.71,119 9.175,120 8.431,121 0.084,122 0.756,123 16.244,124 6.168,125 7.569}
{0 CHEMBL284795,1 9.914,2 9,3 4.094,4 9.336,5 8.093,6 4.017,7 7.534,8 4.086,9 2.752,10 6.257,11 0.608,12 5.949,13 6.059,14 4.352,15 4.352,16 16.303,17 17.774,18 19.211,19 20.675,20 22.127,21 7.057,22 4.352,23 0.069,24 4,25 4.388,26 10.824,27 12.251,28 9.81,29 5.357,30 2.433,31 2.433,32 11.738,33 7.29,34 10.439,35 12.25,36 14.089,37 8.503,38 15.949,39 3.97,40 5.631,42 0.109,43 9.772,44 6.207,45 3.413,46 0.498,47 0.549,48 1.46,49 5.625,50 2.646,51 7.001,52 70.255,53 7.679,54 0.556,55 3.5,56 3.618,57 3.186,58 3.177,59 4.495,60 3.092,61 4.032,62 4.212,63 3.597,64 3.61,65 4.934,66 3.489,67 4.153,68 4.333,69 3.48,70 3.682,71 4.983,72 3.52,73 4.184,74 4.357,75 3.512,76 3.691,77 5.044,78 3.53,79 4.255,80 4.473,81 3.305,82 3.574,83 5.091,84 3.383,85 4.274,86 4.594,87 2.94,88 3.303,89 4.961,90 3.051,91 3.785,92 4.133,93 1.756,94 2.646,95 4.401,96 2.32,97 3.021,98 3.423,99 0.592,100 1.705,101 3.45,102 1.34,103 0.03,104 0.435,105 6.682,106 2.942,107 5.65,108 3.844,109 0.097,110 0.735,111 13.268,112 5.47,113 9.928,114 7.022,115 0.083,116 0.819,117 19.13,118 7.294,119 9.674,120 8.629,121 0.063,122 0.835,123 15.981,124 6.727,125 7.602}
{0 CHEMBL286246,1 9.63,2 8.742,3 3.85,4 9.04,5 7.857,6 3.982,7 7.167,8 4.066,9 2.6,10 5.908,11 0.323,12 5.719,13 5.766,14 4.114,15 4.114,16 15.699,17 17.129,18 18.498,19 19.911,20 21.3,21 6.806,22 4.114,23 0.073,24 4,25 3.98,26 10.517,27 11.935,28 9.559,29 5.098,30 1.829,31 1.829,32 11.405,33 6.917,34 10.112,35 11.893,36 13.705,37 8.103,38 15.538,39 3.761,40 5.435,42 0.114,43 9.378,44 5.951,45 3.268,47 0.578,48 1.532,49 5,50 2.225,51 4.95,52 60.399,53 8.429,54 0.625,55 3.309,56 3.415,57 3.085,58 3.018,59 4.348,60 2.943,61 3.811,62 3.957,63 3.426,64 3.432,65 4.784,66 3.321,67 3.945,68 4.15,69 3.237,70 3.416,71 4.77,72 3.253,73 3.817,74 3.989,75 3.202,76 3.322,77 4.741,78 3.178,79 3.819,80 4.047,81 3.002,82 3.119,83 4.707,84 2.955,85 3.618,86 3.905,87 2.579,88 2.758,89 4.372,90 2.525,91 3.039,92 3.384,93 0.874,94 1.937,95 3.531,96 1.546,97 1.844,98 2.277,99 0.042,100 0.626,101 1.946,102 0.348,103 0.019,104 0.35,105 4.562,106 2.167,107 4.205,108 2.673,109 0.076,110 0.592,111 9.513,112 4.048,113 7.799,114 4.882,115 0.066,116 0.648,117 14.085,118 5.535,119 8.521,120 6.653,121 0.042,122 0.577,123 10.671,124 4.446,125 6.595}
{0 CHEMBL286269,1 9.63,2 8.742,3 3.85,4 8.853,5 7.857,6 3.97,7 6.995,8 4.069,9 2.711,10 5.66,11 0.323,12 5.457,13 5.766,14 3.964,15 3.964,16 15.335,17 16.733,18 18.059,19 19.437,20 20.784,21 6.642,22 3.964,23 0.073,24 4,25 3.861,26 10.517,27 11.935,28 9.559,29 4.845,30 1.816,31 1.816,32 11.405,33 6.917,34 10.112,35 11.893,36 13.705,37 8.103,38 15.538,39 3.761,40 5.153,42 0.114,43 9.378,44 5.668,45 3.065,47 0.556,48 1.505,49 5,50 2.686,51 7.212,52 59.575,53 7.858,54 0.625,55 3.376,56 3.492,57 3.092,58 3.055,59 4.337,60 2.971,61 3.928,62 4.091,63 3.44,64 3.496,65 4.796,66 3.369,67 4.142,68 4.373,69 3.321,70 3.536,71 4.844,72 3.344,73 4.09,74 4.308,75 3.317,76 3.478,77 4.873,78 3.285,79 3.986,80 4.24,81 3.03,82 3.224,83 4.789,84 3.021,85 3.662,86 3.964,87 2.274,88 2.724,89 4.41,90 2.514,91 3.086,92 3.433,93 0.829,94 1.934,95 3.638,96 1.607,97 2.091,98 2.539,99 0.055,100 0.77,101 2.197,102 0.441,103 0.025,104 0.392,105 5.757,106 2.56,107 4.717,108 3.298,109 0.086,110 0.674,111 11.817,112 4.88,113 8.341,114 6.169,115 0.086,116 0.781,117 16.977,118 6.684,119 9.189,120 8.425,121 0.103,122 0.776,123 18.18,124 6.45,125 9.456}
{0 CHEMBL287837,1 9.328,2 8.458,3 3.401,4 8.824,5 7.589,6 3.932,7 7.026,8 4.019,9 2.804,10 4.676,11 0.707,12 4.767,13 5.543,14 4.14,15 4.14,16 15.618,17 17.085,18 18.463,19 19.908,20 21.307,21 7.14,22 4.14,23 0.079,24 3,25 4.007,26 10.198,27 11.611,28 9.455,29 4.896,30 1.487,31 1.487,32 11.068,33 6.735,34 9.965,35 11.745,36 13.55,37 7.928,38 15.373,39 3.401,40 4.87,42 0.119,43 9.19,44 4.694,45 3.08,47 0.613,48 1.58,49 4.667,50 2.771,51 7.68,52 52.225,53 9.623,54 0.462,55 3.156,56 3.262,57 2.945,58 2.834,59 4.158,60 2.773,61 3.704,62 3.865,63 3.358,64 3.255,65 4.681,66 3.16,67 3.959,68 4.154,69 3.666,70 3.409,71 4.966,72 3.258,73 3.858,74 4.072,75 3.241,76 3.169,77 4.808,78 2.969,79 3.572,80 3.83,81 2.72,82 2.705,83 4.495,84 2.446,85 2.808,86 3.072,87 1.719,88 1.902,89 3.703,90 1.582,91 1.452,92 1.656,93 0.408,94 0.736,95 2.325,96 0.497,103 0.021,104 0.273,105 2.757,106 1.72,107 2.086,108 2.32,109 0.072,110 0.457,111 6.914,112 3.253,113 5.74,114 4.305,115 0.167,116 0.53,117 16.989,118 5.02,119 16.087,120 6.488,121 0.165,122 0.439,123 16.359,124 4.804,125 7.678}
{0 CHEMBL288536,1 10.224,2 9.298,3 4.691,4 9.341,5 8.373,6 4.027,7 7.555,8 4.106,9 3.087,10 6.87,11 1.443,12 6.244,13 6.2,14 4.146,15 4.146,16 16.02,17 17.46,18 18.821,19 20.243,20 21.626,21 7.146,22 4.146,23 0.064,24 10,25 4.543,26 11.15,27 12.581,28 10.187,29 5.621,30 2.473,31 2.473,32 12.078,33 7.548,34 10.702,35 12.504,36 14.331,37 8.724,38 16.178,39 4.234,40 5.915,42 0.101,43 9.996,44 6.604,45 3.777,46 1.048,47 0.588,48 1.581,49 6.421,50 2.629,51 6.911,52 76.882,53 8.041,54 0.5,55 3.664,56 3.757,57 3.356,58 3.318,59 4.731,60 3.26,61 4.211,62 4.344,63 3.774,64 3.791,65 5.203,66 3.705,67 4.545,68 4.724,69 3.856,70 3.951,71 5.584,72 3.831,73 4.625,74 4.833,75 3.794,76 3.954,77 5.511,78 3.793,79 4.535,80 4.773,81 3.601,82 3.791,83 5.399,84 3.613,85 4.288,86 4.5,87 3.344,88 3.457,89 5.349,90 3.308,91 3.978,92 4.226,93 2.843,94 2.942,95 5.085,96 2.794,97 3.451,98 3.732,99 1.893,100 2.184,101 4.545,102 2.02,103 0.049,104 0.463,105 7.225,106 3.503,107 9.096,108 4.066,109 0.045,110 0.824,111 13.968,112 6.419,113 9.219,114 7.745,115 0.223,116 1.117,117 22.053,118 9.145,119 39.638,120 11.182,121 0.188,122 1.222,123 26.828,124 10.338,125 5.301}
{0 CHEMBL305187,1 9.871,2 9.019,3 4.111,4 8.907,5 8.174,6 3.906,7 6.914,8 4.04,9 2.894,10 5.417,11 1.276,12 5.202,13 5.74,14 3.685,15 3.685,16 14.696,17 16.209,18 17.278,19 18.723,20 19.86,21 6.685,22 3.685,23 0.082,24 3,25 4.182,26 10.719,27 12.129,28 9.927,29 5.306,30 2.656,31 2.656,32 11.573,33 7.13,34 10.438,35 12.16,36 13.909,37 8.299,38 15.678,39 3.97,40 5.121,42 0.125,43 9.563,44 5.336,45 3.808,46 0.912,47 0.526,48 1.307,49 11.417,50 4.16,51 17.309,52 98.061,53 6.382,54 0.462,55 3.992,56 4.117,57 3.417,58 3.545,59 4.986,60 3.486,61 4.555,62 4.74,63 3.75,64 3.958,65 5.457,66 3.866,67 4.908,68 5.143,69 3.815,70 4.143,71 5.775,72 4.006,73 5.029,74 5.296,75 3.687,76 4.147,77 5.822,78 3.966,79 5.027,80 5.323,81 3.627,82 4.093,83 5.763,84 3.904,85 4.903,86 5.183,87 3.538,88 4.006,89 5.732,90 3.815,91 4.793,92 5.085,93 3.342,94 3.859,95 5.539,96 3.652,97 4.596,98 4.895,99 3.157,100 3.629,101 5.358,102 3.439,103 0.068,104 0.679,105 12.211,106 5.266,107 11.621,108 7.193,109 0.134,110 1.149,111 21.641,112 8.664,113 19.324,114 12.271,115 0.291,116 1.516,117 31.092,118 11.882,119 37.997,120 16.993,121 0.285,122 1.609,123 34.999,124 13.496,125 6.959}
{0 CHEMBL30534,1 9.63,2 8.742,3 3.85,4 9.475,5 7.857,6 4.067,7 7.545,8 4.119,9 2.521,10 6.741,11 0.323,12 6.433,13 5.766,14 4.51,15 4.51,16 16.624,17 18.149,18 19.621,19 21.132,20 22.621,21 7.51,22 4.51,23 0.073,24 4,25 4.227,26 10.517,27 11.935,28 9.559,29 5.614,30 2.321,31 2.321,32 11.405,33 6.917,34 10.112,35 11.893,36 13.705,37 8.103,38 15.538,39 3.761,40 6.009,41 2.593,42 0.114,43 9.378,44 6.781,45 3.25,47 0.603,48 1.548,49 5,50 2.526,51 6.38,52 59.061,53 9.104,54 0.938,55 3.238,56 3.333,57 3.077,58 2.981,59 4.368,60 2.915,61 3.68,62 3.797,63 3.414,64 3.371,65 4.76,66 3.276,67 3.769,68 3.945,69 3.214,70 3.322,71 4.71,72 3.188,73 3.66,74 3.816,75 3.176,76 3.221,77 4.692,78 3.104,79 3.661,80 3.869,81 2.98,82 3.024,83 4.648,84 2.88,85 3.419,86 3.682,87 2.549,88 2.645,89 4.254,90 2.43,91 2.784,92 3.106,93 0.785,94 1.772,95 3.32,96 1.392,97 1.515,98 1.922,99 0.028,100 0.457,101 1.609,102 0.245,103 0.013,104 0.304,105 3.323,106 1.748,107 3.856,108 2.014,109 0.062,110 0.503,111 6.802,112 3.104,113 6.299,114 3.422,115 0.047,116 0.53,117 9.991,118 4.177,119 6.427,120 4.874,121 0.026,122 0.473,123 7.25,124 3.322,125 6.558}
{0 CHEMBL30739,1 9.914,2 9,3 4.094,4 9.199,5 8.093,6 4.008,7 7.417,8 4.091,9 2.923,10 5.987,11 0.608,12 5.69,13 6.059,14 4.276,15 4.276,16 16.091,17 17.547,18 18.967,19 20.415,20 21.85,21 6.971,22 4.276,23 0.069,24 4,25 4.311,26 10.824,27 12.251,28 9.81,29 5.146,30 2.308,31 2.308,32 11.738,33 7.29,34 10.439,35 12.25,36 14.089,37 8.503,38 15.949,39 3.97,40 5.367,42 0.109,43 9.772,44 5.936,45 3.346,46 0.505,47 0.533,48 1.434,49 5.625,50 2.685,51 7.21,52 69.379,53 7.262,54 0.556,55 3.556,56 3.681,57 3.193,58 3.209,59 4.486,60 3.116,61 4.127,62 4.318,63 3.609,64 3.664,65 4.946,66 3.531,67 4.315,68 4.522,69 3.502,70 3.766,71 5.041,72 3.587,73 4.381,74 4.585,75 3.543,76 3.797,77 5.144,78 3.612,79 4.424,80 4.67,81 3.331,82 3.669,83 5.182,84 3.452,85 4.38,86 4.717,87 2.947,88 3.358,89 5.018,90 3.089,91 3.843,92 4.201,93 1.76,94 2.677,95 4.437,96 2.341,97 3.021,98 3.423,99 0.592,100 1.705,101 3.45,102 1.34,103 0.036,104 0.474,105 7.777,106 3.31,107 6.074,108 4.424,109 0.105,110 0.811,111 15.317,112 6.229,113 10.069,114 8.15,115 0.105,116 0.951,117 22.23,118 8.441,119 10.086,120 10.4,121 0.101,122 1.011,123 21.231,124 8.377,125 7.167}
{0 CHEMBL30955,1 9.63,2 8.742,3 3.85,4 9.04,5 7.857,6 3.981,7 7.167,8 4.064,9 2.6,10 5.908,11 0.323,12 5.719,13 5.766,14 4.114,15 4.114,16 15.699,17 17.129,18 18.498,19 19.911,20 21.3,21 6.806,22 4.114,23 0.073,24 4,25 3.98,26 10.517,27 11.935,28 9.559,29 5.098,30 1.829,31 1.829,32 11.405,33 6.917,34 10.112,35 11.893,36 13.705,37 8.103,38 15.538,39 3.761,40 5.435,42 0.114,43 9.378,44 5.951,45 3.268,47 0.578,48 1.532,49 5,50 2.646,51 7.003,52 60.451,53 8.429,54 0.625,55 3.309,56 3.415,57 3.085,58 3.018,59 4.348,60 2.943,61 3.811,62 3.957,63 3.426,64 3.432,65 4.783,66 3.321,67 3.944,68 4.152,69 3.29,70 3.421,71 4.769,72 3.257,73 3.838,74 4.017,75 3.281,76 3.342,77 4.735,78 3.18,79 3.778,80 3.989,81 3.011,82 3.124,83 4.67,84 2.946,85 3.567,86 3.846,87 2.271,88 2.686,89 4.36,90 2.491,91 3.086,92 3.433,93 0.829,94 1.934,95 3.638,96 1.607,97 2.091,98 2.539,99 0.055,100 0.77,101 2.197,102 0.441,103 0.019,104 0.35,105 4.562,106 2.167,107 4.205,108 2.673,109 0.076,110 0.592,111 9.513,112 4.048,113 7.785,114 4.882,115 0.059,116 0.64,117 12.52,118 5.243,119 8.58,120 6.557,121 0.063,122 0.609,123 13.058,124 4.911,125 6.65}
{0 CHEMBL332154,1 9.691,2 8.848,3 4.007,4 9.108,5 8.015,6 3.924,7 7.105,8 4.019,9 2.979,10 6.133,11 0.858,12 5.74,13 5.34,14 3.97,15 3.97,16 15.329,17 16.816,18 18.055,19 19.492,20 20.785,21 6.97,22 3.97,23 0.084,24 4,25 4.205,26 10.528,27 11.938,28 9.772,29 5.536,30 2.652,31 2.652,32 11.376,33 6.763,34 10.125,35 11.798,36 13.499,37 7.902,38 15.221,39 3.871,40 5.584,42 0.128,43 9.225,44 6.015,45 3.727,46 0.947,47 0.578,48 1.469,49 11.182,50 2.895,51 8.38,52 89.155,53 7.359,54 0.5,55 3.781,56 3.897,57 3.339,58 3.347,59 4.882,60 3.325,61 4.281,62 4.439,63 3.639,64 3.7,65 5.403,66 3.65,67 4.532,68 4.752,69 3.609,70 3.782,71 5.511,72 3.69,73 4.499,74 4.747,75 3.385,76 3.654,77 5.401,78 3.528,79 4.393,80 4.651,81 3.244,82 3.525,83 5.284,84 3.391,85 4.272,86 4.527,87 3.149,88 3.405,89 5.167,90 3.274,91 4.204,92 4.461,93 3.036,94 3.301,95 5.151,96 3.175,97 4.045,98 4.295,99 2.973,100 3.249,101 4.932,102 3.125,103 0.023,104 0.552,105 8.103,106 3.633,107 5.215,108 4.677,109 0.18,110 0.881,111 14.589,112 5.85,113 22.76,114 7.765,115 0.196,116 1.077,117 20.555,118 7.737,119 27.055,120 10.534,121 0.182,122 1.015,123 20.607,124 7.489,125 5.573}
{0 CHEMBL332242,1 10.54,2 9.597,3 5.004,4 9.97,5 8.659,6 4.138,7 8.154,8 4.244,9 3.329,10 7.644,11 1.416,12 7.007,13 6.43,14 4.816,15 4.816,16 17.392,17 18.957,18 20.499,19 22.062,20 23.618,21 7.816,22 4.816,23 0.063,24 13,25 4.945,26 11.482,27 12.921,28 10.418,29 6.167,30 3.016,31 3.016,32 12.428,33 7.87,34 10.994,35 12.817,36 14.668,37 9.064,38 16.539,39 4.533,40 6.576,41 2.501,42 0.1,43 10.356,44 7.434,45 4.068,46 0.718,47 0.557,48 1.416,49 8.042,50 3.165,51 10.02,52 94.484,53 7.099,54 0.536,55 3.92,56 4.041,57 3.479,58 3.51,59 4.889,60 3.475,61 4.524,62 4.705,63 3.896,64 3.975,65 5.416,66 3.919,67 4.806,68 5.023,69 3.97,70 4.143,71 5.682,72 4.058,73 4.886,74 5.097,75 3.927,76 4.179,77 5.822,78 4.067,79 4.86,80 5.099,81 3.778,82 4.088,83 5.744,84 3.954,85 4.781,86 5.025,87 3.643,88 3.935,89 5.758,90 3.797,91 4.63,92 4.916,93 3.225,94 3.665,95 5.457,96 3.487,97 4.255,98 4.555,99 3.137,100 3.381,101 4.961,102 3.243,103 0.027,104 0.673,105 9.717,106 4.228,107 5.337,108 5.79,109 0.14,110 1.192,111 19.252,112 7.5,113 12.956,114 10.542,115 0.218,116 1.488,117 26.827,118 10.003,119 21.068,120 14.113,121 0.347,122 1.554,123 29.292,124 11.22,125 5}
{0 CHEMBL339960,1 10.203,2 9.335,3 4.5,4 9.699,5 8.475,6 4.042,7 7.831,8 4.159,9 3.362,10 6.327,11 1.423,12 6.305,13 6.338,14 4.424,15 4.424,16 16.604,17 18.107,18 19.531,19 21.016,20 22.465,21 7.424,22 4.424,23 0.079,24 5,25 4.783,26 11.066,27 12.481,28 10.203,29 5.909,30 2.904,31 2.904,32 11.936,33 7.445,34 10.721,35 12.452,36 14.211,37 8.631,38 15.99,39 4.304,40 6.119,41 2.045,42 0.121,43 9.899,44 6.582,45 3.871,46 1.166,47 0.581,48 1.589,49 15,50 5.362,51 28.754,52 124.186,53 7.954,54 0.485,55 4.115,56 4.242,57 3.74,58 3.684,59 5.125,60 3.643,61 4.681,62 4.866,63 4.118,64 4.095,65 5.662,66 4.025,67 4.974,68 5.207,69 4.181,70 4.242,71 5.902,72 4.122,73 5.005,74 5.251,75 4.152,76 4.21,77 5.91,78 4.058,79 4.967,80 5.24,81 3.872,82 4.094,83 5.797,84 3.923,85 4.867,86 5.135,87 3.796,88 3.97,89 5.742,90 3.81,91 4.732,92 5.002,93 3.651,94 3.858,95 5.567,96 3.689,97 4.607,98 4.864,99 3.574,100 3.793,101 5.438,102 3.625,103 0.02,104 0.817,105 11.026,106 4.938,107 6.029,108 6.736,109 0.192,110 1.346,111 22.819,112 8.407,113 20.659,114 11.728,115 0.44,116 1.621,117 37.784,118 12.138,119 41.04,120 16.817,121 0.389,122 1.587,123 43.229,124 13.19,125 5}
{0 CHEMBL340641,1 10.195,2 9.333,3 4.522,4 9.697,5 8.48,6 4.015,7 7.8,8 4.104,9 3.362,10 6.96,11 1.471,12 6.455,13 6.25,14 4.352,15 4.352,16 16.479,17 17.977,18 19.369,19 20.843,20 22.266,21 7.352,22 4.352,23 0.079,24 5,25 4.783,26 11.051,27 12.463,28 10.252,29 5.988,30 2.904,31 2.904,32 11.914,33 7.445,34 10.725,35 12.453,36 14.208,37 8.598,38 15.982,39 4.304,40 6.184,41 2.069,42 0.124,43 9.871,44 6.692,45 3.967,46 1.203,47 0.583,48 1.583,49 15.645,50 4.964,51 24.638,52 127.143,53 8.025,54 0.5,55 4.129,56 4.251,57 3.764,58 3.712,59 5.157,60 3.67,61 4.69,62 4.874,63 4.132,64 4.116,65 5.686,66 4.045,67 4.988,68 5.215,69 4.224,70 4.281,71 5.944,72 4.167,73 5.016,74 5.256,75 4.186,76 4.244,77 5.937,78 4.095,79 4.999,80 5.269,81 3.921,82 4.126,83 5.857,84 3.963,85 4.866,86 5.13,87 3.818,88 3.99,89 5.741,90 3.832,91 4.746,92 5.009,93 3.714,94 3.878,95 5.641,96 3.724,97 4.622,98 4.873,99 3.607,100 3.818,101 5.493,102 3.657,103 0.01,104 0.82,105 10.837,106 5.05,107 6.13,108 6.814,109 0.202,110 1.359,111 22.719,112 8.467,113 21.273,114 11.679,115 0.43,116 1.666,117 37.696,118 12.438,119 44.519,120 17.067,121 0.348,122 1.638,123 42.883,124 13.548,125 5.98}
{0 CHEMBL35093,1 10.199,2 9.318,3 4.477,4 9.34,5 8.44,6 3.953,7 7.499,8 4.075,9 3.187,10 5.953,11 1.058,12 5.809,13 6.212,14 4.023,15 4.023,16 15.833,17 17.287,18 18.597,19 20.019,20 21.359,21 7.023,22 4.023,23 0.076,24 5,25 4.59,26 11.079,27 12.496,28 10.191,29 5.627,30 2.601,31 2.601,32 11.961,33 7.506,34 10.742,35 12.499,36 14.281,37 8.703,38 16.083,39 4.263,40 5.65,42 0.115,43 9.966,44 5.887,45 3.796,46 0.988,47 0.533,48 1.365,49 11.769,50 3.623,51 13.128,52 107.276,53 6.595,54 0.414,55 4.046,56 4.182,57 3.525,58 3.6,59 4.999,60 3.55,61 4.634,62 4.838,63 3.89,64 4.022,65 5.523,66 3.949,67 4.906,68 5.134,69 3.934,70 4.204,71 5.751,72 4.088,73 5.025,74 5.279,75 3.779,76 4.205,77 5.823,78 4.031,79 5.04,80 5.35,81 3.61,82 4.061,83 5.741,84 3.868,85 4.802,86 5.087,87 3.539,88 3.915,89 5.53,90 3.754,91 4.734,92 5.01,93 3.475,94 3.892,95 5.446,96 3.718,97 4.717,98 5.01,99 3.323,100 3.777,101 5.476,102 3.59,103 0.053,104 0.775,105 12.385,106 5.019,107 7.253,108 7.195,109 0.227,110 1.311,111 23.237,112 8.228,113 19.406,114 12.278,115 0.264,116 1.624,117 30.695,118 11.332,119 26.227,120 16.559,121 0.255,122 1.715,123 34.628,124 13.308,125 6.896}
{0 CHEMBL37170,1 10.199,2 9.318,3 4.477,4 9.34,5 8.44,6 3.953,7 7.499,8 4.075,9 3.187,10 5.953,11 1.058,12 5.809,13 6.212,14 4.023,15 4.023,16 15.833,17 17.287,18 18.597,19 20.019,20 21.359,21 7.023,22 4.023,23 0.076,24 5,25 4.59,26 11.079,27 12.496,28 10.191,29 5.627,30 2.601,31 2.601,32 11.961,33 7.506,34 10.742,35 12.499,36 14.281,37 8.703,38 16.083,39 4.263,40 5.65,42 0.115,43 9.966,44 5.887,45 3.796,46 0.988,47 0.533,48 1.365,49 11.769,50 3.623,51 13.128,52 107.276,53 6.595,54 0.414,55 4.046,56 4.182,57 3.525,58 3.6,59 4.999,60 3.55,61 4.634,62 4.838,63 3.89,64 4.022,65 5.523,66 3.949,67 4.906,68 5.134,69 3.934,70 4.204,71 5.751,72 4.088,73 5.025,74 5.279,75 3.779,76 4.205,77 5.823,78 4.031,79 5.04,80 5.35,81 3.61,82 4.061,83 5.741,84 3.868,85 4.802,86 5.087,87 3.539,88 3.915,89 5.53,90 3.754,91 4.734,92 5.01,93 3.475,94 3.892,95 5.446,96 3.718,97 4.717,98 5.01,99 3.323,100 3.777,101 5.476,102 3.59,103 0.053,104 0.775,105 12.385,106 5.019,107 7.253,108 7.195,109 0.227,110 1.311,111 23.237,112 8.228,113 19.406,114 12.278,115 0.264,116 1.624,117 30.695,118 11.332,119 26.227,120 16.559,121 0.255,122 1.715,123 34.628,124 13.308,125 6.465}
{0 CHEMBL38465,1 9.669,2 8.809,3 3.85,4 9.249,5 7.953,6 3.931,7 7.311,8 4.047,9 2.882,10 6.663,11 0.476,12 6.027,13 6.056,14 3.975,15 3.975,16 15.674,17 17.109,18 18.404,19 19.805,20 21.13,21 6.975,22 3.975,23 0.081,24 3,25 4.227,26 10.528,27 11.939,28 9.6,29 5.372,30 2.366,31 2.366,32 11.389,33 6.862,34 10.162,35 11.882,36 13.628,37 8.082,38 15.392,39 3.807,40 5.59,42 0.122,43 9.336,44 6.373,45 3.72,46 0.515,47 0.58,48 1.53,49 7.944,50 2.654,51 7.041,52 74.561,53 8.238,54 0.8,55 3.541,56 3.654,57 3.275,58 3.213,59 4.637,60 3.148,61 4.015,62 4.173,63 3.614,64 3.566,65 5.048,66 3.479,67 4.128,68 4.329,69 3.422,70 3.553,71 5.084,72 3.426,73 4.137,74 4.356,75 3.445,76 3.514,77 5.079,78 3.353,79 4.041,80 4.292,81 3.467,82 3.412,83 4.922,84 3.231,85 3.748,86 3.926,87 3.014,88 3.221,89 4.683,90 3.048,91 3.632,92 3.854,93 2.612,94 2.968,95 4.475,96 2.813,97 3.53,98 3.782,99 2.634,100 2.824,101 4.437,102 2.722,103 0.021,104 0.461,105 5.894,106 2.751,107 5.41,108 3.419,109 0.09,110 0.755,111 12.068,112 4.767,113 9.784,114 5.912,115 0.115,116 0.821,117 14.683,118 5.447,119 14.617,120 6.644,121 0.137,122 0.83,123 14.686,124 5.546,125 6}
{0 CHEMBL385371,1 10.383,2 9.498,3 4.804,4 9.844,5 8.615,6 4.039,7 7.965,8 4.107,9 3.341,10 7.194,11 1.907,12 6.685,13 6.375,14 4.5,15 4.5,16 16.849,17 18.364,18 19.807,19 21.306,20 22.773,21 7.5,22 4.5,23 0.074,24 9,25 4.856,26 11.267,27 12.685,28 10.417,29 6.165,30 3.162,31 3.162,32 12.153,33 7.618,34 10.845,35 12.6,36 14.383,37 8.755,38 16.187,39 4.489,40 6.395,41 2.2,42 0.114,43 10.055,44 6.953,45 3.839,46 0.909,47 0.564,48 1.389,49 13.613,50 5.285,51 27.928,52 120.358,53 6.993,54 0.486,55 4.196,56 4.299,57 3.724,58 3.733,59 5.184,60 3.709,61 4.778,62 4.936,63 4.067,64 4.133,65 5.707,66 4.09,67 5.038,68 5.235,69 4.17,70 4.278,71 5.958,72 4.204,73 5.033,74 5.242,75 4.037,76 4.229,77 5.895,78 4.131,79 5.027,80 5.248,81 3.911,82 4.135,83 5.853,84 4.031,85 4.948,86 5.17,87 3.771,88 4.04,89 5.78,90 3.919,91 4.891,92 5.148,93 3.601,94 3.973,95 5.641,96 3.813,97 4.805,98 5.092,99 3.496,100 3.868,101 5.488,102 3.703,103 0.026,104 0.792,105 13.476,106 6.167,107 7.794,108 7.825,109 0.238,110 1.327,111 26.221,112 10.341,113 23.344,114 13.25,115 0.643,116 1.653,117 35.496,118 13.355,119 44.209,120 17.682,121 0.343,122 1.644,123 35.091,124 13.446,125 5}
{0 CHEMBL38681,1 9.349,2 8.484,3 3.611,4 8.824,5 7.621,6 3.928,7 7.026,8 4.015,9 2.789,10 4.761,11 0.684,12 4.81,13 5.541,14 4.138,15 4.138,16 15.614,17 17.08,18 18.458,19 19.903,20 21.301,21 7.138,22 4.138,23 0.08,24 3,25 4.007,26 10.214,27 11.626,28 9.395,29 4.904,30 1.647,31 1.647,32 11.08,33 6.735,34 9.977,35 11.752,36 13.554,37 7.923,38 15.376,39 3.434,40 4.944,42 0.121,43 9.182,44 4.767,45 3.091,47 0.59,48 1.532,49 4.769,50 3.227,51 10.416,52 56.826,53 9.005,54 0.429,55 3.272,56 3.385,57 3.004,58 2.932,59 4.237,60 2.864,61 3.834,62 4.007,63 3.404,64 3.353,65 4.763,66 3.246,67 4.157,68 4.365,69 3.775,70 3.582,71 5.103,72 3.437,73 4.152,74 4.388,75 3.352,76 3.41,77 5.018,78 3.199,79 3.889,80 4.159,81 3.025,82 3.043,83 4.755,84 2.795,85 3.285,86 3.54,87 2.247,88 2.405,89 4.186,90 2.078,91 2.132,92 2.392,93 0.7,94 1.2,95 3.018,96 0.858,103 0.013,104 0.312,105 3.879,106 2.107,107 2.275,108 2.904,109 0.058,110 0.523,111 9.106,112 3.95,113 6.781,114 5.369,115 0.159,116 0.664,117 20.675,118 6.205,119 18.207,120 8.186,121 0.175,122 0.618,123 20.771,124 6.344,125 5.347}
{0 CHEMBL418854,1 10.137,2 9.271,3 4.477,4 9.231,5 8.412,6 3.886,7 7.343,8 4.032,9 3.279,10 5.932,11 1.231,12 5.641,13 6.212,14 3.911,15 3.911,16 15.592,17 17.048,18 18.321,19 19.737,20 21.045,21 6.911,22 3.911,23 0.079,24 5,25 4.46,26 10.997,27 12.41,28 10.188,29 5.568,30 2.622,31 2.622,32 11.862,33 7.368,34 10.629,35 12.353,36 14.104,37 8.494,38 15.876,39 4.263,40 5.542,42 0.121,43 9.778,44 5.806,45 3.586,46 0.83,47 0.572,48 1.541,49 12.821,50 4.256,51 18.116,52 111.445,53 7.327,54 0.387,55 4.104,56 4.217,57 3.665,58 3.617,59 5.083,60 3.59,61 4.694,62 4.866,63 4.02,64 4.017,65 5.613,66 3.968,67 4.98,68 5.193,69 4.096,70 4.178,71 5.853,72 4.084,73 5.018,74 5.26,75 3.97,76 4.148,77 5.823,78 4.02,79 5.005,80 5.266,81 3.837,82 4.116,83 5.748,84 3.96,85 4.956,86 5.227,87 3.69,88 4.053,89 5.635,90 3.864,91 4.876,92 5.161,93 3.565,94 3.897,95 5.573,96 3.712,97 4.702,98 4.976,99 3.474,100 3.737,101 5.434,102 3.582,103 0.01,104 0.755,105 12.202,106 5.38,107 7.491,108 7.061,109 0.223,110 1.238,111 24.85,112 8.897,113 24.24,114 11.86,115 0.549,116 1.534,117 36.454,118 12.068,119 39.251,120 16.464,121 0.503,122 1.58,123 38.144,124 12.453,125 6.301}
{0 CHEMBL42,1 10.171,2 9.271,3 4.7,4 9.364,5 8.378,6 3.961,7 7.473,8 4.083,9 3.05,10 7.446,11 1.638,12 6.61,13 6.133,14 4.131,15 4.131,16 15.901,17 17.372,18 18.699,19 20.138,20 21.5,21 7.131,22 4.131,23 0.071,24 7,25 4.527,26 11.068,27 12.492,28 10.116,29 5.86,30 2.771,31 2.771,32 11.97,33 7.413,34 10.63,35 12.386,36 14.17,37 8.553,38 15.974,39 4.234,40 6.173,42 0.109,43 9.828,44 7.053,45 3.785,46 1.565,47 0.573,48 1.493,49 7.826,50 3.947,51 15.582,52 94.845,53 7.782,54 0.462,55 3.848,56 3.977,57 3.473,58 3.42,59 4.859,60 3.388,61 4.402,62 4.593,63 3.859,64 3.832,65 5.357,66 3.781,67 4.692,68 4.903,69 3.99,70 4.042,71 5.623,72 3.958,73 4.763,74 5.014,75 3.895,76 4.005,77 5.637,78 3.894,79 4.699,80 4.951,81 3.877,82 3.994,83 5.544,84 3.892,85 4.625,86 4.824,87 3.833,88 4.006,89 5.516,90 3.875,91 4.699,92 4.965,93 3.651,94 3.903,95 5.489,96 3.713,97 4.476,98 4.763,99 3.353,100 3.587,101 5.268,102 3.347,103 0.023,104 0.645,105 8.36,106 3.56,107 5.724,108 4.916,109 0.163,110 1.073,111 17.013,112 5.893,113 14.12,114 8.309,115 0.239,116 1.371,117 25.333,118 8.481,119 22.611,120 11.901,121 0.286,122 1.397,123 28.417,124 9.317,125 7.361}
{0 CHEMBL420510,1 10.472,2 9.577,3 4.836,4 9.817,5 8.684,6 4.075,7 7.948,8 4.2,9 3.288,10 6.95,11 1.506,12 6.67,13 6.498,14 4.601,15 4.601,16 16.939,17 18.471,18 19.949,19 21.47,20 22.97,21 7.601,22 4.601,23 0.074,24 8,25 4.832,26 11.369,27 12.791,28 10.44,29 6.076,30 2.651,31 2.651,32 12.267,33 7.771,34 10.968,35 12.747,36 14.555,37 8.938,38 16.384,39 4.543,40 6.331,41 2.327,42 0.113,43 10.23,44 6.985,45 4.021,46 0.958,47 0.549,48 1.434,49 14.406,50 4.248,51 18.041,52 128.864,53 6.76,54 0.444,55 4.249,56 4.379,57 3.754,58 3.762,59 5.208,60 3.73,61 4.846,62 5.047,63 4.104,64 4.178,65 5.728,66 4.124,67 5.115,68 5.349,69 4.192,70 4.37,71 5.957,72 4.273,73 5.207,74 5.443,75 4.101,76 4.4,77 6.046,78 4.269,79 5.241,80 5.514,81 3.941,82 4.335,83 6.017,84 4.172,85 5.165,86 5.449,87 3.782,88 4.206,89 5.919,90 4.024,91 5.022,92 5.337,93 3.581,94 4.016,95 5.688,96 3.827,97 4.81,98 5.097,99 3.568,100 3.926,101 5.498,102 3.772,103 0.043,104 0.953,105 14.886,106 5.9,107 7.964,108 8.389,109 0.324,110 1.602,111 28.855,112 9.306,113 22.341,114 13.951,115 0.474,116 1.966,117 38.178,118 13.241,119 30.311,120 19.481,121 0.348,122 2.031,123 41.905,124 15.328,125 7.051}
{0 CHEMBL435218,1 10.203,2 9.335,3 4.5,4 9.699,5 8.475,6 4.014,7 7.831,8 4.109,9 3.362,10 6.327,11 1.423,12 6.305,13 6.338,14 4.424,15 4.424,16 16.604,17 18.107,18 19.531,19 21.016,20 22.465,21 7.424,22 4.424,23 0.079,24 5,25 4.783,26 11.066,27 12.481,28 10.203,29 5.909,30 2.904,31 2.904,32 11.936,33 7.445,34 10.721,35 12.452,36 14.211,37 8.631,38 15.99,39 4.304,40 6.119,41 1.684,42 0.121,43 9.899,44 6.582,45 3.871,46 1.188,47 0.593,48 1.62,49 15,50 5.372,51 28.863,52 121.94,53 8.117,54 0.485,55 4.102,56 4.217,57 3.746,58 3.669,59 5.13,60 3.635,61 4.67,62 4.845,63 4.126,64 4.071,65 5.676,66 4.012,67 4.956,68 5.177,69 4.187,70 4.21,71 5.924,72 4.102,73 4.97,74 5.203,75 4.152,76 4.18,77 5.885,78 4.037,79 4.939,80 5.201,81 3.873,82 4.068,83 5.791,84 3.907,85 4.843,86 5.099,87 3.798,88 3.949,89 5.739,90 3.798,91 4.712,92 4.972,93 3.654,94 3.837,95 5.567,96 3.677,97 4.584,98 4.83,99 3.578,100 3.772,101 5.44,102 3.612,103 0.026,104 0.772,105 10.383,106 4.999,107 5.347,108 6.529,109 0.223,110 1.284,111 22.076,112 8.413,113 20.88,114 11.235,115 0.579,116 1.541,117 37.22,118 12.03,119 49.212,120 16.123,121 0.434,122 1.51,123 41.672,124 13.014,125 5.724}
{0 CHEMBL439346,1 10.129,2 9.258,3 4.466,4 9.689,5 8.39,6 4.036,7 7.753,8 4.101,9 3.318,10 6.969,11 1.382,12 6.445,13 6.183,14 4.5,15 4.5,16 16.69,17 18.218,18 19.662,19 21.17,20 22.642,21 7.5,22 4.5,23 0.079,24 6,25 4.62,26 10.999,27 12.413,28 10.183,29 5.989,30 2.563,31 2.563,32 11.872,33 7.38,34 10.614,35 12.365,36 14.147,37 8.506,38 15.951,39 4.263,40 6.152,41 2.185,42 0.119,43 9.813,44 6.714,45 3.773,46 0.91,47 0.585,48 1.441,49 12.111,50 3.772,51 14.224,52 102.876,53 7.309,54 0.567,55 4.021,56 4.117,57 3.582,58 3.541,59 5.083,60 3.533,61 4.564,62 4.708,63 3.899,64 3.897,65 5.572,66 3.878,67 4.79,68 4.969,69 3.992,70 4.007,71 5.795,72 3.963,73 4.768,74 4.958,75 3.835,76 3.956,77 5.7,78 3.885,79 4.777,80 4.987,81 3.671,82 3.912,83 5.635,84 3.808,85 4.743,86 4.981,87 3.531,88 3.837,89 5.576,90 3.694,91 4.674,92 4.946,93 3.39,94 3.725,95 5.457,96 3.568,97 4.512,98 4.783,99 3.304,100 3.604,101 5.269,102 3.465,103 0.021,104 0.654,105 10.576,106 4.953,107 8.17,108 6.046,109 0.238,110 1.054,111 20.52,112 7.933,113 23.983,114 9.665,115 0.625,116 1.267,117 27.358,118 9.924,119 41.972,120 12.607,121 0.365,122 1.246,123 26.599,124 9.898,125 6.2}
{0 CHEMBL45244,1 9.921,2 9.068,3 4.143,4 9.204,5 8.22,6 3.899,7 7.277,8 4.033,9 3.563,10 5.681,11 1.067,12 5.599,13 6.054,14 3.918,15 3.918,16 15.511,17 16.972,18 18.228,19 19.645,20 20.941,21 6.918,22 3.918,23 0.084,24 3,25 4.369,26 10.771,27 12.18,28 9.977,29 5.521,30 2.636,31 2.636,32 11.624,33 7.209,34 10.474,35 12.202,36 13.957,37 8.34,38 15.733,39 4.043,40 5.437,42 0.125,43 9.608,44 5.489,45 3.65,46 0.914,47 0.563,48 1.458,49 11.2,50 3.154,51 9.945,52 99.691,53 7.116,54 0.444,55 3.925,56 4.056,57 3.456,58 3.475,59 5.017,60 3.443,61 4.466,62 4.665,63 3.767,64 3.854,65 5.459,66 3.795,67 4.732,68 4.952,69 3.838,70 4.021,71 5.707,72 3.926,73 4.835,74 5.088,75 3.745,76 3.992,77 5.821,78 3.866,79 4.778,80 5.047,81 3.654,82 3.903,83 5.748,84 3.773,85 4.685,86 4.949,87 3.459,88 3.746,89 5.713,90 3.619,91 4.447,92 4.705,93 3.303,94 3.586,95 5.426,96 3.451,97 4.35,98 4.625,99 3.209,100 3.526,101 5.163,102 3.382,103 0.029,104 0.698,105 9.871,106 4.099,107 8.871,108 5.706,109 0.23,110 1.127,111 18.655,112 6.532,113 16.563,114 9.461,115 0.207,116 1.386,117 24.922,118 9.081,119 27.29,120 13.053,121 0.336,122 1.436,123 28.982,124 9.995,125 6.775}
{0 CHEMBL46,1 10.333,2 9.406,3 4.663,4 9.867,5 8.482,6 4.104,7 8.042,8 4.212,9 3.211,10 7.171,11 1.337,12 6.681,13 6.258,14 4.742,15 4.742,16 17.222,17 18.774,18 20.299,19 21.849,20 23.389,21 7.742,22 4.742,23 0.066,24 7,25 4.844,26 11.26,27 12.693,28 10.225,29 5.975,30 2.964,31 2.964,32 12.19,33 7.7,34 10.852,35 12.669,36 14.513,37 8.921,38 16.376,39 4.331,40 6.299,41 2.248,42 0.104,43 10.199,44 7.067,45 3.952,46 0.698,47 0.563,48 1.442,49 7.864,50 2.635,51 6.941,52 86.574,53 7.156,54 0.6,55 3.818,56 3.941,57 3.376,58 3.391,59 4.845,60 3.36,61 4.389,62 4.576,63 3.772,64 3.824,65 5.327,66 3.777,67 4.627,68 4.832,69 3.83,70 3.978,71 5.572,72 3.904,73 4.745,74 4.951,75 3.766,76 4.018,77 5.737,78 3.904,79 4.74,80 4.993,81 3.63,82 3.919,83 5.68,84 3.787,85 4.644,86 4.894,87 3.461,88 3.764,89 5.659,90 3.623,91 4.426,92 4.716,93 3.091,94 3.484,95 5.241,96 3.314,97 4.081,98 4.384,99 3.006,100 3.218,101 4.851,102 3.096,103 0.02,104 0.614,105 8.686,106 3.729,107 5.931,108 5.113,109 0.138,110 1.047,111 16.859,112 6.316,113 13.68,114 8.917,115 0.184,116 1.254,117 22.098,118 8.174,119 19.428,120 11.437,121 0.311,122 1.341,123 25.308,124 9.635,125 5}
{0 CHEMBL466462,1 10.34,2 9.43,3 4.804,4 9.942,5 8.527,6 4.1,7 8.099,8 4.249,9 3.367,10 8.014,11 1.786,12 7.229,13 6.242,14 4.812,15 4.812,16 17.356,17 18.931,18 20.471,19 22.04,20 23.596,21 7.812,22 4.812,23 0.067,24 7,25 4.934,26 11.248,27 12.676,28 10.295,29 6.237,30 3.011,31 3.011,32 12.162,33 7.647,34 10.839,35 12.615,36 14.417,37 8.819,38 16.239,39 4.357,40 6.735,41 2.444,42 0.106,43 10.077,44 7.697,45 3.882,46 1.08,47 0.627,48 1.717,49 10.269,50 2.435,51 5.927,52 95.392,53 7.77,54 0.517,55 3.96,56 4.087,57 3.555,58 3.429,59 5.11,60 3.442,61 4.513,62 4.693,63 3.952,64 3.845,65 5.696,66 3.842,67 4.808,68 5.028,69 4.016,70 4.012,71 5.949,72 3.968,73 4.876,74 5.112,75 3.955,76 4.028,77 5.936,78 3.958,79 4.842,80 5.097,81 3.874,82 4.009,83 5.788,84 3.921,85 4.828,86 5.065,87 3.748,88 3.927,89 5.879,90 3.822,91 4.71,92 4.984,93 3.518,94 3.68,95 5.75,96 3.565,97 4.368,98 4.643,99 3.283,100 3.384,101 5.442,102 3.304,103 0.114,104 0.797,105 9.108,106 3.737,107 16.685,108 4.923,109 0.377,110 1.287,111 17.887,112 5.966,113 45.19,114 8.413,115 0.651,116 1.555,117 26.734,118 8.497,119 76.895,120 11.836,121 0.727,122 1.553,123 29.907,124 9.059,125 5}
{0 CHEMBL511555,1 10.34,2 9.43,3 4.804,4 9.942,5 8.527,6 4.1,7 8.099,8 4.249,9 3.367,10 8.014,11 1.786,12 7.229,13 6.242,14 4.812,15 4.812,16 17.356,17 18.931,18 20.471,19 22.04,20 23.596,21 7.812,22 4.812,23 0.067,24 7,25 4.934,26 11.248,27 12.676,28 10.295,29 6.237,30 3.011,31 3.011,32 12.162,33 7.647,34 10.839,35 12.615,36 14.417,37 8.819,38 16.239,39 4.357,40 6.735,41 2.444,42 0.106,43 10.077,44 7.697,45 3.882,46 1.08,47 0.627,48 1.717,49 10.269,50 2.435,51 5.927,52 95.392,53 7.77,54 0.517,55 3.96,56 4.087,57 3.555,58 3.429,59 5.11,60 3.442,61 4.513,62 4.693,63 3.952,64 3.845,65 5.696,66 3.842,67 4.808,68 5.028,69 4.016,70 4.012,71 5.949,72 3.968,73 4.876,74 5.112,75 3.955,76 4.028,77 5.936,78 3.958,79 4.842,80 5.097,81 3.874,82 4.009,83 5.788,84 3.921,85 4.828,86 5.065,87 3.748,88 3.927,89 5.879,90 3.822,91 4.71,92 4.984,93 3.518,94 3.68,95 5.75,96 3.565,97 4.368,98 4.643,99 3.283,100 3.384,101 5.442,102 3.304,103 0.114,104 0.797,105 9.108,106 3.737,107 16.685,108 4.923,109 0.377,110 1.287,111 17.887,112 5.966,113 45.19,114 8.413,115 0.651,116 1.555,117 26.734,118 8.497,119 76.895,120 11.836,121 0.727,122 1.553,123 29.907,124 9.059,125 5}
{0 CHEMBL523716,1 10.306,2 9.392,3 4.787,4 9.944,5 8.489,6 4.1,7 8.083,8 4.249,9 3.367,10 8.016,11 1.626,12 7.23,13 6.242,14 4.812,15 4.812,16 17.356,17 18.931,18 20.471,19 22.04,20 23.596,21 7.812,22 4.812,23 0.067,24 7,25 4.89,26 11.215,27 12.644,28 10.252,29 6.237,30 3.007,31 3.007,32 12.132,33 7.582,34 10.765,35 12.538,36 14.34,37 8.74,38 16.163,39 4.344,40 6.735,41 2.525,42 0.106,43 10.011,44 7.698,45 3.843,46 1.08,47 0.625,48 1.693,49 10.16,50 2.688,51 7.227,52 93.124,53 7.782,54 0.536,55 3.924,56 4.057,57 3.525,58 3.383,59 5.107,60 3.396,61 4.449,62 4.64,63 3.893,64 3.792,65 5.529,66 3.788,67 4.719,68 4.941,69 3.959,70 3.959,71 5.794,72 3.915,73 4.805,74 5.046,75 3.919,76 3.98,77 5.825,78 3.911,79 4.784,80 5.042,81 3.821,82 3.942,83 5.735,84 3.86,85 4.731,86 4.973,87 3.675,88 3.862,89 5.74,90 3.752,91 4.642,92 4.925,93 3.46,94 3.635,95 5.614,96 3.513,97 4.329,98 4.611,99 3.239,100 3.325,101 5.406,102 3.243,103 0.143,104 0.786,105 8.814,106 3.393,107 17.486,108 4.631,109 0.28,110 1.248,111 16.693,112 5.456,113 19.003,114 7.827,115 0.542,116 1.485,117 23.852,118 7.611,119 48.59,120 10.701,121 0.567,122 1.487,123 27.396,124 8.386,125 5}
{0 CHEMBL558226,1 10.35,2 9.423,3 4.7,4 9.111,5 8.502,6 3.968,7 7.417,8 4.134,9 3.352,10 5.736,11 1.481,12 5.526,13 6.499,14 4.119,15 4.119,16 15.693,17 17.129,18 18.483,19 19.907,20 21.287,21 7.119,22 4.119,23 0.066,24 8,25 4.575,26 11.273,27 12.706,28 10.298,29 5.394,30 2.556,31 2.556,32 12.202,33 7.653,34 10.838,35 12.624,36 14.431,37 8.895,38 16.255,39 4.344,40 5.513,42 0.102,43 10.154,44 5.461,45 3.848,46 1.241,47 0.591,48 1.65,49 8.045,50 1.028,51 1.056,52 86.124,53 7.663,54 0.24,55 3.861,56 3.984,57 3.455,58 3.386,59 4.87,60 3.362,61 4.479,62 4.652,63 3.898,64 3.882,65 5.419,66 3.831,67 4.785,68 4.994,69 3.955,70 4.031,71 5.722,72 3.922,73 4.849,74 5.122,75 3.75,76 3.868,77 5.815,78 3.727,79 4.554,80 4.793,81 3.761,82 3.625,83 5.699,84 3.56,85 4.397,86 4.581,87 3.581,88 3.598,89 5.63,90 3.523,91 4.403,92 4.605,93 3.538,94 3.647,95 5.331,96 3.532,97 4.41,98 4.628,99 3.552,100 3.616,101 5.264,102 3.47,103 0.048,104 0.629,105 8.991,106 3.869,107 8.191,108 5.21,109 0.239,110 1.072,111 18.942,112 7.109,113 21.6,114 9.745,115 0.258,116 1.317,117 28.547,118 9.914,119 35.928,120 13.909,121 0.646,122 1.201,123 35.663,124 9.994,125 5}
{0 CHEMBL566522,1 10.377,2 9.467,3 4.852,4 10.013,5 8.565,6 4.1,7 8.131,8 4.25,9 3.06,10 8.038,11 1.501,12 7.258,13 6.242,14 4.812,15 4.812,16 17.376,17 18.948,18 20.483,19 22.049,20 23.603,21 7.812,22 4.812,23 0.067,24 8,25 4.902,26 11.284,27 12.712,28 10.307,29 6.278,30 3.201,31 3.201,32 12.197,33 7.609,34 10.806,35 12.575,36 14.373,37 8.777,38 16.193,39 4.443,40 6.769,41 2.667,42 0.108,43 10.055,44 7.718,45 3.959,46 1.062,47 0.609,48 1.56,49 10.269,50 3.465,51 12.003,52 98.733,53 7.788,54 0.667,55 3.949,56 4.081,57 3.575,58 3.459,59 5.026,60 3.464,61 4.507,62 4.696,63 3.954,64 3.876,65 5.554,66 3.867,67 4.741,68 4.968,69 3.944,70 4.005,71 5.705,72 3.944,73 4.785,74 5.027,75 3.927,76 4.013,77 5.734,78 3.936,79 4.783,80 5.038,81 3.848,82 4.001,83 5.67,84 3.911,85 4.735,86 4.972,87 3.717,88 3.949,89 5.651,90 3.827,91 4.686,92 4.976,93 3.495,94 3.721,95 5.572,96 3.584,97 4.383,98 4.675,99 3.259,100 3.402,101 5.372,102 3.307,103 0.037,104 0.824,105 8.655,106 3.581,107 5.223,108 4.78,109 0.243,110 1.341,111 17.456,112 5.773,113 17.278,114 7.969,115 0.403,116 1.558,117 24.309,118 8.252,119 30.306,120 11.315,121 0.371,122 1.56,123 26.102,124 8.817,125 5}
{0 CHEMBL571046,1 10.377,2 9.467,3 4.852,4 10.013,5 8.565,6 4.1,7 8.131,8 4.25,9 3.06,10 8.038,11 1.501,12 7.258,13 6.242,14 4.812,15 4.812,16 17.376,17 18.948,18 20.483,19 22.049,20 23.603,21 7.812,22 4.812,23 0.067,24 8,25 4.902,26 11.284,27 12.712,28 10.307,29 6.278,30 3.201,31 3.201,32 12.197,33 7.609,34 10.806,35 12.575,36 14.373,37 8.777,38 16.193,39 4.443,40 6.769,41 2.664,42 0.108,43 10.055,44 7.718,45 3.959,46 1.061,47 0.609,48 1.56,49 10.269,50 3.443,51 11.853,52 98.582,53 7.788,54 0.667,55 3.949,56 4.081,57 3.575,58 3.459,59 5.025,60 3.464,61 4.507,62 4.695,63 3.957,64 3.871,65 5.555,66 3.863,67 4.745,68 4.976,69 3.946,70 3.999,71 5.71,72 3.942,73 4.784,74 5.024,75 3.93,76 4.009,77 5.732,78 3.933,79 4.788,80 5.047,81 3.849,82 3.991,83 5.677,84 3.906,85 4.734,86 4.97,87 3.713,88 3.959,89 5.649,90 3.834,91 4.681,92 4.966,93 3.493,94 3.732,95 5.564,96 3.589,97 4.385,98 4.678,99 3.267,100 3.394,101 5.379,102 3.3,103 0.037,104 0.824,105 8.655,106 3.581,107 5.056,108 4.78,109 0.235,110 1.342,111 17.421,112 5.764,113 17.195,114 7.978,115 0.453,116 1.561,117 24.619,118 8.085,119 31.39,120 11.093,121 0.332,122 1.559,123 25.944,124 8.811,125 5}
{0 CHEMBL582992,1 10.403,2 9.489,3 4.852,4 10.044,5 8.583,6 4.11,7 8.16,8 4.254,9 3.078,10 8.024,11 1.531,12 7.249,13 6.388,14 4.858,15 4.858,16 17.476,17 19.056,18 20.604,19 22.179,20 23.744,21 7.858,22 4.858,23 0.067,24 8,25 4.902,26 11.314,27 12.743,28 10.332,29 6.288,30 3.214,31 3.214,32 12.232,33 7.673,34 10.847,35 12.632,36 14.447,37 8.836,38 16.285,39 4.466,40 6.766,41 3.448,42 0.108,43 10.118,44 7.689,45 3.958,46 0.897,47 0.567,48 1.417,49 10.269,50 3.745,51 14.027,52 103.558,53 7.218,54 0.667,55 3.994,56 4.132,57 3.566,58 3.515,59 5.001,60 3.5,61 4.556,62 4.757,63 3.937,64 3.935,65 5.487,66 3.902,67 4.774,68 5.001,69 3.949,70 4.08,71 5.624,72 3.998,73 4.868,74 5.115,75 3.954,76 4.116,77 5.696,78 4.022,79 4.891,80 5.149,81 3.863,82 4.122,83 5.709,84 4.008,85 4.838,86 5.088,87 3.648,88 4.047,89 5.612,90 3.884,91 4.742,92 5.051,93 3.368,94 3.793,95 5.405,96 3.607,97 4.409,98 4.699,99 3.216,100 3.548,101 5.126,102 3.393,103 0.033,104 0.796,105 10.395,106 3.877,107 7.75,108 5.619,109 0.226,110 1.308,111 20.094,112 6.3,113 17.001,114 9.466,115 0.307,116 1.525,117 25.738,118 8.775,119 20.501,120 12.977,121 0.258,122 1.611,123 28.945,124 9.648,125 5}
{0 CHEMBL597,1 9.809,2 8.942,3 4.143,4 9.089,5 8.086,6 3.915,7 7.146,8 4.04,9 2.996,10 6.465,11 0.959,12 5.855,13 5.405,14 3.83,15 3.83,16 15.136,17 16.607,18 17.78,19 19.198,20 20.426,21 6.83,22 3.83,23 0.077,24 3,25 4.29,26 10.67,27 12.084,28 9.788,29 5.468,30 2.856,31 2.856,32 11.538,33 7.002,34 10.283,35 11.999,36 13.745,37 8.161,38 15.513,39 3.932,40 5.553,42 0.12,43 9.425,44 6.211,45 3.847,46 1.029,47 0.559,48 1.448,49 7.333,50 3.352,51 11.233,52 84.115,53 7.035,54 0.522,55 3.78,56 3.908,57 3.301,58 3.322,59 4.855,60 3.292,61 4.286,62 4.473,63 3.625,64 3.686,65 5.305,66 3.633,67 4.505,68 4.729,69 3.574,70 3.779,71 5.462,72 3.683,73 4.504,74 4.739,75 3.537,76 3.769,77 5.395,78 3.652,79 4.555,80 4.807,81 3.631,82 3.809,83 5.459,84 3.71,85 4.537,86 4.751,87 3.659,88 3.829,89 5.566,90 3.745,91 4.573,92 4.806,93 3.457,94 3.775,95 5.577,96 3.632,97 4.494,98 4.794,99 2.934,100 3.483,101 5.297,102 3.267,103 0.044,104 0.588,105 8.766,106 3.544,107 7.959,108 4.881,109 0.122,110 0.945,111 15.458,112 5.618,113 15.73,114 8.078,115 0.251,116 1.102,117 20.221,118 6.946,119 26.424,120 9.996,121 0.18,122 1.066,123 20.131,124 7.569,125 8.328}
{0 CHEMBL597601,1 10.009,2 9.147,3 4.357,4 9.302,5 8.293,6 3.92,7 7.324,8 4.089,9 3.083,10 6.64,11 0.766,12 6.086,13 6.142,14 3.976,15 3.976,16 15.524,17 16.992,18 18.231,19 19.653,20 20.942,21 6.976,22 3.976,23 0.079,24 4,25 4.388,26 10.865,27 12.277,28 10.003,29 5.659,30 2.817,31 2.817,32 11.728,33 7.168,34 10.468,35 12.171,36 13.899,37 8.319,38 15.646,39 4.143,40 5.782,42 0.121,43 9.599,44 6.362,45 3.886,46 0.886,47 0.567,48 1.465,49 12.24,50 4.424,51 19.571,52 104.316,53 7.672,54 0.607,55 3.928,56 4.057,57 3.543,58 3.504,59 4.943,60 3.466,61 4.472,62 4.66,63 3.891,64 3.896,65 5.421,66 3.838,67 4.726,68 4.953,69 3.868,70 4.031,71 5.579,72 3.913,73 4.783,74 5.046,75 3.707,76 3.999,77 5.559,78 3.846,79 4.718,80 4.987,81 3.638,82 3.927,83 5.471,84 3.771,85 4.649,86 4.929,87 3.556,88 3.78,89 5.424,90 3.619,91 4.43,92 4.722,93 3.397,94 3.568,95 5.195,96 3.419,97 4.149,98 4.378,99 3.281,100 3.506,101 4.967,102 3.375,103 0.048,104 0.694,105 9.255,106 4.004,107 6.925,108 5.525,109 0.147,110 1.147,111 18.272,112 6.333,113 15.652,114 8.969,115 0.245,116 1.366,117 27.115,118 9.126,119 23.224,120 12.858,121 0.285,122 1.388,123 29.68,124 10.274,125 5.604}
{0 CHEMBL6857,1 9.792,2 8.879,3 4.094,4 9.512,5 7.969,6 4.082,7 7.656,8 4.186,9 2.899,10 6.347,11 0.671,12 6.283,13 5.906,14 4.648,15 4.648,16 16.911,17 18.463,18 19.98,19 21.522,20 23.05,21 7.648,22 4.648,23 0.07,24 6,25 4.407,26 10.704,27 12.13,28 9.735,29 5.654,30 2.111,31 2.111,32 11.617,33 7.111,34 10.28,35 12.08,36 13.908,37 8.319,38 15.756,39 3.85,40 5.965,41 2.608,42 0.107,43 9.613,44 6.606,45 3.284,47 0.559,48 1.52,49 5,50 2.776,51 7.705,52 61.202,53 10.046,54 0.625,55 3.349,56 3.472,57 3.189,58 3.002,59 4.31,60 2.949,61 3.898,62 4.064,63 3.644,64 3.449,65 4.809,66 3.363,67 4.136,68 4.351,69 3.811,70 3.556,71 4.985,72 3.42,73 4.084,74 4.314,75 3.653,76 3.455,77 4.886,78 3.268,79 3.818,80 4.081,81 3.195,82 3.094,83 4.527,84 2.867,85 3.567,86 3.83,87 3.113,88 2.794,89 4.337,90 2.5,91 2.954,92 3.299,93 1.212,94 1.897,95 3.489,96 1.472,97 1.515,98 1.922,99 0.028,100 0.457,101 1.609,102 0.245,103 0.026,104 0.366,105 3.066,106 2.128,107 3.063,108 2.819,109 0.057,110 0.621,111 7.534,112 4.038,113 6.677,114 5.298,115 0.142,116 0.747,117 18.628,118 5.87,119 11.754,120 7.53,121 0.111,122 0.685,123 21.846,124 6.052,125 6.337}
{0 CHEMBL778,1 9.501,2 8.635,3 3.466,4 9.007,5 7.771,6 3.945,7 7.146,8 4.058,9 2.852,10 5.614,11 0.813,12 5.29,13 5.921,14 4.046,15 4.046,16 15.539,17 16.982,18 18.306,19 19.722,20 21.074,21 7.046,22 4.046,23 0.078,24 2,25 4.111,26 10.366,27 11.778,28 9.532,29 5.011,30 2.032,31 2.032,32 11.232,33 6.94,34 10.181,35 11.966,36 13.777,37 8.165,38 15.605,39 3.555,40 5.114,42 0.123,43 9.394,44 5.497,45 3.348,46 1.038,47 0.519,48 1.273,49 5.733,50 3.134,51 9.821,52 62.983,53 6.462,54 0.688,55 3.492,56 3.633,57 2.946,58 3.066,59 4.513,60 3.005,61 4.005,62 4.215,63 3.257,64 3.443,65 4.901,66 3.354,67 4.159,68 4.367,69 3.247,70 3.571,71 5.017,72 3.444,73 4.311,74 4.536,75 3.181,76 3.621,77 5.162,78 3.456,79 4.447,80 4.753,81 2.99,82 3.527,83 5.176,84 3.313,85 4.212,86 4.543,87 2.689,88 3.195,89 4.939,90 2.978,91 3.809,92 4.153,93 2.027,94 2.698,95 4.504,96 2.449,97 3.159,98 3.538,99 0.766,100 1.908,101 3.664,102 1.556,103 0.037,104 0.441,105 7.153,106 2.891,107 7.551,108 4.199,109 0.1,110 0.691,111 12.222,112 4.859,113 11.573,114 7.061,115 0.075,116 0.784,117 14.141,118 5.937,119 12.326,120 8.559,121 0.093,122 0.889,123 16.589,124 6.715,125 8.301}
{0 CHEMBL85,1 10.467,2 9.568,3 4.836,4 9.757,5 8.675,6 4.011,7 7.953,8 4.131,9 3.306,10 6.725,11 1.938,12 6.518,13 6.712,14 4.515,15 4.515,16 16.789,17 18.296,18 19.755,19 21.253,20 22.732,21 7.515,22 4.515,23 0.071,24 7,25 4.902,26 11.361,27 12.784,28 10.454,29 5.938,30 2.953,31 2.953,32 12.261,33 7.786,34 10.985,35 12.762,36 14.566,37 8.962,38 16.389,39 4.522,40 6.244,41 1.432,42 0.112,43 10.232,44 6.794,45 3.827,46 1.092,47 0.585,48 1.58,49 13.167,50 3.318,51 11.006,52 114.547,53 7.202,54 0.294,55 4.151,56 4.273,57 3.703,58 3.674,59 5.17,60 3.652,61 4.76,62 4.95,63 4.094,64 4.114,65 5.724,66 4.068,67 5.064,68 5.296,69 4.168,70 4.278,71 5.994,72 4.203,73 5.131,74 5.368,75 4.092,76 4.255,77 6.132,78 4.157,79 5.083,80 5.339,81 3.903,82 4.159,83 6.021,84 4.035,85 4.937,86 5.189,87 3.766,88 4.085,89 5.713,90 3.938,91 4.944,92 5.222,93 3.701,94 3.996,95 5.776,96 3.854,97 4.862,98 5.151,99 3.555,100 3.858,101 5.722,102 3.724,103 0.064,104 0.927,105 12.374,106 5.461,107 7.031,108 7.304,109 0.223,110 1.559,111 24.941,112 9.315,113 20.796,114 13.071,115 0.366,116 1.938,117 35.976,118 12.183,119 40.767,120 17.426,121 0.644,122 1.897,123 39.453,124 12.69,125 7.602}
