{
  "data_features": {
    "feature": [
      {
        "data_type": "nominal",
        "index": "0",
        "is_ignore": "false",
        "is_row_identifier": "true",
        "is_target": "false",
        "name": "molecule_id",
        "nominal_value": [
          "CHEMBL1790763",
          "CHEMBL262125",
          "CHEMBL262692",
          "CHEMBL265987",
          "CHEMBL278217",
          "CHEMBL279778",
          "CHEMBL280980",
          "CHEMBL281017",
          "CHEMBL281082",
          "CHEMBL281318",
          "CHEMBL282175",
          "CHEMBL282645",
          "CHEMBL282646",
          "CHEMBL284183",
          "CHEMBL284374",
          "CHEMBL284975",
          "CHEMBL284976",
          "CHEMBL285556",
          "CHEMBL285586",
          "CHEMBL285719",
          "CHEMBL285746",
          "CHEMBL285995",
          "CHEMBL286475",
          "CHEMBL286835",
          "CHEMBL286907",
          "CHEMBL286908",
          "CHEMBL287295",
          "CHEMBL289310",
          "CHEMBL290122",
          "CHEMBL29331",
          "CHEMBL293762",
          "CHEMBL29888",
          "CHEMBL30",
          "CHEMBL30195",
          "CHEMBL30430",
          "CHEMBL30656",
          "CHEMBL30701",
          "CHEMBL30821",
          "CHEMBL30917",
          "CHEMBL31090",
          "CHEMBL31671",
          "CHEMBL31726",
          "CHEMBL318221",
          "CHEMBL328512",
          "CHEMBL330142",
          "CHEMBL33398",
          "CHEMBL33412",
          "CHEMBL33698",
          "CHEMBL33743",
          "CHEMBL33819",
          "CHEMBL406844",
          "CHEMBL432006",
          "CHEMBL432671",
          "CHEMBL44345",
          "CHEMBL60686",
          "CHEMBL91752",
          "CHEMBL91765",
          "CHEMBL94448",
          "CHEMBL94902",
          "CHEMBL94917",
          "CHEMBL95063",
          "CHEMBL96530",
          "CHEMBL96681",
          "CHEMBL96738",
          "CHEMBL96946"
        ],
        "number_of_missing_values": "0"
      },
      {
        "data_type": "numeric",
        "index": "1",
        "is_ignore": "false",
        "is_row_identifier": "false",
        "is_target": "false",
        "name": "nO",
        "number_of_missing_values": "0"
      },
      {
        "data_type": "numeric",
        "index": "2",
        "is_ignore": "false",
        "is_row_identifier": "false",
        "is_target": "false",
        "name": "Mp",
        "number_of_missing_values": "0"
      },
      {
        "data_type": "numeric",
        "index": "3",
        "is_ignore": "false",
        "is_row_identifier": "false",
        "is_target": "false",
        "name": "nN",
        "number_of_missing_values": "0"
      },
      {
        "data_type": "numeric",
        "index": "4",
        "is_ignore": "false",
        "is_row_identifier": "false",
        "is_target": "false",
        "name": "C.",
        "number_of_missing_values": "0"
      },
      {
        "data_type": "numeric",
        "index": "5",
        "is_ignore": "false",
        "is_row_identifier": "false",
        "is_target": "false",
        "name": "Me",
        "number_of_missing_values": "0"
      },
      {
        "data_type": "numeric",
        "index": "6",
        "is_ignore": "false",
        "is_row_identifier": "false",
        "is_target": "false",
        "name": "Se",
        "number_of_missing_values": "0"
      },
      {
        "data_type": "numeric",
        "index": "7",
        "is_ignore": "false",
        "is_row_identifier": "false",
        "is_target": "true",
        "name": "pXC50",
        "number_of_missing_values": "0"
      }
    ]
  }
}