{
  "data_features": {
    "feature": [
      {
        "data_type": "nominal",
        "index": "0",
        "is_ignore": "false",
        "is_row_identifier": "true",
        "is_target": "false",
        "name": "molecule_id",
        "nominal_value": [
          "CHEMBL10",
          "CHEMBL101253",
          "CHEMBL101311",
          "CHEMBL103667",
          "CHEMBL105442",
          "CHEMBL1081312",
          "CHEMBL1082152",
          "CHEMBL1083150",
          "CHEMBL1083151",
          "CHEMBL1083152",
          "CHEMBL1083484",
          "CHEMBL1083785",
          "CHEMBL1083786",
          "CHEMBL1084454",
          "CHEMBL1084546",
          "CHEMBL1084629",
          "CHEMBL1084630",
          "CHEMBL1084715",
          "CHEMBL1084969",
          "CHEMBL1085626",
          "CHEMBL1086088",
          "CHEMBL1164180",
          "CHEMBL1173655",
          "CHEMBL117697",
          "CHEMBL119385",
          "CHEMBL1230020",
          "CHEMBL1233887",
          "CHEMBL1236107",
          "CHEMBL1240703",
          "CHEMBL1241674",
          "CHEMBL124660",
          "CHEMBL1287853",
          "CHEMBL1289926",
          "CHEMBL1336",
          "CHEMBL1421",
          "CHEMBL1421720",
          "CHEMBL143703",
          "CHEMBL14762",
          "CHEMBL1614701",
          "CHEMBL162",
          "CHEMBL1721885",
          "CHEMBL1727312",
          "CHEMBL1789941",
          "CHEMBL180022",
          "CHEMBL1823556",
          "CHEMBL1825138",
          "CHEMBL1870106",
          "CHEMBL1879463",
          "CHEMBL189963",
          "CHEMBL1908391",
          "CHEMBL1908392",
          "CHEMBL1908393",
          "CHEMBL1908394",
          "CHEMBL1908395",
          "CHEMBL1908396",
          "CHEMBL1908397",
          "CHEMBL191003",
          "CHEMBL1922219",
          "CHEMBL1949855",
          "CHEMBL1958401",
          "CHEMBL1964340",
          "CHEMBL1964382",
          "CHEMBL1964441",
          "CHEMBL1964718",
          "CHEMBL1964902",
          "CHEMBL1964948",
          "CHEMBL1965033",
          "CHEMBL1965169",
          "CHEMBL1965170",
          "CHEMBL1965387",
          "CHEMBL1965660",
          "CHEMBL1965683",
          "CHEMBL1965702",
          "CHEMBL1965838",
          "CHEMBL1966175",
          "CHEMBL1966204",
          "CHEMBL1967211",
          "CHEMBL1967252",
          "CHEMBL1967336",
          "CHEMBL1967513",
          "CHEMBL1967538",
          "CHEMBL1967662",
          "CHEMBL1967719",
          "CHEMBL1967878",
          "CHEMBL1967992",
          "CHEMBL1967998",
          "CHEMBL1968130",
          "CHEMBL1968394",
          "CHEMBL1968515",
          "CHEMBL1968705",
          "CHEMBL1968868",
          "CHEMBL1968930",
          "CHEMBL1969151",
          "CHEMBL1969156",
          "CHEMBL1969588",
          "CHEMBL1969664",
          "CHEMBL1969942",
          "CHEMBL1970290",
          "CHEMBL1970340",
          "CHEMBL1970352",
          "CHEMBL1970873",
          "CHEMBL1971172",
          "CHEMBL1971227",
          "CHEMBL1971289",
          "CHEMBL1971519",
          "CHEMBL1971534",
          "CHEMBL1971606",
          "CHEMBL1971943",
          "CHEMBL1972220",
          "CHEMBL1972290",
          "CHEMBL1972339",
          "CHEMBL1972355",
          "CHEMBL1972454",
          "CHEMBL1972583",
          "CHEMBL1972934",
          "CHEMBL1972988",
          "CHEMBL1973013",
          "CHEMBL1973016",
          "CHEMBL1973138",
          "CHEMBL1973359",
          "CHEMBL1973399",
          "CHEMBL1973516",
          "CHEMBL1973793",
          "CHEMBL1973795",
          "CHEMBL1973868",
          "CHEMBL1973961",
          "CHEMBL1974328",
          "CHEMBL1974480",
          "CHEMBL1974617",
          "CHEMBL1974870",
          "CHEMBL1974875",
          "CHEMBL1975121",
          "CHEMBL1975212",
          "CHEMBL1975503",
          "CHEMBL1975903",
          "CHEMBL1975921",
          "CHEMBL1975923",
          "CHEMBL1975927",
          "CHEMBL1976196",
          "CHEMBL1976290",
          "CHEMBL1976376",
          "CHEMBL1976420",
          "CHEMBL1976872",
          "CHEMBL1976936",
          "CHEMBL1977128",
          "CHEMBL1977134",
          "CHEMBL1977138",
          "CHEMBL1977223",
          "CHEMBL1977749",
          "CHEMBL1977814",
          "CHEMBL1977931",
          "CHEMBL1978166",
          "CHEMBL1978167",
          "CHEMBL1978195",
          "CHEMBL1978271",
          "CHEMBL1978371",
          "CHEMBL1978448",
          "CHEMBL1978562",
          "CHEMBL1978567",
          "CHEMBL1979690",
          "CHEMBL1979773",
          "CHEMBL1979933",
          "CHEMBL1980003",
          "CHEMBL1980178",
          "CHEMBL1980246",
          "CHEMBL1980253",
          "CHEMBL1980297",
          "CHEMBL1980329",
          "CHEMBL1980376",
          "CHEMBL1980391",
          "CHEMBL1980407",
          "CHEMBL1980435",
          "CHEMBL1980562",
          "CHEMBL1980671",
          "CHEMBL1980763",
          "CHEMBL1980995",
          "CHEMBL1981047",
          "CHEMBL1981079",
          "CHEMBL1981133",
          "CHEMBL1981215",
          "CHEMBL1981492",
          "CHEMBL1981744",
          "CHEMBL1981792",
          "CHEMBL1982271",
          "CHEMBL1982413",
          "CHEMBL1982660",
          "CHEMBL1982700",
          "CHEMBL1982711",
          "CHEMBL1983070",
          "CHEMBL1983111",
          "CHEMBL1983268",
          "CHEMBL1983348",
          "CHEMBL1983393",
          "CHEMBL1983573",
          "CHEMBL1983575",
          "CHEMBL1983589",
          "CHEMBL1983595",
          "CHEMBL1983630",
          "CHEMBL1983640",
          "CHEMBL1983715",
          "CHEMBL1983923",
          "CHEMBL1983945",
          "CHEMBL1983980",
          "CHEMBL1984038",
          "CHEMBL1984236",
          "CHEMBL1984296",
          "CHEMBL1984402",
          "CHEMBL1984548",
          "CHEMBL1984686",
          "CHEMBL1984760",
          "CHEMBL1984842",
          "CHEMBL1984847",
          "CHEMBL1985042",
          "CHEMBL1985206",
          "CHEMBL1985367",
          "CHEMBL1985681",
          "CHEMBL1985723",
          "CHEMBL1986143",
          "CHEMBL1986177",
          "CHEMBL1986265",
          "CHEMBL1986499",
          "CHEMBL1986590",
          "CHEMBL1986666",
          "CHEMBL1986684",
          "CHEMBL1986722",
          "CHEMBL1986756",
          "CHEMBL1986855",
          "CHEMBL1986899",
          "CHEMBL1986943",
          "CHEMBL1987073",
          "CHEMBL1987261",
          "CHEMBL1987430",
          "CHEMBL1987448",
          "CHEMBL1987535",
          "CHEMBL1987815",
          "CHEMBL1987948",
          "CHEMBL1987998",
          "CHEMBL1988141",
          "CHEMBL1988437",
          "CHEMBL1988581",
          "CHEMBL1988622",
          "CHEMBL1988692",
          "CHEMBL1988805",
          "CHEMBL1989043",
          "CHEMBL1989267",
          "CHEMBL1989423",
          "CHEMBL1989471",
          "CHEMBL1989708",
          "CHEMBL1990162",
          "CHEMBL1990254",
          "CHEMBL1990496",
          "CHEMBL1990590",
          "CHEMBL1990885",
          "CHEMBL1991063",
          "CHEMBL1991078",
          "CHEMBL1991410",
          "CHEMBL1991674",
          "CHEMBL1991678",
          "CHEMBL1991734",
          "CHEMBL1991782",
          "CHEMBL1991867",
          "CHEMBL1992042",
          "CHEMBL1992073",
          "CHEMBL1992220",
          "CHEMBL1992231",
          "CHEMBL1992363",
          "CHEMBL1992371",
          "CHEMBL1992581",
          "CHEMBL1992673",
          "CHEMBL1992723",
          "CHEMBL1992937",
          "CHEMBL1993335",
          "CHEMBL1993374",
          "CHEMBL1993413",
          "CHEMBL1993661",
          "CHEMBL1993877",
          "CHEMBL1993904",
          "CHEMBL1994159",
          "CHEMBL1994438",
          "CHEMBL1994526",
          "CHEMBL1994555",
          "CHEMBL1994669",
          "CHEMBL1994724",
          "CHEMBL1994977",
          "CHEMBL1995172",
          "CHEMBL1995211",
          "CHEMBL1995712",
          "CHEMBL1995740",
          "CHEMBL1995765",
          "CHEMBL1995811",
          "CHEMBL1995813",
          "CHEMBL1995916",
          "CHEMBL1996048",
          "CHEMBL1996176",
          "CHEMBL1996345",
          "CHEMBL1996500",
          "CHEMBL1996510",
          "CHEMBL1996576",
          "CHEMBL1996646",
          "CHEMBL1996649",
          "CHEMBL1996702",
          "CHEMBL1996837",
          "CHEMBL1996980",
          "CHEMBL1997007",
          "CHEMBL1997041",
          "CHEMBL1997119",
          "CHEMBL1997197",
          "CHEMBL1997335",
          "CHEMBL1997554",
          "CHEMBL1997846",
          "CHEMBL1997892",
          "CHEMBL1998110",
          "CHEMBL1998432",
          "CHEMBL1998470",
          "CHEMBL1999120",
          "CHEMBL1999414",
          "CHEMBL1999484",
          "CHEMBL2000029",
          "CHEMBL2000568",
          "CHEMBL2000724",
          "CHEMBL2000879",
          "CHEMBL2001019",
          "CHEMBL2001539",
          "CHEMBL2001584",
          "CHEMBL2001613",
          "CHEMBL2001641",
          "CHEMBL2001923",
          "CHEMBL2001987",
          "CHEMBL2002099",
          "CHEMBL2002105",
          "CHEMBL2002450",
          "CHEMBL2002586",
          "CHEMBL2002599",
          "CHEMBL2002613",
          "CHEMBL2002649",
          "CHEMBL2002690",
          "CHEMBL2002723",
          "CHEMBL2002992",
          "CHEMBL2003119",
          "CHEMBL2003229",
          "CHEMBL2003514",
          "CHEMBL2003638",
          "CHEMBL2003785",
          "CHEMBL2003856",
          "CHEMBL2004025",
          "CHEMBL2004118",
          "CHEMBL2004159",
          "CHEMBL2004290",
          "CHEMBL2004438",
          "CHEMBL2004515",
          "CHEMBL2004637",
          "CHEMBL2005216",
          "CHEMBL2005449",
          "CHEMBL2005478",
          "CHEMBL2005509",
          "CHEMBL2005699",
          "CHEMBL2005718",
          "CHEMBL2005792",
          "CHEMBL2006299",
          "CHEMBL2006439",
          "CHEMBL2006450",
          "CHEMBL2006456",
          "CHEMBL2006564",
          "CHEMBL2006674",
          "CHEMBL2006765",
          "CHEMBL2007097",
          "CHEMBL2007124",
          "CHEMBL2007266",
          "CHEMBL2007375",
          "CHEMBL2007421",
          "CHEMBL2007479",
          "CHEMBL2007559",
          "CHEMBL2007574",
          "CHEMBL202721",
          "CHEMBL2035185",
          "CHEMBL210540",
          "CHEMBL21156",
          "CHEMBL212049",
          "CHEMBL215152",
          "CHEMBL2205766",
          "CHEMBL221959",
          "CHEMBL223360",
          "CHEMBL225519",
          "CHEMBL230011",
          "CHEMBL2309006",
          "CHEMBL2309609",
          "CHEMBL234085",
          "CHEMBL235157",
          "CHEMBL242865",
          "CHEMBL243298",
          "CHEMBL243664",
          "CHEMBL244378",
          "CHEMBL24828",
          "CHEMBL248757",
          "CHEMBL249697",
          "CHEMBL253969",
          "CHEMBL255863",
          "CHEMBL258721",
          "CHEMBL259084",
          "CHEMBL261849",
          "CHEMBL262623",
          "CHEMBL267071",
          "CHEMBL278041",
          "CHEMBL288441",
          "CHEMBL289959",
          "CHEMBL296468",
          "CHEMBL297570",
          "CHEMBL298445",
          "CHEMBL300138",
          "CHEMBL31965",
          "CHEMBL354676",
          "CHEMBL360847",
          "CHEMBL377300",
          "CHEMBL379218",
          "CHEMBL379975",
          "CHEMBL38380",
          "CHEMBL384304",
          "CHEMBL386051",
          "CHEMBL396523",
          "CHEMBL398951",
          "CHEMBL402272",
          "CHEMBL406845",
          "CHEMBL415049",
          "CHEMBL422897",
          "CHEMBL424696",
          "CHEMBL427045",
          "CHEMBL428690",
          "CHEMBL440084",
          "CHEMBL445340",
          "CHEMBL445813",
          "CHEMBL450786",
          "CHEMBL451401",
          "CHEMBL451570",
          "CHEMBL452601",
          "CHEMBL452602",
          "CHEMBL454645",
          "CHEMBL454646",
          "CHEMBL455194",
          "CHEMBL455195",
          "CHEMBL455450",
          "CHEMBL458997",
          "CHEMBL461876",
          "CHEMBL464552",
          "CHEMBL46817",
          "CHEMBL475251",
          "CHEMBL477772",
          "CHEMBL480442",
          "CHEMBL482193",
          "CHEMBL482211",
          "CHEMBL482538",
          "CHEMBL482767",
          "CHEMBL482967",
          "CHEMBL483158",
          "CHEMBL483321",
          "CHEMBL484990",
          "CHEMBL489833",
          "CHEMBL49120",
          "CHEMBL491473",
          "CHEMBL491647",
          "CHEMBL494089",
          "CHEMBL495557",
          "CHEMBL495558",
          "CHEMBL495754",
          "CHEMBL496567",
          "CHEMBL496568",
          "CHEMBL496785",
          "CHEMBL497995",
          "CHEMBL498200",
          "CHEMBL498738",
          "CHEMBL505474",
          "CHEMBL507536",
          "CHEMBL508506",
          "CHEMBL50894",
          "CHEMBL509012",
          "CHEMBL509032",
          "CHEMBL509772",
          "CHEMBL510566",
          "CHEMBL513909",
          "CHEMBL521851",
          "CHEMBL522590",
          "CHEMBL522760",
          "CHEMBL522892",
          "CHEMBL52387",
          "CHEMBL524266",
          "CHEMBL524629",
          "CHEMBL525012",
          "CHEMBL525191",
          "CHEMBL526092",
          "CHEMBL535",
          "CHEMBL546797",
          "CHEMBL550418",
          "CHEMBL553",
          "CHEMBL554",
          "CHEMBL558752",
          "CHEMBL565612",
          "CHEMBL572878",
          "CHEMBL572881",
          "CHEMBL573339",
          "CHEMBL574738",
          "CHEMBL576982",
          "CHEMBL592030",
          "CHEMBL601719",
          "CHEMBL607707",
          "CHEMBL608154",
          "CHEMBL91829",
          "CHEMBL939",
          "CHEMBL941"
        ],
        "number_of_missing_values": "0"
      },
      {
        "data_type": "numeric",
        "index": "1",
        "is_ignore": "false",
        "is_row_identifier": "false",
        "is_target": "false",
        "name": "X1v",
        "number_of_missing_values": "0"
      },
      {
        "data_type": "numeric",
        "index": "2",
        "is_ignore": "false",
        "is_row_identifier": "false",
        "is_target": "false",
        "name": "SpMax3_Bh.p.",
        "number_of_missing_values": "0"
      },
      {
        "data_type": "numeric",
        "index": "3",
        "is_ignore": "false",
        "is_row_identifier": "false",
        "is_target": "false",
        "name": "Eig10_EA.ri.",
        "number_of_missing_values": "0"
      },
      {
        "data_type": "numeric",
        "index": "4",
        "is_ignore": "false",
        "is_row_identifier": "false",
        "is_target": "false",
        "name": "SpMax3_Bh.v.",
        "number_of_missing_values": "0"
      },
      {
        "data_type": "numeric",
        "index": "5",
        "is_ignore": "false",
        "is_row_identifier": "false",
        "is_target": "false",
        "name": "Psi_i_1",
        "number_of_missing_values": "0"
      },
      {
        "data_type": "numeric",
        "index": "6",
        "is_ignore": "false",
        "is_row_identifier": "false",
        "is_target": "false",
        "name": "X2sol",
        "number_of_missing_values": "0"
      },
      {
        "data_type": "numeric",
        "index": "7",
        "is_ignore": "false",
        "is_row_identifier": "false",
        "is_target": "false",
        "name": "ATS7m",
        "number_of_missing_values": "0"
      },
      {
        "data_type": "numeric",
        "index": "8",
        "is_ignore": "false",
        "is_row_identifier": "false",
        "is_target": "false",
        "name": "Eig05_EA.ed.",
        "number_of_missing_values": "0"
      },
      {
        "data_type": "numeric",
        "index": "9",
        "is_ignore": "false",
        "is_row_identifier": "false",
        "is_target": "false",
        "name": "SM14_AEA.dm.",
        "number_of_missing_values": "0"
      },
      {
        "data_type": "numeric",
        "index": "10",
        "is_ignore": "false",
        "is_row_identifier": "false",
        "is_target": "false",
        "name": "ATS7v",
        "number_of_missing_values": "0"
      },
      {
        "data_type": "numeric",
        "index": "11",
        "is_ignore": "false",
        "is_row_identifier": "false",
        "is_target": "false",
        "name": "ATS6m",
        "number_of_missing_values": "0"
      },
      {
        "data_type": "numeric",
        "index": "12",
        "is_ignore": "false",
        "is_row_identifier": "false",
        "is_target": "false",
        "name": "X1Kup",
        "number_of_missing_values": "0"
      },
      {
        "data_type": "numeric",
        "index": "13",
        "is_ignore": "false",
        "is_row_identifier": "false",
        "is_target": "false",
        "name": "SpMin3_Bh.e.",
        "number_of_missing_values": "0"
      },
      {
        "data_type": "numeric",
        "index": "14",
        "is_ignore": "false",
        "is_row_identifier": "false",
        "is_target": "false",
        "name": "X1Per",
        "number_of_missing_values": "0"
      },
      {
        "data_type": "numeric",
        "index": "15",
        "is_ignore": "false",
        "is_row_identifier": "false",
        "is_target": "false",
        "name": "SpMax4_Bh.m.",
        "number_of_missing_values": "0"
      },
      {
        "data_type": "numeric",
        "index": "16",
        "is_ignore": "false",
        "is_row_identifier": "false",
        "is_target": "false",
        "name": "Eig10_EA",
        "number_of_missing_values": "0"
      },
      {
        "data_type": "numeric",
        "index": "17",
        "is_ignore": "false",
        "is_row_identifier": "false",
        "is_target": "false",
        "name": "Eig10_EA.bo.",
        "number_of_missing_values": "0"
      },
      {
        "data_type": "numeric",
        "index": "18",
        "is_ignore": "false",
        "is_row_identifier": "false",
        "is_target": "false",
        "name": "SM04_AEA.dm.",
        "number_of_missing_values": "0"
      },
      {
        "data_type": "numeric",
        "index": "19",
        "is_ignore": "false",
        "is_row_identifier": "false",
        "is_target": "false",
        "name": "ATS2v",
        "number_of_missing_values": "0"
      },
      {
        "data_type": "numeric",
        "index": "20",
        "is_ignore": "false",
        "is_row_identifier": "false",
        "is_target": "false",
        "name": "X1MulPer",
        "number_of_missing_values": "0"
      },
      {
        "data_type": "numeric",
        "index": "21",
        "is_ignore": "false",
        "is_row_identifier": "false",
        "is_target": "false",
        "name": "SpMax7_Bh.v.",
        "number_of_missing_values": "0"
      },
      {
        "data_type": "numeric",
        "index": "22",
        "is_ignore": "false",
        "is_row_identifier": "false",
        "is_target": "false",
        "name": "X3sol",
        "number_of_missing_values": "0"
      },
      {
        "data_type": "numeric",
        "index": "23",
        "is_ignore": "false",
        "is_row_identifier": "false",
        "is_target": "false",
        "name": "Chi1_AEA.bo.",
        "number_of_missing_values": "0"
      },
      {
        "data_type": "numeric",
        "index": "24",
        "is_ignore": "false",
        "is_row_identifier": "false",
        "is_target": "false",
        "name": "Chi1_AEA.dm.",
        "number_of_missing_values": "0"
      },
      {
        "data_type": "numeric",
        "index": "25",
        "is_ignore": "false",
        "is_row_identifier": "false",
        "is_target": "false",
        "name": "Chi1_AEA.ed.",
        "number_of_missing_values": "0"
      },
      {
        "data_type": "numeric",
        "index": "26",
        "is_ignore": "false",
        "is_row_identifier": "false",
        "is_target": "false",
        "name": "Chi1_AEA.ri.",
        "number_of_missing_values": "0"
      },
      {
        "data_type": "numeric",
        "index": "27",
        "is_ignore": "false",
        "is_row_identifier": "false",
        "is_target": "false",
        "name": "Chi1_EA",
        "number_of_missing_values": "0"
      },
      {
        "data_type": "numeric",
        "index": "28",
        "is_ignore": "false",
        "is_row_identifier": "false",
        "is_target": "false",
        "name": "ATS1p",
        "number_of_missing_values": "0"
      },
      {
        "data_type": "numeric",
        "index": "29",
        "is_ignore": "false",
        "is_row_identifier": "false",
        "is_target": "false",
        "name": "SpAD_AEA.bo.",
        "number_of_missing_values": "0"
      },
      {
        "data_type": "numeric",
        "index": "30",
        "is_ignore": "false",
        "is_row_identifier": "false",
        "is_target": "false",
        "name": "SpMax3_Bh.e.",
        "number_of_missing_values": "0"
      },
      {
        "data_type": "numeric",
        "index": "31",
        "is_ignore": "false",
        "is_row_identifier": "false",
        "is_target": "false",
        "name": "ATS2p",
        "number_of_missing_values": "0"
      },
      {
        "data_type": "numeric",
        "index": "32",
        "is_ignore": "false",
        "is_row_identifier": "false",
        "is_target": "false",
        "name": "X2v",
        "number_of_missing_values": "0"
      },
      {
        "data_type": "numeric",
        "index": "33",
        "is_ignore": "false",
        "is_row_identifier": "false",
        "is_target": "false",
        "name": "MWC02",
        "number_of_missing_values": "0"
      },
      {
        "data_type": "numeric",
        "index": "34",
        "is_ignore": "false",
        "is_row_identifier": "false",
        "is_target": "false",
        "name": "SpAD_AEA.ri.",
        "number_of_missing_values": "0"
      },
      {
        "data_type": "numeric",
        "index": "35",
        "is_ignore": "false",
        "is_row_identifier": "false",
        "is_target": "false",
        "name": "SpAD_EA",
        "number_of_missing_values": "0"
      },
      {
        "data_type": "numeric",
        "index": "36",
        "is_ignore": "false",
        "is_row_identifier": "false",
        "is_target": "false",
        "name": "ZM1",
        "number_of_missing_values": "0"
      },
      {
        "data_type": "numeric",
        "index": "37",
        "is_ignore": "false",
        "is_row_identifier": "false",
        "is_target": "false",
        "name": "X1Mad",
        "number_of_missing_values": "0"
      },
      {
        "data_type": "numeric",
        "index": "38",
        "is_ignore": "false",
        "is_row_identifier": "false",
        "is_target": "false",
        "name": "SpMax3_Bh.m.",
        "number_of_missing_values": "0"
      },
      {
        "data_type": "numeric",
        "index": "39",
        "is_ignore": "false",
        "is_row_identifier": "false",
        "is_target": "false",
        "name": "Eig06_EA",
        "number_of_missing_values": "0"
      },
      {
        "data_type": "numeric",
        "index": "40",
        "is_ignore": "false",
        "is_row_identifier": "false",
        "is_target": "false",
        "name": "SM14_AEA.bo.",
        "number_of_missing_values": "0"
      },
      {
        "data_type": "numeric",
        "index": "41",
        "is_ignore": "false",
        "is_row_identifier": "false",
        "is_target": "false",
        "name": "MPC01",
        "number_of_missing_values": "0"
      },
      {
        "data_type": "numeric",
        "index": "42",
        "is_ignore": "false",
        "is_row_identifier": "false",
        "is_target": "false",
        "name": "MWC01",
        "number_of_missing_values": "0"
      },
      {
        "data_type": "numeric",
        "index": "43",
        "is_ignore": "false",
        "is_row_identifier": "false",
        "is_target": "false",
        "name": "nBO",
        "number_of_missing_values": "0"
      },
      {
        "data_type": "numeric",
        "index": "44",
        "is_ignore": "false",
        "is_row_identifier": "false",
        "is_target": "false",
        "name": "SRW02",
        "number_of_missing_values": "0"
      },
      {
        "data_type": "numeric",
        "index": "45",
        "is_ignore": "false",
        "is_row_identifier": "false",
        "is_target": "false",
        "name": "Eig10_AEA.ri.",
        "number_of_missing_values": "0"
      },
      {
        "data_type": "numeric",
        "index": "46",
        "is_ignore": "false",
        "is_row_identifier": "false",
        "is_target": "false",
        "name": "Eig12_EA.bo.",
        "number_of_missing_values": "0"
      },
      {
        "data_type": "numeric",
        "index": "47",
        "is_ignore": "false",
        "is_row_identifier": "false",
        "is_target": "false",
        "name": "Eig10_AEA.bo.",
        "number_of_missing_values": "0"
      },
      {
        "data_type": "numeric",
        "index": "48",
        "is_ignore": "false",
        "is_row_identifier": "false",
        "is_target": "false",
        "name": "SM02_AEA.bo.",
        "number_of_missing_values": "0"
      },
      {
        "data_type": "numeric",
        "index": "49",
        "is_ignore": "false",
        "is_row_identifier": "false",
        "is_target": "false",
        "name": "Eta_L",
        "number_of_missing_values": "0"
      },
      {
        "data_type": "numeric",
        "index": "50",
        "is_ignore": "false",
        "is_row_identifier": "false",
        "is_target": "false",
        "name": "ATS8p",
        "number_of_missing_values": "0"
      },
      {
        "data_type": "numeric",
        "index": "51",
        "is_ignore": "false",
        "is_row_identifier": "false",
        "is_target": "false",
        "name": "SRW04",
        "number_of_missing_values": "0"
      },
      {
        "data_type": "numeric",
        "index": "52",
        "is_ignore": "false",
        "is_row_identifier": "false",
        "is_target": "false",
        "name": "SpMax7_Bh.i.",
        "number_of_missing_values": "0"
      },
      {
        "data_type": "numeric",
        "index": "53",
        "is_ignore": "false",
        "is_row_identifier": "false",
        "is_target": "false",
        "name": "ATS8v",
        "number_of_missing_values": "0"
      },
      {
        "data_type": "numeric",
        "index": "54",
        "is_ignore": "false",
        "is_row_identifier": "false",
        "is_target": "false",
        "name": "X3",
        "number_of_missing_values": "0"
      },
      {
        "data_type": "numeric",
        "index": "55",
        "is_ignore": "false",
        "is_row_identifier": "false",
        "is_target": "false",
        "name": "ATS8e",
        "number_of_missing_values": "0"
      },
      {
        "data_type": "numeric",
        "index": "56",
        "is_ignore": "false",
        "is_row_identifier": "false",
        "is_target": "false",
        "name": "SpMin3_Bh.v.",
        "number_of_missing_values": "0"
      },
      {
        "data_type": "numeric",
        "index": "57",
        "is_ignore": "false",
        "is_row_identifier": "false",
        "is_target": "false",
        "name": "ATS6v",
        "number_of_missing_values": "0"
      },
      {
        "data_type": "numeric",
        "index": "58",
        "is_ignore": "false",
        "is_row_identifier": "false",
        "is_target": "false",
        "name": "SpMax3_Bh.i.",
        "number_of_missing_values": "0"
      },
      {
        "data_type": "numeric",
        "index": "59",
        "is_ignore": "false",
        "is_row_identifier": "false",
        "is_target": "false",
        "name": "SpMin3_Bh.m.",
        "number_of_missing_values": "0"
      },
      {
        "data_type": "numeric",
        "index": "60",
        "is_ignore": "false",
        "is_row_identifier": "false",
        "is_target": "false",
        "name": "ATS8i",
        "number_of_missing_values": "0"
      },
      {
        "data_type": "numeric",
        "index": "61",
        "is_ignore": "false",
        "is_row_identifier": "false",
        "is_target": "false",
        "name": "Eig12_EA.ri.",
        "number_of_missing_values": "0"
      },
      {
        "data_type": "numeric",
        "index": "62",
        "is_ignore": "false",
        "is_row_identifier": "false",
        "is_target": "false",
        "name": "Eig05_AEA.bo.",
        "number_of_missing_values": "0"
      },
      {
        "data_type": "numeric",
        "index": "63",
        "is_ignore": "false",
        "is_row_identifier": "false",
        "is_target": "false",
        "name": "SpAD_EA.ri.",
        "number_of_missing_values": "0"
      },
      {
        "data_type": "numeric",
        "index": "64",
        "is_ignore": "false",
        "is_row_identifier": "false",
        "is_target": "false",
        "name": "Eig14_AEA.ed.",
        "number_of_missing_values": "0"
      },
      {
        "data_type": "numeric",
        "index": "65",
        "is_ignore": "false",
        "is_row_identifier": "false",
        "is_target": "false",
        "name": "ZM2Mad",
        "number_of_missing_values": "0"
      },
      {
        "data_type": "numeric",
        "index": "66",
        "is_ignore": "false",
        "is_row_identifier": "false",
        "is_target": "false",
        "name": "ATS3i",
        "number_of_missing_values": "0"
      },
      {
        "data_type": "numeric",
        "index": "67",
        "is_ignore": "false",
        "is_row_identifier": "false",
        "is_target": "false",
        "name": "Eig12_EA.ed.",
        "number_of_missing_values": "0"
      },
      {
        "data_type": "numeric",
        "index": "68",
        "is_ignore": "false",
        "is_row_identifier": "false",
        "is_target": "false",
        "name": "SM07_AEA.ri.",
        "number_of_missing_values": "0"
      },
      {
        "data_type": "numeric",
        "index": "69",
        "is_ignore": "false",
        "is_row_identifier": "false",
        "is_target": "true",
        "name": "pXC50",
        "number_of_missing_values": "0"
      }
    ]
  }
}