"molecule_id","AMW","H.","pXC50"
{1 6.194,2 55.6,3 7.252}
{0 CHEMBL1760545,1 7.028,2 50.9,3 8.125}
{0 CHEMBL1788113,1 6.009,2 56.6,3 8.42}
{0 CHEMBL18028,1 6.009,2 56.6,3 8.339}
{0 CHEMBL2332557,1 6.572,2 52.1,3 4.684}
{0 CHEMBL2332558,1 6.572,2 52.1,3 4.753}
{0 CHEMBL2332559,1 6.572,2 52.1,3 4.745}
{0 CHEMBL2332560,1 6.572,2 52.1,3 4.929}
{0 CHEMBL2332561,1 8.857,2 40,3 5.932}
{0 CHEMBL2332562,1 8.857,2 40,3 6.398}
{0 CHEMBL2332566,1 7.709,2 43.3,3 4.523}
{0 CHEMBL2332567,1 6.572,2 52.1,3 5.81}
