{
  "data_set_description": {
    "collection_date": "November 2013",
    "creator": "Dr Jeremy Besnard, Dr Ivan Olier, Dr Noureddin Sadawi, Dr Larisa Soldatova, Dr Crina Grosan, Prof Ross King, Dr Richard Bickerton, Prof Andrew Hopkins and Dr Willem van Hoorn",
    "default_target_attribute": "pXC50",
    "description": "This dataset contains QSAR data (from ChEMBL version 17) showing activity values (unit is pseudo-pCI50) of several compounds on drug target ChEMBL_ID: CHEMBL4167 (TID: 100599), and it has 28 rows and 1131 features (not including molecule IDs and class feature: molecule_id and pXC50). The features represent Molecular Descriptors which were generated from SMILES strings. Missing value imputation was applied to this dataset (By choosing the Median).",
    "description_version": "1",
    "file_id": "3462722",
    "format": "ARFF",
    "id": "31872",
    "licence": "Public",
    "md5_checksum": "2ee465c85dbe53e01c041aebbbc443a6",
    "minio_url": "https://data.openml.org/datasets/0003/31872/dataset_31872.pq",
    "name": "QSAR-DATASET-FOR-DRUG-TARGET-CHEMBL4167",
    "original_data_url": "https://www.ebi.ac.uk/chembl/target/inspect/CHEMBL4167",
    "parquet_url": "https://data.openml.org/datasets/0003/31872/dataset_31872.pq",
    "processing_date": "2018-10-04 02:51:30",
    "row_id_attribute": "molecule_id",
    "status": "deactivated",
    "tag": [
      "MetaQSAR",
      "study_13"
    ],
    "upload_date": "2016-07-15T08:43:22",
    "url": "https://api.openml.org/data/v1/download/3462722/QSAR-DATASET-FOR-DRUG-TARGET-CHEMBL4167.arff",
    "version": "10",
    "visibility": "public"
  }
}